You are viewing a plain text version of this content. The canonical link for it is here.
Posted to commits@tomee.apache.org by Apache Jenkins Server <je...@builds.apache.org> on 2023/10/26 14:50:00 UTC

Build failed in Jenkins: TomEE » tomee-8.x-build-full-java8 #237

See <https://ci-builds.apache.org/job/Tomee/job/tomee-8.x-build-full-java8/237/display/redirect?page=changes>

Changes:

[exabrial] Close #TOMEE-4262: Upgrade EclipseLink to 2.7.13 from 2.7.12

[github] Minor: Regenerated BOMs for 22325f92c43db34760011cd801a823930a12c1ee


------------------------------------------
[...truncated 6.21 MB...]
[INFO] TomEE :: Connector Examples :: Connector in EAR :: API 8.0.16-SNAPSHOT SUCCESS [  3.285 s]
[INFO] TomEE :: Connector Examples :: Connector in EAR :: Connector Impl 8.0.16-SNAPSHOT SUCCESS [  0.315 s]
[INFO] TomEE :: Connector Examples :: Connector in EAR :: RAR Packaging 8.0.16-SNAPSHOT SUCCESS [  1.546 s]
[INFO] TomEE :: Connector Examples :: Connector in EAR :: Sample WAR 8.0.16-SNAPSHOT SUCCESS [  0.734 s]
[INFO] TomEE :: Connector Examples :: Connector in EAR :: EAR Packaging 8.0.16-SNAPSHOT SUCCESS [  1.191 s]
[INFO] TomEE :: Connector Examples :: Connector in EAR :: Functional Tests 8.0.16-SNAPSHOT SKIPPED
[INFO] TomEE :: Connector Examples :: Connector in WAR 8.0.16-SNAPSHOT SKIPPED
[INFO] TomEE :: Examples :: Cucumber JVM 8.0.16-SNAPSHOT .. SKIPPED
[INFO] TomEE :: Examples :: Expanded support for Env Entries 8.0.16-SNAPSHOT SKIPPED
[INFO] TomEE :: Examples :: Datasource Ciphered Password 8.0.16-SNAPSHOT SKIPPED
[INFO] TomEE :: Examples :: Datasource Definition 8.0.16-SNAPSHOT SKIPPED
[INFO] TomEE :: Examples :: Datasource Versioning 8.0.16-SNAPSHOT SKIPPED
[INFO] TomEE :: Examples :: Decorators 8.0.16-SNAPSHOT .... SKIPPED
[INFO] TomEE :: Arquillian Adaptors Parent :: OpenEJB Container 8.0.16-SNAPSHOT SKIPPED
[INFO] TomEE :: Examples :: DeltaSpike @ConfigProperty 8.0.16-SNAPSHOT SKIPPED
[INFO] TomEE :: Examples :: DeltaSpike Exception Handling 8.0.16-SNAPSHOT SKIPPED
[INFO] TomEE :: Examples :: JSF2/CDI/BV/JPA/DeltaSpike 8.0.16-SNAPSHOT SKIPPED
[INFO] TomEE :: Examples :: DeltaSpike I18n 8.0.16-SNAPSHOT SKIPPED
[INFO] TomEE :: Examples :: Dynamic DAO Implementation 8.0.16-SNAPSHOT SKIPPED
[INFO] TomEE :: Examples :: Dynamic Datasource Routing 8.0.16-SNAPSHOT SKIPPED
[INFO] TomEE :: Examples :: Dynamic Implementation 8.0.16-SNAPSHOT SKIPPED
[INFO] TomEE :: Examples :: Dynamic MBean Proxy 8.0.16-SNAPSHOT SKIPPED
[INFO] TomEE :: Examples :: Ear Testing 8.0.16-SNAPSHOT ... SUCCESS [  0.186 s]
[INFO] TomEE :: Examples :: Ear Testing :: Business Model 8.0.16-SNAPSHOT SUCCESS [  2.706 s]
[INFO] TomEE :: Examples :: Ear Testing :: Business Logic 8.0.16-SNAPSHOT SKIPPED
[INFO] TomEE :: Web Examples :: EJB Examples War 8.0.16-SNAPSHOT SKIPPED
[INFO] TomEE :: Web Examples :: EJB Remote Call 8.0.16-SNAPSHOT SKIPPED
[INFO] TomEE :: Web Examples :: EJB Remote Call 8.0.16-SNAPSHOT SKIPPED
[INFO] TomEE :: Web Examples :: EJB WebService 8.0.16-SNAPSHOT SUCCESS [  0.511 s]
[INFO] TomEE :: Examples :: Filter with CDI 8.0.16-SNAPSHOT SKIPPED
[INFO] TomEE :: Examples :: Groovy CDI 8.0.16-SNAPSHOT .... SKIPPED
[INFO] TomEE :: Examples :: Groovy JPA 8.0.16-SNAPSHOT .... SKIPPED
[INFO] TomEE :: Examples :: Groovy Spock 8.0.16-SNAPSHOT .. SKIPPED
[INFO] TomEE :: Examples :: Hello World - Weblogic 8.0.16-SNAPSHOT SKIPPED
[INFO] TomEE :: Examples :: @Resource javax.jms.ConnectionFactory 8.0.16-SNAPSHOT SKIPPED
[INFO] TomEE :: Examples :: @Resource DataSource Injection 8.0.16-SNAPSHOT SKIPPED
[INFO] TomEE :: Examples :: @EJB Injection 8.0.16-SNAPSHOT  SKIPPED
[INFO] TomEE :: Examples :: @PersistenceContext EntityManager Injection 8.0.16-SNAPSHOT SKIPPED
[INFO] TomEE :: Examples :: @Resource env-entry Injection 8.0.16-SNAPSHOT SKIPPED
[INFO] TomEE :: Examples :: Interceptors 8.0.16-SNAPSHOT .. SKIPPED
[INFO] TomEE :: Examples :: JavaMail API 8.0.16-SNAPSHOT .. SKIPPED
[INFO] TomEE :: Examples :: JavaMail API with Velocity 8.0.16-SNAPSHOT SKIPPED
[INFO] TomEE :: Web Examples :: Java Modules (Simple REST resource) 8.0.16-SNAPSHOT SKIPPED
[INFO] TomEE :: Examples :: JAXRS Filter 8.0.16-SNAPSHOT .. SUCCESS [  2.142 s]
[INFO] TomEE :: Examples :: JAXRS JSON Provider with Jettison 8.0.16-SNAPSHOT SKIPPED
[INFO] TomEE :: Examples :: JPA with EclipseLink 8.0.16-SNAPSHOT SKIPPED
[INFO] TomEE :: Utils :: Core Hibernate 8.0.16-SNAPSHOT ... SKIPPED
[INFO] TomEE :: Examples :: JPA with Hibernate 8.0.16-SNAPSHOT SKIPPED
[INFO] TomEE :: Examples :: JPA with Hibernate and arquillian 8.0.16-SNAPSHOT SKIPPED
[INFO] TomEE :: Examples :: JPA @Enumerated 8.0.16-SNAPSHOT SKIPPED
[INFO] TomEE :: Web Examples :: JSF - ManangedBean and EJB 8.0.16-SNAPSHOT SKIPPED
[INFO] TomEE :: Web Examples :: JSF - CDI and EJB 8.0.16-SNAPSHOT SUCCESS [  3.066 s]
[INFO] TomEE :: Examples :: JUnit 5 :: Application Composer 8.0.16-SNAPSHOT SKIPPED
[INFO] TomEE :: Examples :: JUnit 5 :: Multiple TomEE with Arquillian 8.0.16-SNAPSHOT SKIPPED
[INFO] TomEE :: Examples :: JUnit 5 :: Simple Websockets with Arquillian 8.0.16-SNAPSHOT SKIPPED
[INFO] TomEE :: Examples :: @EJB Lookup 8.0.16-SNAPSHOT ... SKIPPED
[INFO] TomEE :: Examples :: EJB Lookup with descriptor 8.0.16-SNAPSHOT SKIPPED
[INFO] TomEE :: Examples :: Movies Complete (Meta) 8.0.16-SNAPSHOT SKIPPED
[INFO] TomEE :: Examples :: Movies Complete 8.0.16-SNAPSHOT SKIPPED
[INFO] MicroProfile :: Examples :: Config 8.0.16-SNAPSHOT . SKIPPED
[INFO] MicroProfile :: Examples :: Config Source Database 8.0.16-SNAPSHOT SKIPPED
[INFO] TomEE :: Examples :: Microprofile Fault Tolerance :: Fallback 8.0.16-SNAPSHOT SKIPPED
[INFO] TomEE :: Examples :: Microprofile Fault Tolerance :: Retry 8.0.16-SNAPSHOT SKIPPED
[INFO] TomEE :: Examples :: Microprofile JSONB Configuration 8.0.16-SNAPSHOT SKIPPED
[INFO] Apache TomEE + MicroProfile JWT Bean Validation 8.0.16-SNAPSHOT SKIPPED
[INFO] Apache TomEE + MicroProfile JWT Bean Validation, Strongly-typed Annotations 8.0.16-SNAPSHOT SKIPPED
[INFO] TomEE :: Examples :: Microprofile Metrics Counted 8.0.16-SNAPSHOT SKIPPED
[INFO] TomEE :: Examples :: Microprofile Metrics Histogram 8.0.16-SNAPSHOT SKIPPED
[INFO] TomEE :: Examples :: Microprofile Metrics Timed 8.0.16-SNAPSHOT SKIPPED
[INFO] mp-metrics-gauge 8.0.16-SNAPSHOT ................... SKIPPED
[INFO] mp-metrics-metered 8.0.16-SNAPSHOT ................. SKIPPED
[INFO] mp-opentracing.traced 8.0.16-SNAPSHOT .............. SKIPPED
[INFO] TomEE :: Examples :: MP REST JWT 8.0.16-SNAPSHOT ... SKIPPED
[INFO] TomEE :: Examples :: MP REST JWT JWK 8.0.16-SNAPSHOT SKIPPED
[INFO] TomEE :: Examples :: MP REST JWT PRINCIPAL 8.0.16-SNAPSHOT SKIPPED
[INFO] TomEE :: Examples :: MP REST JWT Public Key 8.0.16-SNAPSHOT SKIPPED
[INFO] TomEE :: Utils :: Mockito 8.0.16-SNAPSHOT .......... SKIPPED
[INFO] TomEE :: Examples :: MTOM 8.0.16-SNAPSHOT .......... SKIPPED
[INFO] TomEE :: Examples :: Multiple JPA providers 8.0.16-SNAPSHOT SKIPPED
[INFO] TomEE :: Examples :: Multiple Arquillian Adapters 8.0.16-SNAPSHOT SKIPPED
[INFO] TomEE :: Examples :: Multiple TomEE with Arquillian 8.0.16-SNAPSHOT SKIPPED
[INFO] TomEE :: Examples :: JSF2/CDI/BV/JPA/CODI 8.0.16-SNAPSHOT SKIPPED
[INFO] TomEE :: Examples :: Persistence Fragment 8.0.16-SNAPSHOT SKIPPED
[INFO] TomEE :: Web Examples :: Pojo WS 8.0.16-SNAPSHOT ... SKIPPED
[INFO] TomEE :: Examples :: Polling 8.0.16-SNAPSHOT ....... SUCCESS [  0.091 s]
[INFO] TomEE :: Examples :: Polling :: Domain 8.0.16-SNAPSHOT SUCCESS [  6.595 s]
[INFO] TomEE :: Examples :: Polling :: Core 8.0.16-SNAPSHOT SKIPPED
[INFO] TomEE :: Examples :: Polling :: Web 8.0.16-SNAPSHOT  SKIPPED
[INFO] TomEE :: Examples :: Polling :: Client 8.0.16-SNAPSHOT SKIPPED
[INFO] TomEE :: Examples :: DeltaSpike ProjectStage 8.0.16-SNAPSHOT SKIPPED
[INFO] TomEE :: Examples :: Quartz 8.0.16-SNAPSHOT ........ SUCCESS [  0.143 s]
[INFO] TomEE :: Examples :: Quartz :: Quartz Resource Adapter 8.0.16-SNAPSHOT SKIPPED
[INFO] TomEE :: Examples :: Quartz :: Quartz Beans 8.0.16-SNAPSHOT SKIPPED
[INFO] TomEE :: Examples :: DataSource Realm 8.0.16-SNAPSHOT SKIPPED
[INFO] TomEE :: Examples :: Reloadable Persistence Unit Properties 8.0.16-SNAPSHOT SKIPPED
[INFO] TomEE :: Web Examples :: Resource Declared In A Webapp 8.0.16-SNAPSHOT SUCCESS [  0.718 s]
[INFO] TomEE :: Examples :: REST, Mockito and Application Composer 8.0.16-SNAPSHOT SKIPPED
[INFO] TomEE :: Examples :: REST and Application Composer 8.0.16-SNAPSHOT SKIPPED
[INFO] TomEE :: Examples :: REST CDI 8.0.16-SNAPSHOT ...... SKIPPED
[INFO] TomEE :: Examples :: JAXRS and JAAS 8.0.16-SNAPSHOT  SKIPPED
[INFO] TomEE :: Examples :: REST and EJB 8.0.16-SNAPSHOT .. SKIPPED
[INFO] TomEE :: Web Examples :: REST Example 8.0.16-SNAPSHOT SKIPPED
[INFO] TomEE :: Web Examples :: REST Example With Application 8.0.16-SNAPSHOT SUCCESS [  4.842 s]
[INFO] TomEE :: Web Examples :: REST SSE Example 8.0.16-SNAPSHOT SKIPPED
[INFO] TomEE :: Examples :: REST XML JSON 8.0.16-SNAPSHOT . SKIPPED
[INFO] TomEE :: Examples :: Basic Scala 8.0.16-SNAPSHOT ... SKIPPED
[INFO] TomEE :: Examples :: ScheduleExpression 8.0.16-SNAPSHOT SKIPPED
[INFO] TomEE :: Examples :: @Schedule Events 8.0.16-SNAPSHOT SKIPPED
[INFO] TomEE :: Examples :: @Schedule Methods (Meta) 8.0.16-SNAPSHOT SKIPPED
[INFO] TomEE :: Examples :: @Schedule Methods 8.0.16-SNAPSHOT SKIPPED
[INFO] TomEE :: Examples :: Server Events 8.0.16-SNAPSHOT . SKIPPED
[INFO] TomEE :: Examples :: Serverless Apache TomEE WebProfile 8.0.16-SNAPSHOT SKIPPED
[INFO] TomEE :: Examples :: Serverless Apache TomEE WebProfile 8.0.16-SNAPSHOT SKIPPED
[INFO] TomEE :: Examples :: Serverless Apache TomEE MicroProfile 8.0.16-SNAPSHOT SKIPPED
[INFO] TomEE :: Examples :: Serverless Apache TomEE Plume 8.0.16-SNAPSHOT SKIPPED
[INFO] TomEE :: Examples :: Serverless Apache TomEE Plus 8.0.16-SNAPSHOT SKIPPED
[INFO] TomEE :: Examples ::  Singleton startup ordering 8.0.16-SNAPSHOT SKIPPED
[INFO] TomEE :: Examples :: Simple CDI Interceptor 8.0.16-SNAPSHOT SKIPPED
[INFO] TomEE :: Examples :: Simple EAR 8.0.16-SNAPSHOT .... SUCCESS [  0.070 s]
[INFO] TomEE :: Examples :: Simple EAR :: Business Model 8.0.16-SNAPSHOT SUCCESS [  0.310 s]
[INFO] TomEE :: Examples :: Simple EAR :: Business Logic 8.0.16-SNAPSHOT SKIPPED
[INFO] TomEE :: Examples :: Simple EAR :: Webapp 8.0.16-SNAPSHOT SKIPPED
[INFO] TomEE :: Examples :: Simple EAR :: EAR Packaging 8.0.16-SNAPSHOT SKIPPED
[INFO] TomEE :: Examples :: Simple EAR :: Functional Tests 8.0.16-SNAPSHOT SKIPPED
[INFO] TomEE :: Examples :: Simple CMP2 Entity 8.0.16-SNAPSHOT SKIPPED
[INFO] TomEE :: Examples :: Simple JMS 8.0.16-SNAPSHOT .... SKIPPED
[INFO] TomEE :: Examples :: Simple JMS Context 8.0.16-SNAPSHOT SKIPPED
[INFO] TomEE :: Examples :: Simple MDB With a CDI Injection 8.0.16-SNAPSHOT SKIPPED
[INFO] TomEE :: Examples :: Simple MDB Example 8.0.16-SNAPSHOT SKIPPED
[INFO] TomEE :: Examples :: Simple MDB Using Deployment Descriptor Example 8.0.16-SNAPSHOT SKIPPED
[INFO] TomEE :: Examples :: Simple Remote tomcat-users.xml 8.0.16-SNAPSHOT SKIPPED
[INFO] TomEE :: Examples :: Simple REST 8.0.16-SNAPSHOT ... SKIPPED
[INFO] TomEE :: Examples :: Simple Singleton 8.0.16-SNAPSHOT SKIPPED
[INFO] TomEE :: Examples :: Simple Stateful Pojo 8.0.16-SNAPSHOT SKIPPED
[INFO] TomEE :: Examples :: Simple Stateful Pojo Callbacks 8.0.16-SNAPSHOT SKIPPED
[INFO] TomEE :: Examples :: Simple Stateless Pojo 8.0.16-SNAPSHOT SKIPPED
[INFO] TomEE :: Examples :: Simple Stateless Pojo Callbacks 8.0.16-SNAPSHOT SKIPPED
[INFO] TomEE :: Examples :: Simple Stateless With Deployment Descriptor 8.0.16-SNAPSHOT SKIPPED
[INFO] TomEE :: Examples :: Simple Webservice 8.0.16-SNAPSHOT SKIPPED
[INFO] TomEE :: Examples :: Simple Webservice Without Interface 8.0.16-SNAPSHOT SKIPPED
[INFO] OpenEJB :: Examples :: Async Servlet 8.0.16-SNAPSHOT SKIPPED
[INFO] TomEE :: Examples :: Spring Data 8.0.16-SNAPSHOT ... SKIPPED
[INFO] TomEE :: Examples :: Spring Data Meta 8.0.16-SNAPSHOT SKIPPED
[INFO] TomEE :: Web Examples :: Struts 8.0.16-SNAPSHOT .... SUCCESS [  2.523 s]
[INFO] TomEE :: Examples :: Telephone Stateful Pojo 8.0.16-SNAPSHOT SKIPPED
[INFO] TomEE :: Examples :: TestCase Injection 8.0.16-SNAPSHOT SKIPPED
[INFO] TomEE :: Examples :: Testing Security (Meta) 8.0.16-SNAPSHOT SKIPPED
[INFO] TomEE :: Examples :: Testing Security 8.0.16-SNAPSHOT SKIPPED
[INFO] TomEE :: Examples :: Testing Security 8.0.16-SNAPSHOT SKIPPED
[INFO] TomEE :: Examples :: Testing Security Service Provider 8.0.16-SNAPSHOT SKIPPED
[INFO] TomEE :: Examples :: Testing Security Script Service Provider 8.0.16-SNAPSHOT SKIPPED
[INFO] TomEE :: Examples :: Testing Transactions 8.0.16-SNAPSHOT SKIPPED
[INFO] TomEE :: Examples :: Testing Transactions BMT 8.0.16-SNAPSHOT SKIPPED
[INFO] TomEE :: Examples :: TomEE, Jersey, Eclipselink 8.0.16-SNAPSHOT SKIPPED
[INFO] TomEE :: TomEE :: IBM MQ AMQ Portability Examples :: MDB Example 1.0 SUCCESS [  1.690 s]
[INFO] TomEE :: Examples :: Transaction Rollback 8.0.16-SNAPSHOT SKIPPED
[INFO] TomEE :: Examples :: Troubleshooting 8.0.16-SNAPSHOT SKIPPED
[INFO] TomEE :: Examples :: Webservice Attachments 8.0.16-SNAPSHOT SKIPPED
[INFO] TomEE :: Examples :: Webservice Inheritance 8.0.16-SNAPSHOT SKIPPED
[INFO] TomEE :: Web Examples :: EJB WebService with Security 8.0.16-SNAPSHOT SKIPPED
[INFO] TomEE :: Web Examples :: EJB WebService with SSL Client Certificate 8.0.16-SNAPSHOT SKIPPED
[INFO] TomEE :: Web Examples :: EJB WebService with WS-Security 8.0.16-SNAPSHOT SKIPPED
[INFO] TomEE :: Web Examples :: EJB WebService WS Security with resources.xml 8.0.16-SNAPSHOT SKIPPED
[INFO] TomEE :: Examples :: Web Service Handlers 8.0.16-SNAPSHOT SKIPPED
[INFO] TomEE :: Examples :: @WebService Holder 8.0.16-SNAPSHOT SKIPPED
[INFO] TomEE :: Web Examples :: Moviefun 8.0.16-SNAPSHOT .. SKIPPED
[INFO] TomEE :: Web Examples :: Moviefun Rest 8.0.16-SNAPSHOT SKIPPED
[INFO] TomEE :: Utils :: Provisionning 8.0.16-SNAPSHOT .... SKIPPED
[INFO] TomEE :: Examples :: Resources/JMX Example 8.0.16-SNAPSHOT SUCCESS [  0.281 s]
[INFO] TomEE :: Examples :: Resources/JMX Example :: EJB Module 8.0.16-SNAPSHOT SKIPPED
[INFO] TomEE :: Examples :: Resources/JMX Example :: EAR Module 8.0.16-SNAPSHOT SKIPPED
[INFO] TomEE :: Examples :: WebSocket with tls and basic auth Example 8.0.16-SNAPSHOT SKIPPED
[INFO] TomEE :: Examples :: Concurrency utilities example 8.0.16-SNAPSHOT SKIPPED
[INFO] TomEE :: Examples :: MVC (CXF-based) 8.0.16-SNAPSHOT SKIPPED
[INFO] TomEE :: Examples :: MVC (CXF-based) with Hibernate 8.0.16-SNAPSHOT SKIPPED
[INFO] TomEE :: Examples :: Microprofile REST Client 8.0.16-SNAPSHOT SKIPPED
[INFO] TomEE :: Examples :: MVC (RestEasy-based) 8.0.16-SNAPSHOT SKIPPED
[INFO] TomEE :: Examples :: Custom HealthCheck 8.0.16-SNAPSHOT SKIPPED
[INFO] TomEE :: Examples :: Microprofile JSONB Configuration 8.0.16-SNAPSHOT SKIPPED
[INFO] TomEE :: Examples :: Microprofile JSONB Custom Serializer/Deserializer 8.0.16-SNAPSHOT SKIPPED
[INFO] TomEE :: Examples :: Vaadin LTS V08 8.0.16-SNAPSHOT  SKIPPED
[INFO] TomEE :: Examples :: Vaadin LTS V10 8.0.16-SNAPSHOT  SKIPPED
[INFO] TomEE :: Examples :: Vaadin LATEST 8.0.16-SNAPSHOT . SKIPPED
[INFO] TomEE :: Examples :: Azure deployment example 8.0.16-SNAPSHOT SKIPPED
[INFO] TomEE :: Examples :: Microprofile Fault Tolerance :: Timeout 8.0.16-SNAPSHOT SKIPPED
[INFO] TomEE :: Examples :: XA Datasource configuration and usage 8.0.16-SNAPSHOT SKIPPED
[INFO] TomEE :: Examples :: Websocket JMS 8.0.16-SNAPSHOT . SKIPPED
[INFO] TomEE :: Examples :: Properties Provider 8.0.16-SNAPSHOT SUCCESS [  0.137 s]
[INFO] TomEE :: Examples :: Properties Provider :: Implementation 8.0.16-SNAPSHOT SKIPPED
[INFO] TomEE :: Examples :: Properties Provider :: Sample Webapp 8.0.16-SNAPSHOT SKIPPED
[INFO] TomEE :: Examples :: Jakarta Security tomcat-user.xml Identity Store 8.0.16-SNAPSHOT SKIPPED
[INFO] TomEE :: Examples :: Jakarta Security custom Identity Store 8.0.16-SNAPSHOT SKIPPED
[INFO] TomEE :: Examples 8.0.16-SNAPSHOT .................. SUCCESS [  0.810 s]
[INFO] TomEE :: Assembly :: All In One EJB Lite jar 8.0.16-SNAPSHOT SKIPPED
[INFO] TomEE :: Utils :: TomEE Webapps-based Deployer EJB 8.0.16-SNAPSHOT SKIPPED
[INFO] TomEE :: TCK 8.0.16-SNAPSHOT ....................... SUCCESS [  0.143 s]
[INFO] TomEE :: TCK :: Common 8.0.16-SNAPSHOT ............. SKIPPED
[INFO] TomEE :: TCK :: CDI Embedded 8.0.16-SNAPSHOT ....... SKIPPED
[INFO] TomEE :: TCK :: CDI TomEE 8.0.16-SNAPSHOT .......... SKIPPED
[INFO] TomEE :: TCK :: CDI TCK Signature Tests 8.0.16-SNAPSHOT SUCCESS [ 10.978 s]
[INFO] TomEE :: TCK :: Bean Validation Embedded 8.0.16-SNAPSHOT SKIPPED
[INFO] TomEE :: TCK :: Bean Validation TomEE 8.0.16-SNAPSHOT SKIPPED
[INFO] TomEE :: TCK :: Bean Validation TCK Signature tests 8.0.16-SNAPSHOT SKIPPED
[INFO] TomEE :: TCK :: MicroProfile 8.0.16-SNAPSHOT ....... SUCCESS [  0.147 s]
[INFO] TomEE :: TCK :: MicroProfile Config TCK 8.0.16-SNAPSHOT SKIPPED
[INFO] TomEE :: TCK :: MicroProfile JWT TCK 8.0.16-SNAPSHOT SKIPPED
[INFO] TomEE :: TCK :: MicroProfile Fault Tolerance TCK 8.0.16-SNAPSHOT SKIPPED
[INFO] TomEE :: TCK :: MicroProfile Health TCK 8.0.16-SNAPSHOT SKIPPED
[INFO] TomEE :: TCK :: MicroProfile Metrics TCK 8.0.16-SNAPSHOT SKIPPED
[INFO] TomEE :: TCK :: MicroProfile Rest Client TCK 8.0.16-SNAPSHOT SKIPPED
[INFO] TomEE :: TCK :: MicroProfile Open API TCK 8.0.16-SNAPSHOT SKIPPED
[INFO] TomEE :: TCK :: MicroProfile Open Tracing TCK 8.0.16-SNAPSHOT SKIPPED
[INFO] TomEE :: Arquillian Adaptors Parent :: Webapp Remote 8.0.16-SNAPSHOT SKIPPED
[INFO] TomEE :: Arquillian Adaptors Parent :: Tests 8.0.16-SNAPSHOT SKIPPED
[INFO] TomEE :: Arquillian Adaptors Parent :: Tests :: Web Profile 8.0.16-SNAPSHOT SKIPPED
[INFO] TomEE :: Arquillian Adaptors Parent :: Tests :: JAXRS 8.0.16-SNAPSHOT SKIPPED
[INFO] TomEE :: Arquillian Adaptors Parent :: Tests :: JAXWS 8.0.16-SNAPSHOT SKIPPED
[INFO] TomEE :: Arquillian Adaptors Parent :: Tests :: JMS 8.0.16-SNAPSHOT SKIPPED
[INFO] TomEE :: Arquillian Adaptors Parent :: Tests :: CODI 8.0.16-SNAPSHOT SKIPPED
[INFO] TomEE :: Arquillian Adaptors Parent :: Tests :: Configuration Tests 8.0.16-SNAPSHOT SKIPPED
[INFO] TomEE :: Arquillian Adaptors Parent :: Sample :: Moviefun 8.0.16-SNAPSHOT SKIPPED
[INFO] TomEE :: Arquillian Adaptors Parent :: Arquillian TCK 8.0.16-SNAPSHOT SKIPPED
[INFO] TomEE :: Utils :: Log4j2 8.0.16-SNAPSHOT ........... SKIPPED
[INFO] TomEE :: TomEE :: webaccess 8.0.16-SNAPSHOT ........ SKIPPED
[INFO] TomEE :: TomEE :: Overlay Runner 8.0.16-SNAPSHOT ... SKIPPED
[INFO] ------------------------------------------------------------------------
[INFO] BUILD FAILURE
[INFO] ------------------------------------------------------------------------
[INFO] Total time:  36:49 min
[INFO] Finished at: 2023-10-26T14:49:44Z
[INFO] ------------------------------------------------------------------------
[ERROR] Failed to execute goal org.apache.maven.plugins:maven-surefire-plugin:3.0.0-M5:test (default-test) on project openejb-core: There are test failures.
[ERROR] 
[ERROR] Please refer to <https://ci-builds.apache.org/job/Tomee/job/tomee-8.x-build-full-java8/ws/container/openejb-core/target/surefire-reports> for the individual test results.
[ERROR] Please refer to dump files (if any exist) [date].dump, [date]-jvmRun[N].dump and [date].dumpstream.
[ERROR] -> [Help 1]
[ERROR] 
[ERROR] To see the full stack trace of the errors, re-run Maven with the -e switch.
[ERROR] Re-run Maven using the -X switch to enable full debug logging.
[ERROR] 
[ERROR] For more information about the errors and possible solutions, please read the following articles:
[ERROR] [Help 1] http://cwiki.apache.org/confluence/display/MAVEN/MojoFailureException
[ERROR] 
[ERROR] After correcting the problems, you can resume the build with the command
[ERROR]   mvn <args> -rf :openejb-core
Build step 'Invoke top-level Maven targets' marked build as failure
INFO: Processing JUnit
INFO: [JUnit] - 495 test report file(s) were found with the pattern '**/target/surefire-reports/TEST-*.xml' relative to '<https://ci-builds.apache.org/job/Tomee/job/tomee-8.x-build-full-java8/ws/'> for the testing framework 'JUnit'.
INFO: Setting the build status to SUCCESS

Jenkins build is back to normal : TomEE » tomee-8.x-build-full-java8 #239

Posted by Apache Jenkins Server <je...@builds.apache.org>.
See <https://ci-builds.apache.org/job/Tomee/job/tomee-8.x-build-full-java8/239/display/redirect?page=changes>


Build failed in Jenkins: TomEE » tomee-8.x-build-full-java8 #238

Posted by Apache Jenkins Server <je...@builds.apache.org>.
See <https://ci-builds.apache.org/job/Tomee/job/tomee-8.x-build-full-java8/238/display/redirect>

Changes:


------------------------------------------
[...truncated 68.09 MB...]
[INFO] TomEE :: Examples :: JUnit 5 :: Application Composer 8.0.16-SNAPSHOT SUCCESS [  6.248 s]
[INFO] TomEE :: Examples :: JUnit 5 :: Multiple TomEE with Arquillian 8.0.16-SNAPSHOT SUCCESS [ 12.031 s]
[INFO] TomEE :: Examples :: JUnit 5 :: Simple Websockets with Arquillian 8.0.16-SNAPSHOT SUCCESS [  9.593 s]
[INFO] TomEE :: Examples :: @EJB Lookup 8.0.16-SNAPSHOT ... SUCCESS [  2.324 s]
[INFO] TomEE :: Examples :: EJB Lookup with descriptor 8.0.16-SNAPSHOT SUCCESS [  2.308 s]
[INFO] TomEE :: Examples :: Movies Complete (Meta) 8.0.16-SNAPSHOT SUCCESS [  5.448 s]
[INFO] TomEE :: Examples :: Movies Complete 8.0.16-SNAPSHOT SUCCESS [  5.275 s]
[INFO] MicroProfile :: Examples :: Config 8.0.16-SNAPSHOT . SUCCESS [ 11.899 s]
[INFO] MicroProfile :: Examples :: Config Source Database 8.0.16-SNAPSHOT SUCCESS [ 14.333 s]
[INFO] TomEE :: Examples :: Microprofile Fault Tolerance :: Fallback 8.0.16-SNAPSHOT SUCCESS [ 12.848 s]
[INFO] TomEE :: Examples :: Microprofile Fault Tolerance :: Retry 8.0.16-SNAPSHOT SUCCESS [ 14.700 s]
[INFO] TomEE :: Examples :: Microprofile JSONB Configuration 8.0.16-SNAPSHOT SUCCESS [  4.355 s]
[INFO] Apache TomEE + MicroProfile JWT Bean Validation 8.0.16-SNAPSHOT SUCCESS [ 13.458 s]
[INFO] Apache TomEE + MicroProfile JWT Bean Validation, Strongly-typed Annotations 8.0.16-SNAPSHOT SUCCESS [ 12.557 s]
[INFO] TomEE :: Examples :: Microprofile Metrics Counted 8.0.16-SNAPSHOT SUCCESS [ 10.916 s]
[INFO] TomEE :: Examples :: Microprofile Metrics Histogram 8.0.16-SNAPSHOT SUCCESS [ 11.298 s]
[INFO] TomEE :: Examples :: Microprofile Metrics Timed 8.0.16-SNAPSHOT SUCCESS [ 11.767 s]
[INFO] mp-metrics-gauge 8.0.16-SNAPSHOT ................... SUCCESS [ 12.340 s]
[INFO] mp-metrics-metered 8.0.16-SNAPSHOT ................. SUCCESS [  0.307 s]
[INFO] mp-opentracing.traced 8.0.16-SNAPSHOT .............. SUCCESS [  0.129 s]
[INFO] TomEE :: Examples :: MP REST JWT 8.0.16-SNAPSHOT ... SUCCESS [ 12.053 s]
[INFO] TomEE :: Examples :: MP REST JWT JWK 8.0.16-SNAPSHOT SUCCESS [ 13.733 s]
[INFO] TomEE :: Examples :: MP REST JWT PRINCIPAL 8.0.16-SNAPSHOT SUCCESS [ 16.406 s]
[INFO] TomEE :: Examples :: MP REST JWT Public Key 8.0.16-SNAPSHOT SUCCESS [ 12.707 s]
[INFO] TomEE :: Utils :: Mockito 8.0.16-SNAPSHOT .......... SUCCESS [  9.211 s]
[INFO] TomEE :: Examples :: MTOM 8.0.16-SNAPSHOT .......... SUCCESS [  6.213 s]
[INFO] TomEE :: Examples :: Multiple JPA providers 8.0.16-SNAPSHOT SUCCESS [ 12.207 s]
[INFO] TomEE :: Examples :: Multiple Arquillian Adapters 8.0.16-SNAPSHOT SUCCESS [ 26.556 s]
[INFO] TomEE :: Examples :: Multiple TomEE with Arquillian 8.0.16-SNAPSHOT SUCCESS [ 10.307 s]
[INFO] TomEE :: Examples :: JSF2/CDI/BV/JPA/CODI 8.0.16-SNAPSHOT SUCCESS [  1.458 s]
[INFO] TomEE :: Examples :: Persistence Fragment 8.0.16-SNAPSHOT SUCCESS [  3.133 s]
[INFO] TomEE :: Web Examples :: Pojo WS 8.0.16-SNAPSHOT ... SUCCESS [  0.132 s]
[INFO] TomEE :: Examples :: Polling 8.0.16-SNAPSHOT ....... SUCCESS [  0.120 s]
[INFO] TomEE :: Examples :: Polling :: Domain 8.0.16-SNAPSHOT SUCCESS [  1.044 s]
[INFO] TomEE :: Examples :: Polling :: Core 8.0.16-SNAPSHOT SUCCESS [  6.927 s]
[INFO] TomEE :: Examples :: Polling :: Web 8.0.16-SNAPSHOT  SUCCESS [ 21.608 s]
[INFO] TomEE :: Examples :: Polling :: Client 8.0.16-SNAPSHOT SUCCESS [  1.145 s]
[INFO] TomEE :: Examples :: DeltaSpike ProjectStage 8.0.16-SNAPSHOT SUCCESS [ 16.985 s]
[INFO] TomEE :: Examples :: Quartz 8.0.16-SNAPSHOT ........ SUCCESS [  0.074 s]
[INFO] TomEE :: Examples :: Quartz :: Quartz Resource Adapter 8.0.16-SNAPSHOT SUCCESS [  0.349 s]
[INFO] TomEE :: Examples :: Quartz :: Quartz Beans 8.0.16-SNAPSHOT SUCCESS [  8.533 s]
[INFO] TomEE :: Examples :: DataSource Realm 8.0.16-SNAPSHOT SUCCESS [  0.115 s]
[INFO] TomEE :: Examples :: Reloadable Persistence Unit Properties 8.0.16-SNAPSHOT SUCCESS [  5.510 s]
[INFO] TomEE :: Web Examples :: Resource Declared In A Webapp 8.0.16-SNAPSHOT SUCCESS [  0.166 s]
[INFO] TomEE :: Examples :: REST, Mockito and Application Composer 8.0.16-SNAPSHOT SUCCESS [  4.091 s]
[INFO] TomEE :: Examples :: REST and Application Composer 8.0.16-SNAPSHOT SUCCESS [  3.168 s]
[INFO] TomEE :: Examples :: REST CDI 8.0.16-SNAPSHOT ...... SUCCESS [  4.764 s]
[INFO] TomEE :: Examples :: JAXRS and JAAS 8.0.16-SNAPSHOT  SUCCESS [  0.144 s]
[INFO] TomEE :: Examples :: REST and EJB 8.0.16-SNAPSHOT .. SUCCESS [  6.615 s]
[INFO] TomEE :: Web Examples :: REST Example 8.0.16-SNAPSHOT SUCCESS [ 17.138 s]
[INFO] TomEE :: Web Examples :: REST Example With Application 8.0.16-SNAPSHOT SUCCESS [  0.800 s]
[INFO] TomEE :: Web Examples :: REST SSE Example 8.0.16-SNAPSHOT SUCCESS [  0.369 s]
[INFO] TomEE :: Examples :: REST XML JSON 8.0.16-SNAPSHOT . SUCCESS [  4.542 s]
[INFO] TomEE :: Examples :: Basic Scala 8.0.16-SNAPSHOT ... SUCCESS [ 23.928 s]
[INFO] TomEE :: Examples :: ScheduleExpression 8.0.16-SNAPSHOT SUCCESS [  7.424 s]
[INFO] TomEE :: Examples :: @Schedule Events 8.0.16-SNAPSHOT SUCCESS [ 15.807 s]
[INFO] TomEE :: Examples :: @Schedule Methods (Meta) 8.0.16-SNAPSHOT SUCCESS [  7.599 s]
[INFO] TomEE :: Examples :: @Schedule Methods 8.0.16-SNAPSHOT SUCCESS [  7.457 s]
[INFO] TomEE :: Examples :: Server Events 8.0.16-SNAPSHOT . SUCCESS [  3.308 s]
[INFO] TomEE :: Examples :: Serverless Apache TomEE WebProfile 8.0.16-SNAPSHOT SUCCESS [  6.225 s]
[INFO] TomEE :: Examples :: Serverless Apache TomEE WebProfile 8.0.16-SNAPSHOT SUCCESS [  6.058 s]
[INFO] TomEE :: Examples :: Serverless Apache TomEE MicroProfile 8.0.16-SNAPSHOT SUCCESS [  8.041 s]
[INFO] TomEE :: Examples :: Serverless Apache TomEE Plume 8.0.16-SNAPSHOT SUCCESS [  5.990 s]
[INFO] TomEE :: Examples :: Serverless Apache TomEE Plus 8.0.16-SNAPSHOT SUCCESS [  7.515 s]
[INFO] TomEE :: Examples ::  Singleton startup ordering 8.0.16-SNAPSHOT SUCCESS [ 10.790 s]
[INFO] TomEE :: Examples :: Simple CDI Interceptor 8.0.16-SNAPSHOT SUCCESS [  2.590 s]
[INFO] TomEE :: Examples :: Simple EAR 8.0.16-SNAPSHOT .... SUCCESS [  0.102 s]
[INFO] TomEE :: Examples :: Simple EAR :: Business Model 8.0.16-SNAPSHOT SUCCESS [  0.371 s]
[INFO] TomEE :: Examples :: Simple EAR :: Business Logic 8.0.16-SNAPSHOT SUCCESS [  4.945 s]
[INFO] TomEE :: Examples :: Simple EAR :: Webapp 8.0.16-SNAPSHOT SUCCESS [  0.804 s]
[INFO] TomEE :: Examples :: Simple EAR :: EAR Packaging 8.0.16-SNAPSHOT SUCCESS [  0.129 s]
[INFO] TomEE :: Examples :: Simple EAR :: Functional Tests 8.0.16-SNAPSHOT SUCCESS [ 20.389 s]
[INFO] TomEE :: Examples :: Simple CMP2 Entity 8.0.16-SNAPSHOT SUCCESS [  4.608 s]
[INFO] TomEE :: Examples :: Simple JMS 8.0.16-SNAPSHOT .... SUCCESS [ 18.234 s]
[INFO] TomEE :: Examples :: Simple JMS Context 8.0.16-SNAPSHOT SUCCESS [ 18.380 s]
[INFO] TomEE :: Examples :: Simple MDB With a CDI Injection 8.0.16-SNAPSHOT SUCCESS [  5.733 s]
[INFO] TomEE :: Examples :: Simple MDB Example 8.0.16-SNAPSHOT SUCCESS [  5.509 s]
[INFO] TomEE :: Examples :: Simple MDB Using Deployment Descriptor Example 8.0.16-SNAPSHOT SUCCESS [  5.437 s]
[INFO] TomEE :: Examples :: Simple Remote tomcat-users.xml 8.0.16-SNAPSHOT SUCCESS [  7.383 s]
[INFO] TomEE :: Examples :: Simple REST 8.0.16-SNAPSHOT ... SUCCESS [  3.388 s]
[INFO] TomEE :: Examples :: Simple Singleton 8.0.16-SNAPSHOT SUCCESS [  2.578 s]
[INFO] TomEE :: Examples :: Simple Stateful Pojo 8.0.16-SNAPSHOT SUCCESS [  2.423 s]
[INFO] TomEE :: Examples :: Simple Stateful Pojo Callbacks 8.0.16-SNAPSHOT FAILURE [  6.350 s]
[INFO] TomEE :: Examples :: Simple Stateless Pojo 8.0.16-SNAPSHOT SUCCESS [  2.229 s]
[INFO] TomEE :: Examples :: Simple Stateless Pojo Callbacks 8.0.16-SNAPSHOT SUCCESS [  2.247 s]
[INFO] TomEE :: Examples :: Simple Stateless With Deployment Descriptor 8.0.16-SNAPSHOT SUCCESS [  1.877 s]
[INFO] TomEE :: Examples :: Simple Webservice 8.0.16-SNAPSHOT SUCCESS [  6.743 s]
[INFO] TomEE :: Examples :: Simple Webservice Without Interface 8.0.16-SNAPSHOT SUCCESS [  5.952 s]
[INFO] OpenEJB :: Examples :: Async Servlet 8.0.16-SNAPSHOT SUCCESS [ 25.037 s]
[INFO] TomEE :: Examples :: Spring Data 8.0.16-SNAPSHOT ... SUCCESS [  6.988 s]
[INFO] TomEE :: Examples :: Spring Data Meta 8.0.16-SNAPSHOT SUCCESS [  5.695 s]
[INFO] TomEE :: Web Examples :: Struts 8.0.16-SNAPSHOT .... SUCCESS [  2.472 s]
[INFO] TomEE :: Examples :: Telephone Stateful Pojo 8.0.16-SNAPSHOT SUCCESS [  2.991 s]
[INFO] TomEE :: Examples :: TestCase Injection 8.0.16-SNAPSHOT SUCCESS [  4.833 s]
[INFO] TomEE :: Examples :: Testing Security (Meta) 8.0.16-SNAPSHOT SUCCESS [  5.350 s]
[INFO] TomEE :: Examples :: Testing Security 8.0.16-SNAPSHOT SUCCESS [  6.341 s]
[INFO] TomEE :: Examples :: Testing Security 8.0.16-SNAPSHOT SUCCESS [  6.057 s]
[INFO] TomEE :: Examples :: Testing Security Service Provider 8.0.16-SNAPSHOT SUCCESS [  6.116 s]
[INFO] TomEE :: Examples :: Testing Security Script Service Provider 8.0.16-SNAPSHOT SUCCESS [  6.816 s]
[INFO] TomEE :: Examples :: Testing Transactions 8.0.16-SNAPSHOT SUCCESS [  5.067 s]
[INFO] TomEE :: Examples :: Testing Transactions BMT 8.0.16-SNAPSHOT SUCCESS [  4.824 s]
[INFO] TomEE :: Examples :: TomEE, Jersey, Eclipselink 8.0.16-SNAPSHOT SUCCESS [ 13.749 s]
[INFO] TomEE :: TomEE :: IBM MQ AMQ Portability Examples :: MDB Example 1.0 SUCCESS [  1.419 s]
[INFO] TomEE :: Examples :: Transaction Rollback 8.0.16-SNAPSHOT SUCCESS [  6.779 s]
[INFO] TomEE :: Examples :: Troubleshooting 8.0.16-SNAPSHOT SUCCESS [  5.214 s]
[INFO] TomEE :: Examples :: Webservice Attachments 8.0.16-SNAPSHOT SUCCESS [  5.410 s]
[INFO] TomEE :: Examples :: Webservice Inheritance 8.0.16-SNAPSHOT SUCCESS [  8.966 s]
[INFO] TomEE :: Web Examples :: EJB WebService with Security 8.0.16-SNAPSHOT SUCCESS [  5.543 s]
[INFO] TomEE :: Web Examples :: EJB WebService with SSL Client Certificate 8.0.16-SNAPSHOT SUCCESS [ 21.063 s]
[INFO] TomEE :: Web Examples :: EJB WebService with WS-Security 8.0.16-SNAPSHOT SUCCESS [ 14.132 s]
[INFO] TomEE :: Web Examples :: EJB WebService WS Security with resources.xml 8.0.16-SNAPSHOT SUCCESS [  7.325 s]
[INFO] TomEE :: Examples :: Web Service Handlers 8.0.16-SNAPSHOT SUCCESS [  6.561 s]
[INFO] TomEE :: Examples :: @WebService Holder 8.0.16-SNAPSHOT SUCCESS [  6.237 s]
[INFO] TomEE :: Web Examples :: Moviefun 8.0.16-SNAPSHOT .. SUCCESS [ 50.902 s]
[INFO] TomEE :: Web Examples :: Moviefun Rest 8.0.16-SNAPSHOT SUCCESS [ 23.861 s]
[INFO] TomEE :: Utils :: Provisionning 8.0.16-SNAPSHOT .... SUCCESS [  3.020 s]
[INFO] TomEE :: Examples :: Resources/JMX Example 8.0.16-SNAPSHOT SUCCESS [  0.157 s]
[INFO] TomEE :: Examples :: Resources/JMX Example :: EJB Module 8.0.16-SNAPSHOT SUCCESS [ 13.249 s]
[INFO] TomEE :: Examples :: Resources/JMX Example :: EAR Module 8.0.16-SNAPSHOT SUCCESS [  1.452 s]
[INFO] TomEE :: Examples :: WebSocket with tls and basic auth Example 8.0.16-SNAPSHOT SUCCESS [  8.905 s]
[INFO] TomEE :: Examples :: Concurrency utilities example 8.0.16-SNAPSHOT SUCCESS [ 14.524 s]
[INFO] TomEE :: Examples :: MVC (CXF-based) 8.0.16-SNAPSHOT SUCCESS [01:01 min]
[INFO] TomEE :: Examples :: MVC (CXF-based) with Hibernate 8.0.16-SNAPSHOT SUCCESS [ 33.402 s]
[INFO] TomEE :: Examples :: Microprofile REST Client 8.0.16-SNAPSHOT SUCCESS [ 13.004 s]
[INFO] TomEE :: Examples :: MVC (RestEasy-based) 8.0.16-SNAPSHOT SUCCESS [ 22.315 s]
[INFO] TomEE :: Examples :: Custom HealthCheck 8.0.16-SNAPSHOT SUCCESS [ 11.563 s]
[INFO] TomEE :: Examples :: Microprofile JSONB Configuration 8.0.16-SNAPSHOT SUCCESS [  3.374 s]
[INFO] TomEE :: Examples :: Microprofile JSONB Custom Serializer/Deserializer 8.0.16-SNAPSHOT SUCCESS [  3.840 s]
[INFO] TomEE :: Examples :: Vaadin LTS V08 8.0.16-SNAPSHOT  SUCCESS [  5.741 s]
[INFO] TomEE :: Examples :: Vaadin LTS V10 8.0.16-SNAPSHOT  SUCCESS [ 11.443 s]
[INFO] TomEE :: Examples :: Vaadin LATEST 8.0.16-SNAPSHOT . SUCCESS [ 10.197 s]
[INFO] TomEE :: Examples :: Azure deployment example 8.0.16-SNAPSHOT SUCCESS [  7.383 s]
[INFO] TomEE :: Examples :: Microprofile Fault Tolerance :: Timeout 8.0.16-SNAPSHOT SUCCESS [ 11.375 s]
[INFO] TomEE :: Examples :: XA Datasource configuration and usage 8.0.16-SNAPSHOT SUCCESS [01:04 min]
[INFO] TomEE :: Examples :: Websocket JMS 8.0.16-SNAPSHOT . SUCCESS [ 10.267 s]
[INFO] TomEE :: Examples :: Properties Provider 8.0.16-SNAPSHOT SUCCESS [  0.151 s]
[INFO] TomEE :: Examples :: Properties Provider :: Implementation 8.0.16-SNAPSHOT SUCCESS [  0.169 s]
[INFO] TomEE :: Examples :: Properties Provider :: Sample Webapp 8.0.16-SNAPSHOT SUCCESS [  6.416 s]
[INFO] TomEE :: Examples :: Jakarta Security tomcat-user.xml Identity Store 8.0.16-SNAPSHOT SUCCESS [  8.794 s]
[INFO] TomEE :: Examples :: Jakarta Security custom Identity Store 8.0.16-SNAPSHOT SUCCESS [ 12.440 s]
[INFO] TomEE :: Examples 8.0.16-SNAPSHOT .................. SUCCESS [  0.571 s]
[INFO] TomEE :: Assembly :: All In One EJB Lite jar 8.0.16-SNAPSHOT SUCCESS [ 27.073 s]
[INFO] TomEE :: Utils :: TomEE Webapps-based Deployer EJB 8.0.16-SNAPSHOT SUCCESS [  0.826 s]
[INFO] TomEE :: TCK 8.0.16-SNAPSHOT ....................... SUCCESS [  0.115 s]
[INFO] TomEE :: TCK :: Common 8.0.16-SNAPSHOT ............. SUCCESS [  1.256 s]
[INFO] TomEE :: TCK :: CDI Embedded 8.0.16-SNAPSHOT ....... SUCCESS [04:30 min]
[INFO] TomEE :: TCK :: CDI TomEE 8.0.16-SNAPSHOT .......... SUCCESS [30:22 min]
[INFO] TomEE :: TCK :: CDI TCK Signature Tests 8.0.16-SNAPSHOT SUCCESS [  2.233 s]
[INFO] TomEE :: TCK :: Bean Validation Embedded 8.0.16-SNAPSHOT SUCCESS [01:15 min]
[INFO] TomEE :: TCK :: Bean Validation TomEE 8.0.16-SNAPSHOT SUCCESS [08:33 min]
[INFO] TomEE :: TCK :: Bean Validation TCK Signature tests 8.0.16-SNAPSHOT SUCCESS [  1.473 s]
[INFO] TomEE :: TCK :: MicroProfile 8.0.16-SNAPSHOT ....... SUCCESS [  0.077 s]
[INFO] TomEE :: TCK :: MicroProfile Config TCK 8.0.16-SNAPSHOT SUCCESS [03:15 min]
[INFO] TomEE :: TCK :: MicroProfile JWT TCK 8.0.16-SNAPSHOT SUCCESS [01:27 min]
[INFO] TomEE :: TCK :: MicroProfile Fault Tolerance TCK 8.0.16-SNAPSHOT SUCCESS [11:03 min]
[INFO] TomEE :: TCK :: MicroProfile Health TCK 8.0.16-SNAPSHOT SUCCESS [01:29 min]
[INFO] TomEE :: TCK :: MicroProfile Metrics TCK 8.0.16-SNAPSHOT SUCCESS [15:20 min]
[INFO] TomEE :: TCK :: MicroProfile Rest Client TCK 8.0.16-SNAPSHOT SUCCESS [12:33 min]
[INFO] TomEE :: TCK :: MicroProfile Open API TCK 8.0.16-SNAPSHOT SUCCESS [03:35 min]
[INFO] TomEE :: TCK :: MicroProfile Open Tracing TCK 8.0.16-SNAPSHOT SUCCESS [ 31.662 s]
[INFO] TomEE :: Arquillian Adaptors Parent :: Webapp Remote 8.0.16-SNAPSHOT SUCCESS [ 56.219 s]
[INFO] TomEE :: Arquillian Adaptors Parent :: Tests 8.0.16-SNAPSHOT SUCCESS [  3.857 s]
[INFO] TomEE :: Arquillian Adaptors Parent :: Tests :: Web Profile 8.0.16-SNAPSHOT SUCCESS [06:33 min]
[INFO] TomEE :: Arquillian Adaptors Parent :: Tests :: JAXRS 8.0.16-SNAPSHOT SUCCESS [02:36 min]
[INFO] TomEE :: Arquillian Adaptors Parent :: Tests :: JAXWS 8.0.16-SNAPSHOT FAILURE [ 20.620 s]
[INFO] TomEE :: Arquillian Adaptors Parent :: Tests :: JMS 8.0.16-SNAPSHOT SUCCESS [ 36.618 s]
[INFO] TomEE :: Arquillian Adaptors Parent :: Tests :: CODI 8.0.16-SNAPSHOT SUCCESS [ 55.477 s]
[INFO] TomEE :: Arquillian Adaptors Parent :: Tests :: Configuration Tests 8.0.16-SNAPSHOT SUCCESS [ 53.169 s]
[INFO] TomEE :: Arquillian Adaptors Parent :: Sample :: Moviefun 8.0.16-SNAPSHOT SUCCESS [ 35.948 s]
[INFO] TomEE :: Arquillian Adaptors Parent :: Arquillian TCK 8.0.16-SNAPSHOT SUCCESS [  1.064 s]
[INFO] TomEE :: Utils :: Log4j2 8.0.16-SNAPSHOT ........... SUCCESS [  0.764 s]
[INFO] TomEE :: TomEE :: webaccess 8.0.16-SNAPSHOT ........ SUCCESS [ 15.778 s]
[INFO] TomEE :: TomEE :: Overlay Runner 8.0.16-SNAPSHOT ... SUCCESS [  0.547 s]
[INFO] ------------------------------------------------------------------------
[INFO] BUILD FAILURE
[INFO] ------------------------------------------------------------------------
[INFO] Total time:  03:21 h
[INFO] Finished at: 2023-10-26T18:12:33Z
[INFO] ------------------------------------------------------------------------
[ERROR] Failed to execute goal org.apache.maven.plugins:maven-surefire-plugin:2.12.4:test (default-test) on project simple-stateful-callbacks: There are test failures.
[ERROR] 
[ERROR] Please refer to <https://ci-builds.apache.org/job/Tomee/job/tomee-8.x-build-full-java8/ws/examples/simple-stateful-callbacks/target/surefire-reports> for the individual test results.
[ERROR] -> [Help 1]
[ERROR] Failed to execute goal org.apache.maven.plugins:maven-surefire-plugin:3.0.0-M5:test (test-tomee-embedded) on project arquillian-tomee-jaxws-tests: There are test failures.
[ERROR] 
[ERROR] Please refer to <https://ci-builds.apache.org/job/Tomee/job/tomee-8.x-build-full-java8/ws/arquillian/arquillian-tomee-tests/arquillian-tomee-jaxws-tests/target/surefire-reports> for the individual test results.
[ERROR] Please refer to dump files (if any exist) [date].dump, [date]-jvmRun[N].dump and [date].dumpstream.
[ERROR] -> [Help 1]
[ERROR] 
[ERROR] To see the full stack trace of the errors, re-run Maven with the -e switch.
[ERROR] Re-run Maven using the -X switch to enable full debug logging.
[ERROR] 
[ERROR] For more information about the errors and possible solutions, please read the following articles:
[ERROR] [Help 1] http://cwiki.apache.org/confluence/display/MAVEN/MojoFailureException
[ERROR] 
[ERROR] After correcting the problems, you can resume the build with the command
[ERROR]   mvn <args> -rf :simple-stateful-callbacks
Build step 'Invoke top-level Maven targets' marked build as failure
INFO: Processing JUnit
INFO: [JUnit] - 1,351 test report file(s) were found with the pattern '**/target/surefire-reports/TEST-*.xml' relative to '<https://ci-builds.apache.org/job/Tomee/job/tomee-8.x-build-full-java8/ws/'> for the testing framework 'JUnit'.
WARNING: The file '<https://ci-builds.apache.org/job/Tomee/job/tomee-8.x-build-full-java8/ws/examples/scala-basic/target/surefire-reports/TEST-org.scalatest.tools.DiscoverySuite-50068d3e-15ee-4dab-baca-625f4c9c13c8.xml'> is an invalid file.
WARNING: At line 8 of <https://ci-builds.apache.org/job/Tomee/job/tomee-8.x-build-full-java8/ws/examples/scala-basic/target/surefire-reports/TEST-org.scalatest.tools.DiscoverySuite-50068d3e-15ee-4dab-baca-625f4c9c13c8.xml>:cvc-complex-type.2.1: Element 'property' must have no character or element information item [children], because the type's content type is empty.
WARNING: At line 14 of <https://ci-builds.apache.org/job/Tomee/job/tomee-8.x-build-full-java8/ws/examples/scala-basic/target/surefire-reports/TEST-org.scalatest.tools.DiscoverySuite-50068d3e-15ee-4dab-baca-625f4c9c13c8.xml>:cvc-complex-type.2.1: Element 'property' must have no character or element information item [children], because the type's content type is empty.
WARNING: At line 25 of <https://ci-builds.apache.org/job/Tomee/job/tomee-8.x-build-full-java8/ws/examples/scala-basic/target/surefire-reports/TEST-org.scalatest.tools.DiscoverySuite-50068d3e-15ee-4dab-baca-625f4c9c13c8.xml>:cvc-complex-type.2.1: Element 'property' must have no character or element information item [children], because the type's content type is empty.
WARNING: At line 28 of <https://ci-builds.apache.org/job/Tomee/job/tomee-8.x-build-full-java8/ws/examples/scala-basic/target/surefire-reports/TEST-org.scalatest.tools.DiscoverySuite-50068d3e-15ee-4dab-baca-625f4c9c13c8.xml>:cvc-complex-type.2.1: Element 'property' must have no character or element information item [children], because the type's content type is empty.
WARNING: At line 33 of <https://ci-builds.apache.org/job/Tomee/job/tomee-8.x-build-full-java8/ws/examples/scala-basic/target/surefire-reports/TEST-org.scalatest.tools.DiscoverySuite-50068d3e-15ee-4dab-baca-625f4c9c13c8.xml>:cvc-complex-type.2.1: Element 'property' must have no character or element information item [children], because the type's content type is empty.
WARNING: At line 36 of <https://ci-builds.apache.org/job/Tomee/job/tomee-8.x-build-full-java8/ws/examples/scala-basic/target/surefire-reports/TEST-org.scalatest.tools.DiscoverySuite-50068d3e-15ee-4dab-baca-625f4c9c13c8.xml>:cvc-complex-type.2.1: Element 'property' must have no character or element information item [children], because the type's content type is empty.
WARNING: At line 39 of <https://ci-builds.apache.org/job/Tomee/job/tomee-8.x-build-full-java8/ws/examples/scala-basic/target/surefire-reports/TEST-org.scalatest.tools.DiscoverySuite-50068d3e-15ee-4dab-baca-625f4c9c13c8.xml>:cvc-complex-type.2.1: Element 'property' must have no character or element information item [children], because the type's content type is empty.
WARNING: At line 47 of <https://ci-builds.apache.org/job/Tomee/job/tomee-8.x-build-full-java8/ws/examples/scala-basic/target/surefire-reports/TEST-org.scalatest.tools.DiscoverySuite-50068d3e-15ee-4dab-baca-625f4c9c13c8.xml>:cvc-complex-type.2.1: Element 'property' must have no character or element information item [children], because the type's content type is empty.
WARNING: At line 51 of <https://ci-builds.apache.org/job/Tomee/job/tomee-8.x-build-full-java8/ws/examples/scala-basic/target/surefire-reports/TEST-org.scalatest.tools.DiscoverySuite-50068d3e-15ee-4dab-baca-625f4c9c13c8.xml>:cvc-complex-type.2.1: Element 'property' must have no character or element information item [children], because the type's content type is empty.
WARNING: At line 55 of <https://ci-builds.apache.org/job/Tomee/job/tomee-8.x-build-full-java8/ws/examples/scala-basic/target/surefire-reports/TEST-org.scalatest.tools.DiscoverySuite-50068d3e-15ee-4dab-baca-625f4c9c13c8.xml>:cvc-complex-type.2.1: Element 'property' must have no character or element information item [children], because the type's content type is empty.
WARNING: At line 58 of <https://ci-builds.apache.org/job/Tomee/job/tomee-8.x-build-full-java8/ws/examples/scala-basic/target/surefire-reports/TEST-org.scalatest.tools.DiscoverySuite-50068d3e-15ee-4dab-baca-625f4c9c13c8.xml>:cvc-complex-type.2.1: Element 'property' must have no character or element information item [children], because the type's content type is empty.
WARNING: At line 62 of <https://ci-builds.apache.org/job/Tomee/job/tomee-8.x-build-full-java8/ws/examples/scala-basic/target/surefire-reports/TEST-org.scalatest.tools.DiscoverySuite-50068d3e-15ee-4dab-baca-625f4c9c13c8.xml>:cvc-complex-type.2.1: Element 'property' must have no character or element information item [children], because the type's content type is empty.
WARNING: At line 66 of <https://ci-builds.apache.org/job/Tomee/job/tomee-8.x-build-full-java8/ws/examples/scala-basic/target/surefire-reports/TEST-org.scalatest.tools.DiscoverySuite-50068d3e-15ee-4dab-baca-625f4c9c13c8.xml>:cvc-complex-type.2.1: Element 'property' must have no character or element information item [children], because the type's content type is empty.
WARNING: At line 74 of <https://ci-builds.apache.org/job/Tomee/job/tomee-8.x-build-full-java8/ws/examples/scala-basic/target/surefire-reports/TEST-org.scalatest.tools.DiscoverySuite-50068d3e-15ee-4dab-baca-625f4c9c13c8.xml>:cvc-complex-type.2.1: Element 'property' must have no character or element information item [children], because the type's content type is empty.
WARNING: At line 78 of <https://ci-builds.apache.org/job/Tomee/job/tomee-8.x-build-full-java8/ws/examples/scala-basic/target/surefire-reports/TEST-org.scalatest.tools.DiscoverySuite-50068d3e-15ee-4dab-baca-625f4c9c13c8.xml>:cvc-complex-type.2.1: Element 'property' must have no character or element information item [children], because the type's content type is empty.
WARNING: At line 83 of <https://ci-builds.apache.org/job/Tomee/job/tomee-8.x-build-full-java8/ws/examples/scala-basic/target/surefire-reports/TEST-org.scalatest.tools.DiscoverySuite-50068d3e-15ee-4dab-baca-625f4c9c13c8.xml>:cvc-complex-type.2.1: Element 'property' must have no character or element information item [children], because the type's content type is empty.
WARNING: At line 86 of <https://ci-builds.apache.org/job/Tomee/job/tomee-8.x-build-full-java8/ws/examples/scala-basic/target/surefire-reports/TEST-org.scalatest.tools.DiscoverySuite-50068d3e-15ee-4dab-baca-625f4c9c13c8.xml>:cvc-complex-type.2.1: Element 'property' must have no character or element information item [children], because the type's content type is empty.
WARNING: At line 94 of <https://ci-builds.apache.org/job/Tomee/job/tomee-8.x-build-full-java8/ws/examples/scala-basic/target/surefire-reports/TEST-org.scalatest.tools.DiscoverySuite-50068d3e-15ee-4dab-baca-625f4c9c13c8.xml>:cvc-complex-type.2.1: Element 'property' must have no character or element information item [children], because the type's content type is empty.
WARNING: At line 98 of <https://ci-builds.apache.org/job/Tomee/job/tomee-8.x-build-full-java8/ws/examples/scala-basic/target/surefire-reports/TEST-org.scalatest.tools.DiscoverySuite-50068d3e-15ee-4dab-baca-625f4c9c13c8.xml>:cvc-complex-type.2.1: Element 'property' must have no character or element information item [children], because the type's content type is empty.
WARNING: At line 103 of <https://ci-builds.apache.org/job/Tomee/job/tomee-8.x-build-full-java8/ws/examples/scala-basic/target/surefire-reports/TEST-org.scalatest.tools.DiscoverySuite-50068d3e-15ee-4dab-baca-625f4c9c13c8.xml>:cvc-complex-type.2.1: Element 'property' must have no character or element information item [children], because the type's content type is empty.
WARNING: At line 106 of <https://ci-builds.apache.org/job/Tomee/job/tomee-8.x-build-full-java8/ws/examples/scala-basic/target/surefire-reports/TEST-org.scalatest.tools.DiscoverySuite-50068d3e-15ee-4dab-baca-625f4c9c13c8.xml>:cvc-complex-type.2.1: Element 'property' must have no character or element information item [children], because the type's content type is empty.
WARNING: At line 110 of <https://ci-builds.apache.org/job/Tomee/job/tomee-8.x-build-full-java8/ws/examples/scala-basic/target/surefire-reports/TEST-org.scalatest.tools.DiscoverySuite-50068d3e-15ee-4dab-baca-625f4c9c13c8.xml>:cvc-complex-type.2.1: Element 'property' must have no character or element information item [children], because the type's content type is empty.
WARNING: The result file '<https://ci-builds.apache.org/job/Tomee/job/tomee-8.x-build-full-java8/ws/examples/scala-basic/target/surefire-reports/TEST-org.scalatest.tools.DiscoverySuite-50068d3e-15ee-4dab-baca-625f4c9c13c8.xml'> for the metric 'JUnit' is not valid. The result file has been skipped.
WARNING: The file '<https://ci-builds.apache.org/job/Tomee/job/tomee-8.x-build-full-java8/ws/examples/scala-basic/target/surefire-reports/TEST-org.superbiz.GreetingServiceTest.xml'> is an invalid file.
WARNING: At line 8 of <https://ci-builds.apache.org/job/Tomee/job/tomee-8.x-build-full-java8/ws/examples/scala-basic/target/surefire-reports/TEST-org.superbiz.GreetingServiceTest.xml>:cvc-complex-type.2.1: Element 'property' must have no character or element information item [children], because the type's content type is empty.
WARNING: At line 14 of <https://ci-builds.apache.org/job/Tomee/job/tomee-8.x-build-full-java8/ws/examples/scala-basic/target/surefire-reports/TEST-org.superbiz.GreetingServiceTest.xml>:cvc-complex-type.2.1: Element 'property' must have no character or element information item [children], because the type's content type is empty.
WARNING: At line 25 of <https://ci-builds.apache.org/job/Tomee/job/tomee-8.x-build-full-java8/ws/examples/scala-basic/target/surefire-reports/TEST-org.superbiz.GreetingServiceTest.xml>:cvc-complex-type.2.1: Element 'property' must have no character or element information item [children], because the type's content type is empty.
WARNING: At line 28 of <https://ci-builds.apache.org/job/Tomee/job/tomee-8.x-build-full-java8/ws/examples/scala-basic/target/surefire-reports/TEST-org.superbiz.GreetingServiceTest.xml>:cvc-complex-type.2.1: Element 'property' must have no character or element information item [children], because the type's content type is empty.
WARNING: At line 33 of <https://ci-builds.apache.org/job/Tomee/job/tomee-8.x-build-full-java8/ws/examples/scala-basic/target/surefire-reports/TEST-org.superbiz.GreetingServiceTest.xml>:cvc-complex-type.2.1: Element 'property' must have no character or element information item [children], because the type's content type is empty.
WARNING: At line 36 of <https://ci-builds.apache.org/job/Tomee/job/tomee-8.x-build-full-java8/ws/examples/scala-basic/target/surefire-reports/TEST-org.superbiz.GreetingServiceTest.xml>:cvc-complex-type.2.1: Element 'property' must have no character or element information item [children], because the type's content type is empty.
WARNING: At line 39 of <https://ci-builds.apache.org/job/Tomee/job/tomee-8.x-build-full-java8/ws/examples/scala-basic/target/surefire-reports/TEST-org.superbiz.GreetingServiceTest.xml>:cvc-complex-type.2.1: Element 'property' must have no character or element information item [children], because the type's content type is empty.
WARNING: At line 47 of <https://ci-builds.apache.org/job/Tomee/job/tomee-8.x-build-full-java8/ws/examples/scala-basic/target/surefire-reports/TEST-org.superbiz.GreetingServiceTest.xml>:cvc-complex-type.2.1: Element 'property' must have no character or element information item [children], because the type's content type is empty.
WARNING: At line 51 of <https://ci-builds.apache.org/job/Tomee/job/tomee-8.x-build-full-java8/ws/examples/scala-basic/target/surefire-reports/TEST-org.superbiz.GreetingServiceTest.xml>:cvc-complex-type.2.1: Element 'property' must have no character or element information item [children], because the type's content type is empty.
WARNING: At line 55 of <https://ci-builds.apache.org/job/Tomee/job/tomee-8.x-build-full-java8/ws/examples/scala-basic/target/surefire-reports/TEST-org.superbiz.GreetingServiceTest.xml>:cvc-complex-type.2.1: Element 'property' must have no character or element information item [children], because the type's content type is empty.
WARNING: At line 58 of <https://ci-builds.apache.org/job/Tomee/job/tomee-8.x-build-full-java8/ws/examples/scala-basic/target/surefire-reports/TEST-org.superbiz.GreetingServiceTest.xml>:cvc-complex-type.2.1: Element 'property' must have no character or element information item [children], because the type's content type is empty.
WARNING: At line 62 of <https://ci-builds.apache.org/job/Tomee/job/tomee-8.x-build-full-java8/ws/examples/scala-basic/target/surefire-reports/TEST-org.superbiz.GreetingServiceTest.xml>:cvc-complex-type.2.1: Element 'property' must have no character or element information item [children], because the type's content type is empty.
WARNING: At line 66 of <https://ci-builds.apache.org/job/Tomee/job/tomee-8.x-build-full-java8/ws/examples/scala-basic/target/surefire-reports/TEST-org.superbiz.GreetingServiceTest.xml>:cvc-complex-type.2.1: Element 'property' must have no character or element information item [children], because the type's content type is empty.
WARNING: At line 74 of <https://ci-builds.apache.org/job/Tomee/job/tomee-8.x-build-full-java8/ws/examples/scala-basic/target/surefire-reports/TEST-org.superbiz.GreetingServiceTest.xml>:cvc-complex-type.2.1: Element 'property' must have no character or element information item [children], because the type's content type is empty.
WARNING: At line 78 of <https://ci-builds.apache.org/job/Tomee/job/tomee-8.x-build-full-java8/ws/examples/scala-basic/target/surefire-reports/TEST-org.superbiz.GreetingServiceTest.xml>:cvc-complex-type.2.1: Element 'property' must have no character or element information item [children], because the type's content type is empty.
WARNING: At line 83 of <https://ci-builds.apache.org/job/Tomee/job/tomee-8.x-build-full-java8/ws/examples/scala-basic/target/surefire-reports/TEST-org.superbiz.GreetingServiceTest.xml>:cvc-complex-type.2.1: Element 'property' must have no character or element information item [children], because the type's content type is empty.
WARNING: At line 86 of <https://ci-builds.apache.org/job/Tomee/job/tomee-8.x-build-full-java8/ws/examples/scala-basic/target/surefire-reports/TEST-org.superbiz.GreetingServiceTest.xml>:cvc-complex-type.2.1: Element 'property' must have no character or element information item [children], because the type's content type is empty.
WARNING: At line 94 of <https://ci-builds.apache.org/job/Tomee/job/tomee-8.x-build-full-java8/ws/examples/scala-basic/target/surefire-reports/TEST-org.superbiz.GreetingServiceTest.xml>:cvc-complex-type.2.1: Element 'property' must have no character or element information item [children], because the type's content type is empty.
WARNING: At line 98 of <https://ci-builds.apache.org/job/Tomee/job/tomee-8.x-build-full-java8/ws/examples/scala-basic/target/surefire-reports/TEST-org.superbiz.GreetingServiceTest.xml>:cvc-complex-type.2.1: Element 'property' must have no character or element information item [children], because the type's content type is empty.
WARNING: At line 103 of <https://ci-builds.apache.org/job/Tomee/job/tomee-8.x-build-full-java8/ws/examples/scala-basic/target/surefire-reports/TEST-org.superbiz.GreetingServiceTest.xml>:cvc-complex-type.2.1: Element 'property' must have no character or element information item [children], because the type's content type is empty.
WARNING: At line 106 of <https://ci-builds.apache.org/job/Tomee/job/tomee-8.x-build-full-java8/ws/examples/scala-basic/target/surefire-reports/TEST-org.superbiz.GreetingServiceTest.xml>:cvc-complex-type.2.1: Element 'property' must have no character or element information item [children], because the type's content type is empty.
WARNING: At line 110 of <https://ci-builds.apache.org/job/Tomee/job/tomee-8.x-build-full-java8/ws/examples/scala-basic/target/surefire-reports/TEST-org.superbiz.GreetingServiceTest.xml>:cvc-complex-type.2.1: Element 'property' must have no character or element information item [children], because the type's content type is empty.
WARNING: The result file '<https://ci-builds.apache.org/job/Tomee/job/tomee-8.x-build-full-java8/ws/examples/scala-basic/target/surefire-reports/TEST-org.superbiz.GreetingServiceTest.xml'> for the metric 'JUnit' is not valid. The result file has been skipped.
INFO: Setting the build status to SUCCESS