You are viewing a plain text version of this content. The canonical link for it is here.
Posted to builds@hbase.apache.org by Apache Jenkins Server <je...@builds.apache.org> on 2016/12/02 05:53:22 UTC
Build failed in Jenkins: HBase-1.4 » JDK_1_7,Hadoop #557
See <https://builds.apache.org/job/HBase-1.4/jdk=JDK_1_7,label=Hadoop/557/changes>
Changes:
[zhangduo] HBASE-17181 Let HBase thrift2 support TThreadedSelectorServer
[zhangduo] Addendum HBASE-16209: Add an ExponentialBackOffPolicy so that we spread
------------------------------------------
[...truncated 47275 lines...]
test_row_2/C:col23/1480656958284/Put/vlen=10/seqid=0 val= \xF5\xD0\xD7:\xD5\x02x#\xAD:
test_row_2/C:col24/1480656958284/Put/vlen=10/seqid=0 val= \xF5\xD0\xD7:\xD5\x02x#\xAD:
test_row_2/C:col25/1480656958284/Put/vlen=10/seqid=0 val= \xF5\xD0\xD7:\xD5\x02x#\xAD:
test_row_2/C:col26/1480656958284/Put/vlen=10/seqid=0 val= \xF5\xD0\xD7:\xD5\x02x#\xAD:
test_row_2/C:col27/1480656958284/Put/vlen=10/seqid=0 val= \xF5\xD0\xD7:\xD5\x02x#\xAD:
test_row_2/C:col28/1480656958284/Put/vlen=10/seqid=0 val= \xF5\xD0\xD7:\xD5\x02x#\xAD:
test_row_2/C:col29/1480656958284/Put/vlen=10/seqid=0 val= \xF5\xD0\xD7:\xD5\x02x#\xAD:
test_row_2/C:col3/1480656958284/Put/vlen=10/seqid=0 val= \xF5\xD0\xD7:\xD5\x02x#\xAD:
test_row_2/C:col30/1480656958284/Put/vlen=10/seqid=0 val= \xF5\xD0\xD7:\xD5\x02x#\xAD:
test_row_2/C:col31/1480656958284/Put/vlen=10/seqid=0 val= \xF5\xD0\xD7:\xD5\x02x#\xAD:
test_row_2/C:col32/1480656958284/Put/vlen=10/seqid=0 val= \xF5\xD0\xD7:\xD5\x02x#\xAD:
test_row_2/C:col33/1480656958284/Put/vlen=10/seqid=0 val= \xF5\xD0\xD7:\xD5\x02x#\xAD:
test_row_2/C:col34/1480656958284/Put/vlen=10/seqid=0 val= \xF5\xD0\xD7:\xD5\x02x#\xAD:
test_row_2/C:col35/1480656958284/Put/vlen=10/seqid=0 val= \xF5\xD0\xD7:\xD5\x02x#\xAD:
test_row_2/C:col36/1480656958284/Put/vlen=10/seqid=0 val= \xF5\xD0\xD7:\xD5\x02x#\xAD:
test_row_2/C:col37/1480656958284/Put/vlen=10/seqid=0 val= \xF5\xD0\xD7:\xD5\x02x#\xAD:
test_row_2/C:col38/1480656958284/Put/vlen=10/seqid=0 val= \xF5\xD0\xD7:\xD5\x02x#\xAD:
test_row_2/C:col39/1480656958284/Put/vlen=10/seqid=0 val= \xF5\xD0\xD7:\xD5\x02x#\xAD:
test_row_2/C:col4/1480656958284/Put/vlen=10/seqid=0 val= \xF5\xD0\xD7:\xD5\x02x#\xAD:
test_row_2/C:col40/1480656958284/Put/vlen=10/seqid=0 val= \xF5\xD0\xD7:\xD5\x02x#\xAD:
test_row_2/C:col41/1480656958284/Put/vlen=10/seqid=0 val= \xF5\xD0\xD7:\xD5\x02x#\xAD:
test_row_2/C:col42/1480656958284/Put/vlen=10/seqid=0 val= \xF5\xD0\xD7:\xD5\x02x#\xAD:
test_row_2/C:col43/1480656958284/Put/vlen=10/seqid=0 val= \xF5\xD0\xD7:\xD5\x02x#\xAD:
test_row_2/C:col44/1480656958284/Put/vlen=10/seqid=0 val= \xF5\xD0\xD7:\xD5\x02x#\xAD:
test_row_2/C:col45/1480656958284/Put/vlen=10/seqid=0 val= \xF5\xD0\xD7:\xD5\x02x#\xAD:
test_row_2/C:col46/1480656958284/Put/vlen=10/seqid=0 val= \xF5\xD0\xD7:\xD5\x02x#\xAD:
test_row_2/C:col47/1480656958284/Put/vlen=10/seqid=0 val= \xF5\xD0\xD7:\xD5\x02x#\xAD:
test_row_2/C:col48/1480656958284/Put/vlen=10/seqid=0 val= \xF5\xD0\xD7:\xD5\x02x#\xAD:
test_row_2/C:col49/1480656958284/Put/vlen=10/seqid=0 val= \xF5\xD0\xD7:\xD5\x02x#\xAD:
test_row_2/C:col5/1480656958284/Put/vlen=10/seqid=0 val= \xF5\xD0\xD7:\xD5\x02x#\xAD:
test_row_2/C:col6/1480656958284/Put/vlen=10/seqid=0 val= \xF5\xD0\xD7:\xD5\x02x#\xAD:
test_row_2/C:col7/1480656958284/Put/vlen=10/seqid=0 val= \xF5\xD0\xD7:\xD5\x02x#\xAD:
test_row_2/C:col8/1480656958284/Put/vlen=10/seqid=0 val= \xF5\xD0\xD7:\xD5\x02x#\xAD:
test_row_2/C:col9/1480656958284/Put/vlen=10/seqid=0 val= \xF5\xD0\xD7:\xD5\x02x#\xAD:
at org.apache.hadoop.hbase.TestAcidGuarantees$AtomicScanReader.gotFailure(TestAcidGuarantees.java:245)
at org.apache.hadoop.hbase.TestAcidGuarantees$AtomicScanReader.doAnAction(TestAcidGuarantees.java:224)
at org.apache.hadoop.hbase.MultithreadedTestUtil$RepeatingTestThread.doWork(MultithreadedTestUtil.java:147)
at org.apache.hadoop.hbase.MultithreadedTestUtil$TestThread.run(MultithreadedTestUtil.java:123)
Running org.apache.hadoop.hbase.replication.regionserver.TestRegionReplicaReplicationEndpointNoMaster
Tests run: 9, Failures: 0, Errors: 0, Skipped: 0, Time elapsed: 82.537 sec - in org.apache.hadoop.hbase.replication.regionserver.TestRegionReplicaReplicationEndpoint
Running org.apache.hadoop.hbase.replication.regionserver.TestReplicationSink
Tests run: 4, Failures: 0, Errors: 0, Skipped: 0, Time elapsed: 26.21 sec - in org.apache.hadoop.hbase.replication.regionserver.TestRegionReplicaReplicationEndpointNoMaster
Running org.apache.hadoop.hbase.replication.regionserver.TestReplicationSourceManager
Tests run: 6, Failures: 0, Errors: 0, Skipped: 0, Time elapsed: 5.038 sec - in org.apache.hadoop.hbase.replication.regionserver.TestReplicationSink
Tests run: 9, Failures: 0, Errors: 0, Skipped: 0, Time elapsed: 10.209 sec - in org.apache.hadoop.hbase.replication.regionserver.TestReplicationSourceManager
Running org.apache.hadoop.hbase.replication.TestReplicationTrackerZKImpl
Tests run: 5, Failures: 0, Errors: 0, Skipped: 0, Time elapsed: 1.182 sec - in org.apache.hadoop.hbase.replication.TestReplicationTrackerZKImpl
Running org.apache.hadoop.hbase.replication.TestReplicationSyncUpToolWithBulkLoadedData
Running org.apache.hadoop.hbase.replication.TestReplicationKillMasterRSCompressed
Tests run: 10, Failures: 0, Errors: 0, Skipped: 0, Time elapsed: 168.581 sec - in org.apache.hadoop.hbase.TestZooKeeper
Tests run: 1, Failures: 0, Errors: 0, Skipped: 0, Time elapsed: 12.141 sec - in org.apache.hadoop.hbase.replication.TestReplicationKillMasterRSCompressed
Running org.apache.hadoop.hbase.replication.TestMultiSlaveReplication
Running org.apache.hadoop.hbase.replication.TestReplicationKillMasterRS
Tests run: 3, Failures: 0, Errors: 0, Skipped: 0, Time elapsed: 178.5 sec - in org.apache.hadoop.hbase.replication.TestSerialReplication
Tests run: 1, Failures: 0, Errors: 0, Skipped: 0, Time elapsed: 47.365 sec - in org.apache.hadoop.hbase.replication.TestReplicationSyncUpToolWithBulkLoadedData
Tests run: 1, Failures: 0, Errors: 0, Skipped: 0, Time elapsed: 12.295 sec - in org.apache.hadoop.hbase.replication.TestReplicationKillMasterRS
Running org.apache.hadoop.hbase.replication.TestReplicationChangingPeerRegionservers
Running org.apache.hadoop.hbase.replication.TestReplicationStatus
Running org.apache.hadoop.hbase.replication.TestReplicationKillSlaveRS
Tests run: 1, Failures: 0, Errors: 0, Skipped: 0, Time elapsed: 5.112 sec - in org.apache.hadoop.hbase.replication.TestReplicationChangingPeerRegionservers
Tests run: 1, Failures: 0, Errors: 0, Skipped: 0, Time elapsed: 12.37 sec - in org.apache.hadoop.hbase.replication.TestReplicationStatus
Tests run: 1, Failures: 0, Errors: 0, Skipped: 0, Time elapsed: 10.256 sec - in org.apache.hadoop.hbase.replication.TestReplicationKillSlaveRS
Tests run: 2, Failures: 0, Errors: 0, Skipped: 0, Time elapsed: 60.234 sec - in org.apache.hadoop.hbase.replication.TestMultiSlaveReplication
Running org.apache.hadoop.hbase.replication.multiwal.TestReplicationKillMasterRSCompressedWithMultipleWAL
Tests run: 8, Failures: 0, Errors: 0, Skipped: 0, Time elapsed: 232.258 sec - in org.apache.hadoop.hbase.replication.regionserver.TestReplicationWALReaderManager
Running org.apache.hadoop.hbase.replication.multiwal.TestReplicationEndpointWithMultipleWAL
Running org.apache.hadoop.hbase.replication.multiwal.TestReplicationSyncUpToolWithMultipleWAL
Running org.apache.hadoop.hbase.replication.TestPerTableCFReplication
Tests run: 1, Failures: 0, Errors: 0, Skipped: 0, Time elapsed: 13.013 sec - in org.apache.hadoop.hbase.replication.multiwal.TestReplicationKillMasterRSCompressedWithMultipleWAL
Running org.apache.hadoop.hbase.replication.TestMasterReplication
Tests run: 5, Failures: 0, Errors: 0, Skipped: 0, Time elapsed: 11.263 sec - in org.apache.hadoop.hbase.replication.multiwal.TestReplicationEndpointWithMultipleWAL
Running org.apache.hadoop.hbase.replication.TestReplicationDisableInactivePeer
Running org.apache.hadoop.hbase.replication.TestReplicationWithTags
Tests run: 1, Failures: 0, Errors: 0, Skipped: 0, Time elapsed: 2.621 sec - in org.apache.hadoop.hbase.replication.TestReplicationWithTags
Tests run: 3, Failures: 0, Errors: 0, Skipped: 0, Time elapsed: 34.386 sec - in org.apache.hadoop.hbase.replication.TestPerTableCFReplication
Tests run: 1, Failures: 0, Errors: 0, Skipped: 0, Time elapsed: 20.29 sec - in org.apache.hadoop.hbase.replication.TestReplicationDisableInactivePeer
Running org.apache.hadoop.hbase.replication.TestReplicationSource
Tests run: 1, Failures: 0, Errors: 0, Skipped: 0, Time elapsed: 0.216 sec - in org.apache.hadoop.hbase.replication.TestReplicationSource
Running org.apache.hadoop.hbase.replication.TestReplicationEndpoint
Running org.apache.hadoop.hbase.replication.TestReplicationSmallTests
Tests run: 1, Failures: 0, Errors: 0, Skipped: 0, Time elapsed: 62.51 sec - in org.apache.hadoop.hbase.replication.multiwal.TestReplicationSyncUpToolWithMultipleWAL
Running org.apache.hadoop.hbase.replication.TestReplicationStateZKImpl
Running org.apache.hadoop.hbase.replication.TestReplicationSyncUpTool
Tests run: 9, Failures: 0, Errors: 0, Skipped: 0, Time elapsed: 1.211 sec - in org.apache.hadoop.hbase.replication.TestReplicationStateZKImpl
Running org.apache.hadoop.hbase.fs.TestBlockReorder
Tests run: 5, Failures: 0, Errors: 0, Skipped: 0, Time elapsed: 11.674 sec - in org.apache.hadoop.hbase.replication.TestReplicationEndpoint
Running org.apache.hadoop.hbase.trace.TestHTraceHooks
Tests run: 3, Failures: 0, Errors: 0, Skipped: 0, Time elapsed: 23.653 sec - in org.apache.hadoop.hbase.fs.TestBlockReorder
Running org.apache.hadoop.hbase.TestMovedRegionsCleaner
Tests run: 1, Failures: 0, Errors: 0, Skipped: 0, Time elapsed: 16.189 sec - in org.apache.hadoop.hbase.trace.TestHTraceHooks
Tests run: 1, Failures: 0, Errors: 0, Skipped: 0, Time elapsed: 11.705 sec - in org.apache.hadoop.hbase.TestMovedRegionsCleaner
Running org.apache.hadoop.hbase.TestMetaTableLocator
Tests run: 7, Failures: 0, Errors: 0, Skipped: 0, Time elapsed: 3.841 sec - in org.apache.hadoop.hbase.TestMetaTableLocator
Running org.apache.hadoop.hbase.namespace.TestNamespaceAuditor
Tests run: 1, Failures: 0, Errors: 0, Skipped: 0, Time elapsed: 62.467 sec - in org.apache.hadoop.hbase.replication.TestReplicationSyncUpTool
Running org.apache.hadoop.hbase.mapred.TestTableMapReduceUtil
Tests run: 13, Failures: 0, Errors: 0, Skipped: 0, Time elapsed: 84.119 sec - in org.apache.hadoop.hbase.replication.TestReplicationSmallTests
Running org.apache.hadoop.hbase.mapred.TestTableSnapshotInputFormat
Running org.apache.hadoop.hbase.mapred.TestMultiTableSnapshotInputFormat
Tests run: 4, Failures: 0, Errors: 0, Skipped: 0, Time elapsed: 35.415 sec - in org.apache.hadoop.hbase.mapred.TestMultiTableSnapshotInputFormat
Running org.apache.hadoop.hbase.mapred.TestTableInputFormat
Tests run: 7, Failures: 0, Errors: 0, Skipped: 0, Time elapsed: 218.452 sec - in org.apache.hadoop.hbase.replication.TestMasterReplication
Tests run: 12, Failures: 0, Errors: 0, Skipped: 1, Time elapsed: 107.211 sec - in org.apache.hadoop.hbase.namespace.TestNamespaceAuditor
Tests run: 4, Failures: 0, Errors: 0, Skipped: 0, Time elapsed: 89.9 sec - in org.apache.hadoop.hbase.mapred.TestTableMapReduceUtil
Running org.apache.hadoop.hbase.TestMultiVersions
Running org.apache.hadoop.hbase.mapred.TestTableMapReduce
Tests run: 7, Failures: 0, Errors: 0, Skipped: 0, Time elapsed: 98.857 sec - in org.apache.hadoop.hbase.mapred.TestTableSnapshotInputFormat
Tests run: 3, Failures: 0, Errors: 0, Skipped: 0, Time elapsed: 7.473 sec - in org.apache.hadoop.hbase.TestMultiVersions
Tests run: 2, Failures: 0, Errors: 0, Skipped: 0, Time elapsed: 19.185 sec - in org.apache.hadoop.hbase.mapred.TestTableMapReduce
Tests run: 8, Failures: 0, Errors: 0, Skipped: 0, Time elapsed: 90.734 sec - in org.apache.hadoop.hbase.mapred.TestTableInputFormat
Results :
Tests in error:
TestAcidGuarantees.testScanAtomicity:347->runTestAtomicity:254->runTestAtomicity:315 » Runtime
Tests run: 2695, Failures: 0, Errors: 1, Skipped: 57
[INFO] ------------------------------------------------------------------------
[INFO] Reactor Summary:
[INFO]
[INFO] Apache HBase ...................................... SUCCESS [1:41.725s]
[INFO] Apache HBase - Checkstyle ......................... SUCCESS [14.949s]
[INFO] Apache HBase - Resource Bundle .................... SUCCESS [0.247s]
[INFO] Apache HBase - Annotations ........................ SUCCESS [1.549s]
[INFO] Apache HBase - Protocol ........................... SUCCESS [18.570s]
[INFO] Apache HBase - Common ............................. SUCCESS [2:45.453s]
[INFO] Apache HBase - Procedure .......................... SUCCESS [3:40.339s]
[INFO] Apache HBase - Client ............................. SUCCESS [1:48.166s]
[INFO] Apache HBase - Hadoop Compatibility ............... SUCCESS [11.421s]
[INFO] Apache HBase - Hadoop Two Compatibility ........... SUCCESS [19.926s]
[INFO] Apache HBase - Prefix Tree ........................ SUCCESS [12.823s]
[INFO] Apache HBase - Server ............................. FAILURE [1:30:25.147s]
[INFO] Apache HBase - Testing Util ....................... SKIPPED
[INFO] Apache HBase - Thrift ............................. SKIPPED
[INFO] Apache HBase - Rest ............................... SKIPPED
[INFO] Apache HBase - Shell .............................. SKIPPED
[INFO] Apache HBase - Integration Tests .................. SKIPPED
[INFO] Apache HBase - Examples ........................... SKIPPED
[INFO] Apache HBase - External Block Cache ............... SKIPPED
[INFO] Apache HBase - Assembly ........................... SKIPPED
[INFO] Apache HBase - Shaded ............................. SKIPPED
[INFO] Apache HBase - Shaded - Client .................... SKIPPED
[INFO] Apache HBase - Shaded - Server .................... SKIPPED
[INFO] Apache HBase - Archetypes ......................... SKIPPED
[INFO] Apache HBase - Exemplar for hbase-client archetype SKIPPED
[INFO] Apache HBase - Exemplar for hbase-shaded-client archetype SKIPPED
[INFO] Apache HBase - Archetype builder .................. SKIPPED
[INFO] ------------------------------------------------------------------------
[INFO] BUILD FAILURE
[INFO] ------------------------------------------------------------------------
[INFO] Total time: 1:42:11.896s
[INFO] Finished at: Fri Dec 02 05:44:23 UTC 2016
[INFO] Final Memory: 97M/1014M
[INFO] ------------------------------------------------------------------------
[ERROR] Failed to execute goal org.apache.maven.plugins:maven-surefire-plugin:2.18.1:test (secondPartTestsExecution) on project hbase-server: ExecutionException: java.lang.RuntimeException: java.lang.RuntimeException: org.apache.maven.surefire.report.ReporterException: When writing xml report stdout/stderr: /tmp/stderr6752275955246624408deferred (No such file or directory) -> [Help 1]
[ERROR]
[ERROR] To see the full stack trace of the errors, re-run Maven with the -e switch.
[ERROR] Re-run Maven using the -X switch to enable full debug logging.
[ERROR]
[ERROR] For more information about the errors and possible solutions, please read the following articles:
[ERROR] [Help 1] http://cwiki.apache.org/confluence/display/MAVEN/MojoFailureException
[ERROR]
[ERROR] After correcting the problems, you can resume the build with the command
[ERROR] mvn <goals> -rf :hbase-server
Build step 'Invoke top-level Maven targets' marked build as failure
Performing Post build task...
Match found for :.* : True
Logical operation result is TRUE
Running script : # Post-build task script. TODO: Check this in and have all builds reference check-in.
pwd && ls
# NOTE!!!! The below code has been copied and pasted from ./dev-tools/run-test.sh
# Do not change here without syncing there and vice-versa.
ZOMBIE_TESTS_COUNT=`jps -v | grep surefirebooter | grep -e '-Dhbase.test' | wc -l`
if [[ $ZOMBIE_TESTS_COUNT != 0 ]] ; then
echo "Suspicious java process found - waiting 30s to see if there are just slow to stop"
sleep 30
ZOMBIE_TESTS_COUNT=`jps -v | grep surefirebooter | grep -e '-Dhbase.test' | wc -l`
if [[ $ZOMBIE_TESTS_COUNT != 0 ]] ; then
echo " {color:red}There appear to be $ZOMBIE_TESTS_COUNT zombie tests{color}, they should have been killed by surefire but survived"
jps -v | grep surefirebooter | grep -e '-Dhbase.test'
jps -v | grep surefirebooter | grep -e '-Dhbase.test' | cut -d ' ' -f 1 | xargs -n 1 jstack
# Exit with error
exit 1
else
echo "We're ok: there is no zombie test, but some tests took some time to stop"
fi
else
echo "We're ok: there is no zombie test"
fi
Setting JDK_1_7_LATEST__HOME=/home/jenkins/tools/java/latest1.7
Setting JDK_1_8_LATEST__HOME=/home/jenkins/tools/java/latest1.8
[3130e991] $ /bin/bash -xe /tmp/hudson5711599034755171244.sh
+ pwd
<https://builds.apache.org/job/HBase-1.4/jdk=JDK_1_7,label=Hadoop/ws/>
+ ls
bin
CHANGES.txt
conf
dev-support
extra_env_var
hbase-annotations
hbase-archetypes
hbase-assembly
hbase-checkstyle
hbase-client
hbase-common
hbase-examples
hbase-external-blockcache
hbase-hadoop2-compat
hbase-hadoop-compat
hbase-it
hbase-native-client
hbase-prefix-tree
hbase-procedure
hbase-protocol
hbase-resource-bundle
hbase-rest
hbase-server
hbase-shaded
hbase-shell
hbase-testing-util
hbase-thrift
LICENSE.txt
NOTICE.txt
pom.xml
README.txt
src
target
++ jps -v
++ grep surefirebooter
++ grep -e -Dhbase.test
++ wc -l
+ ZOMBIE_TESTS_COUNT=0
+ [[ 0 != 0 ]]
+ echo 'We'\''re ok: there is no zombie test'
We're ok: there is no zombie test
POST BUILD TASK : SUCCESS
END OF POST BUILD TASK : 0
Archiving artifacts
Setting JDK_1_7_LATEST__HOME=/home/jenkins/tools/java/latest1.7
Setting JDK_1_8_LATEST__HOME=/home/jenkins/tools/java/latest1.8
Recording test results
Setting JDK_1_7_LATEST__HOME=/home/jenkins/tools/java/latest1.7
Setting JDK_1_8_LATEST__HOME=/home/jenkins/tools/java/latest1.8
Setting JDK_1_7_LATEST__HOME=/home/jenkins/tools/java/latest1.7
Setting JDK_1_8_LATEST__HOME=/home/jenkins/tools/java/latest1.8
Jenkins build is back to normal : HBase-1.4 » JDK_1_7,Hadoop #559
Posted by Apache Jenkins Server <je...@builds.apache.org>.
See <https://builds.apache.org/job/HBase-1.4/jdk=JDK_1_7,label=Hadoop/559/changes>
Build failed in Jenkins: HBase-1.4 » JDK_1_7,Hadoop #558
Posted by Apache Jenkins Server <je...@builds.apache.org>.
See <https://builds.apache.org/job/HBase-1.4/jdk=JDK_1_7,label=Hadoop/558/changes>
Changes:
[tedyu] HBASE-17170 HBase is also retrying DoNotRetryIOException because of
------------------------------------------
[...truncated 46908 lines...]
at org.apache.hadoop.hbase.MiniHBaseCluster.<init>(MiniHBaseCluster.java:96)
at org.apache.hadoop.hbase.HBaseTestingUtility.startMiniHBaseCluster(HBaseTestingUtility.java:1071)
at org.apache.hadoop.hbase.HBaseTestingUtility.startMiniCluster(HBaseTestingUtility.java:1031)
at org.apache.hadoop.hbase.HBaseTestingUtility.startMiniCluster(HBaseTestingUtility.java:903)
at org.apache.hadoop.hbase.HBaseTestingUtility.startMiniCluster(HBaseTestingUtility.java:885)
at org.apache.hadoop.hbase.HBaseTestingUtility.startMiniCluster(HBaseTestingUtility.java:872)
at org.apache.hadoop.hbase.quotas.TestQuotaThrottle.setUpBeforeClass(TestQuotaThrottle.java:64)
org.apache.hadoop.hbase.quotas.TestQuotaThrottle Time elapsed: 216.154 sec <<< ERROR!
org.apache.hadoop.hbase.client.RetriesExhaustedException: Failed after attempts=6, exceptions:
Mon Dec 05 21:44:53 UTC 2016, RpcRetryingCaller{globalStartTime=1480974293769, pause=250, retries=6}, org.apache.hadoop.hbase.exceptions.ConnectionClosingException: Call to asf902.gq1.ygridcore.net/67.195.81.146:43668 failed on local exception: org.apache.hadoop.hbase.exceptions.ConnectionClosingException: Connection to asf902.gq1.ygridcore.net/67.195.81.146:43668 is closing. Call id=1, waitTime=5
Mon Dec 05 21:44:53 UTC 2016, RpcRetryingCaller{globalStartTime=1480974293769, pause=250, retries=6}, org.apache.hadoop.hbase.MasterNotRunningException: java.io.IOException: Can't get master address from ZooKeeper; znode data == null
Mon Dec 05 21:44:53 UTC 2016, RpcRetryingCaller{globalStartTime=1480974293769, pause=250, retries=6}, org.apache.hadoop.hbase.MasterNotRunningException: java.io.IOException: Can't get master address from ZooKeeper; znode data == null
Mon Dec 05 21:44:53 UTC 2016, RpcRetryingCaller{globalStartTime=1480974293769, pause=250, retries=6}, org.apache.hadoop.hbase.MasterNotRunningException: java.io.IOException: Can't get master address from ZooKeeper; znode data == null
Mon Dec 05 21:44:53 UTC 2016, RpcRetryingCaller{globalStartTime=1480974293769, pause=250, retries=6}, org.apache.hadoop.hbase.MasterNotRunningException: java.io.IOException: Can't get master address from ZooKeeper; znode data == null
Mon Dec 05 21:44:53 UTC 2016, RpcRetryingCaller{globalStartTime=1480974293769, pause=250, retries=6}, org.apache.hadoop.hbase.MasterNotRunningException: java.io.IOException: Can't get master address from ZooKeeper; znode data == null
at org.apache.hadoop.hbase.zookeeper.MasterAddressTracker.getMasterAddress(MasterAddressTracker.java:154)
at org.apache.hadoop.hbase.client.ConnectionManager$HConnectionImplementation$StubMaker.makeStubNoRetries(ConnectionManager.java:1533)
at org.apache.hadoop.hbase.client.ConnectionManager$HConnectionImplementation$StubMaker.makeStub(ConnectionManager.java:1574)
at org.apache.hadoop.hbase.client.ConnectionManager$HConnectionImplementation$MasterServiceStubMaker.makeStub(ConnectionManager.java:1603)
at org.apache.hadoop.hbase.client.ConnectionManager$HConnectionImplementation.getKeepAliveMasterService(ConnectionManager.java:1760)
at org.apache.hadoop.hbase.client.MasterCallable.prepare(MasterCallable.java:38)
at org.apache.hadoop.hbase.client.RpcRetryingCaller.callWithRetries(RpcRetryingCaller.java:139)
at org.apache.hadoop.hbase.client.HBaseAdmin.executeCallable(HBaseAdmin.java:4404)
at org.apache.hadoop.hbase.client.HBaseAdmin.executeCallable(HBaseAdmin.java:4396)
at org.apache.hadoop.hbase.client.HBaseAdmin.disableTableAsyncV2(HBaseAdmin.java:1374)
at org.apache.hadoop.hbase.client.HBaseAdmin.disableTable(HBaseAdmin.java:1333)
at org.apache.hadoop.hbase.HBaseTestingUtility.deleteTable(HBaseTestingUtility.java:1931)
at org.apache.hadoop.hbase.quotas.TestQuotaThrottle.tearDownAfterClass(TestQuotaThrottle.java:79)
Running org.apache.hadoop.hbase.master.TestMasterOperationsForRegionReplicas
Running org.apache.hadoop.hbase.master.TestMasterStatusServlet
Tests run: 4, Failures: 0, Errors: 0, Skipped: 0, Time elapsed: 2.272 sec - in org.apache.hadoop.hbase.master.TestMasterStatusServlet
Running org.apache.hadoop.hbase.master.balancer.TestStochasticLoadBalancer
Running org.apache.hadoop.hbase.master.TestWarmupRegion
Tests run: 1, Failures: 0, Errors: 0, Skipped: 0, Time elapsed: 12.977 sec - in org.apache.hadoop.hbase.master.TestGetInfoPort
Running org.apache.hadoop.hbase.master.balancer.TestStochasticLoadBalancer2
Tests run: 4, Failures: 0, Errors: 0, Skipped: 0, Time elapsed: 34.268 sec - in org.apache.hadoop.hbase.master.cleaner.TestSnapshotFromMaster
Tests run: 2, Failures: 0, Errors: 0, Skipped: 0, Time elapsed: 26.587 sec - in org.apache.hadoop.hbase.master.TestMasterOperationsForRegionReplicas
Running org.apache.hadoop.hbase.master.balancer.TestDefaultLoadBalancer
Running org.apache.hadoop.hbase.master.balancer.TestBaseLoadBalancer
Tests run: 7, Failures: 0, Errors: 0, Skipped: 0, Time elapsed: 0.735 sec - in org.apache.hadoop.hbase.master.balancer.TestBaseLoadBalancer
Tests run: 1, Failures: 0, Errors: 0, Skipped: 0, Time elapsed: 3.551 sec - in org.apache.hadoop.hbase.master.balancer.TestDefaultLoadBalancer
Running org.apache.hadoop.hbase.master.TestMasterFailover
Tests run: 1, Failures: 0, Errors: 0, Skipped: 0, Time elapsed: 28.962 sec - in org.apache.hadoop.hbase.master.TestWarmupRegion
Running org.apache.hadoop.hbase.master.TestAssignmentManagerMetrics
Running org.apache.hadoop.hbase.master.TestDistributedLogSplitting
Tests run: 1, Failures: 0, Errors: 0, Skipped: 0, Time elapsed: 8.664 sec - in org.apache.hadoop.hbase.master.TestAssignmentManagerMetrics
Running org.apache.hadoop.hbase.master.TestMasterNoCluster
Tests run: 3, Failures: 0, Errors: 0, Skipped: 0, Time elapsed: 13.792 sec - in org.apache.hadoop.hbase.master.TestMasterNoCluster
Running org.apache.hadoop.hbase.master.TestGetLastFlushedSequenceId
Tests run: 1, Failures: 0, Errors: 0, Skipped: 0, Time elapsed: 20.723 sec - in org.apache.hadoop.hbase.master.TestGetLastFlushedSequenceId
Running org.apache.hadoop.hbase.master.TestRollingRestart
Tests run: 18, Failures: 0, Errors: 0, Skipped: 15, Time elapsed: 70.308 sec - in org.apache.hadoop.hbase.master.TestDistributedLogSplitting
Running org.apache.hadoop.hbase.master.TestMetaShutdownHandler
Tests run: 7, Failures: 0, Errors: 0, Skipped: 0, Time elapsed: 105.224 sec - in org.apache.hadoop.hbase.master.TestMasterFailover
Tests run: 1, Failures: 0, Errors: 0, Skipped: 0, Time elapsed: 52.104 sec - in org.apache.hadoop.hbase.master.TestRollingRestart
Running org.apache.hadoop.hbase.master.TestRegionPlacement2
Tests run: 2, Failures: 0, Errors: 0, Skipped: 0, Time elapsed: 2.142 sec - in org.apache.hadoop.hbase.master.TestRegionPlacement2
Running org.apache.hadoop.hbase.master.TestMaster
Tests run: 1, Failures: 0, Errors: 0, Skipped: 0, Time elapsed: 31.126 sec - in org.apache.hadoop.hbase.master.TestMetaShutdownHandler
Running org.apache.hadoop.hbase.master.TestActiveMasterManager
Tests run: 2, Failures: 0, Errors: 0, Skipped: 0, Time elapsed: 1.556 sec - in org.apache.hadoop.hbase.master.TestActiveMasterManager
Running org.apache.hadoop.hbase.master.TestMasterMetricsWrapper
Tests run: 4, Failures: 0, Errors: 0, Skipped: 0, Time elapsed: 14.512 sec - in org.apache.hadoop.hbase.master.TestMaster
Tests run: 1, Failures: 0, Errors: 0, Skipped: 0, Time elapsed: 2.349 sec - in org.apache.hadoop.hbase.master.TestMasterMetricsWrapper
Running org.apache.hadoop.hbase.master.TestMasterTransitions
Tests run: 3, Failures: 0, Errors: 0, Skipped: 3, Time elapsed: 0.002 sec - in org.apache.hadoop.hbase.master.TestMasterTransitions
Running org.apache.hadoop.hbase.master.TestMasterBalanceThrottling
Running org.apache.hadoop.hbase.master.normalizer.TestSimpleRegionNormalizerOnCluster
Running org.apache.hadoop.hbase.master.TestRestartCluster
Tests run: 2, Failures: 0, Errors: 0, Skipped: 0, Time elapsed: 27.41 sec - in org.apache.hadoop.hbase.master.normalizer.TestSimpleRegionNormalizerOnCluster
Running org.apache.hadoop.hbase.master.TestOpenedRegionHandler
Tests run: 2, Failures: 0, Errors: 0, Skipped: 0, Time elapsed: 15.02 sec - in org.apache.hadoop.hbase.master.TestOpenedRegionHandler
Running org.apache.hadoop.hbase.master.handler.TestCreateTableHandler
Tests run: 2, Failures: 0, Errors: 0, Skipped: 0, Time elapsed: 50.896 sec - in org.apache.hadoop.hbase.master.TestMasterBalanceThrottling
Tests run: 3, Failures: 0, Errors: 0, Skipped: 0, Time elapsed: 49.474 sec - in org.apache.hadoop.hbase.master.TestRestartCluster
Running org.apache.hadoop.hbase.master.TestMasterPriorityRpc
Running org.apache.hadoop.hbase.master.handler.TestEnableTableHandler
Tests run: 3, Failures: 0, Errors: 0, Skipped: 0, Time elapsed: 2.785 sec - in org.apache.hadoop.hbase.master.TestMasterPriorityRpc
Running org.apache.hadoop.hbase.master.TestSplitLogManager
Tests run: 3, Failures: 0, Errors: 0, Skipped: 0, Time elapsed: 29.547 sec - in org.apache.hadoop.hbase.master.handler.TestCreateTableHandler
Running org.apache.hadoop.hbase.master.TestAssignmentManagerOnCluster
Tests run: 3, Failures: 0, Errors: 0, Skipped: 0, Time elapsed: 44.856 sec - in org.apache.hadoop.hbase.master.handler.TestEnableTableHandler
Running org.apache.hadoop.hbase.master.TestRegionPlacement
Tests run: 2, Failures: 0, Errors: 0, Skipped: 2, Time elapsed: 0.001 sec - in org.apache.hadoop.hbase.master.TestRegionPlacement
Running org.apache.hadoop.hbase.master.TestClusterStatusPublisher
Tests run: 3, Failures: 0, Errors: 0, Skipped: 0, Time elapsed: 0.511 sec - in org.apache.hadoop.hbase.master.TestClusterStatusPublisher
Running org.apache.hadoop.hbase.master.TestTableLockManager
Tests run: 22, Failures: 0, Errors: 0, Skipped: 1, Time elapsed: 355.385 sec - in org.apache.hadoop.hbase.master.balancer.TestStochasticLoadBalancer
Tests run: 15, Failures: 0, Errors: 0, Skipped: 1, Time elapsed: 134.894 sec - in org.apache.hadoop.hbase.master.TestSplitLogManager
Tests run: 4, Failures: 0, Errors: 0, Skipped: 0, Time elapsed: 91.415 sec - in org.apache.hadoop.hbase.master.TestTableLockManager
Running org.apache.hadoop.hbase.master.TestMasterMetrics
Tests run: 3, Failures: 0, Errors: 0, Skipped: 0, Time elapsed: 1.431 sec - in org.apache.hadoop.hbase.master.TestMasterMetrics
Running org.apache.hadoop.hbase.master.TestMasterFileSystem
Tests run: 2, Failures: 0, Errors: 0, Skipped: 0, Time elapsed: 0.933 sec - in org.apache.hadoop.hbase.master.TestMasterFileSystem
Tests run: 21, Failures: 0, Errors: 0, Skipped: 0, Time elapsed: 117.855 sec - in org.apache.hadoop.hbase.master.TestAssignmentManagerOnCluster
Tests run: 4, Failures: 0, Errors: 0, Skipped: 0, Time elapsed: 491.946 sec - in org.apache.hadoop.hbase.master.balancer.TestStochasticLoadBalancer2
Results :
Failed tests:
TestQuotaThrottle.testUserGlobalReadAndWriteThrottle:150 expected:<60> but was:<12>
Tests in error:
org.apache.hadoop.hbase.quotas.TestQuotaThrottle.org.apache.hadoop.hbase.quotas.TestQuotaThrottle
Run 1: TestQuotaThrottle.setUpBeforeClass:64 » IO Shutting down
Run 2: TestQuotaThrottle.tearDownAfterClass:79 » RetriesExhausted Failed after attemp...
TestQuotaThrottle.testTableGlobalReadAndWriteThrottle:308->triggerTableCacheRefresh:530->triggerCacheRefresh:566 » TestTimedOut
Tests run: 2696, Failures: 1, Errors: 2, Skipped: 57
[INFO] ------------------------------------------------------------------------
[INFO] Reactor Summary:
[INFO]
[INFO] Apache HBase ...................................... SUCCESS [1:41.020s]
[INFO] Apache HBase - Checkstyle ......................... SUCCESS [14.961s]
[INFO] Apache HBase - Resource Bundle .................... SUCCESS [0.436s]
[INFO] Apache HBase - Annotations ........................ SUCCESS [1.243s]
[INFO] Apache HBase - Protocol ........................... SUCCESS [18.319s]
[INFO] Apache HBase - Common ............................. SUCCESS [2:40.121s]
[INFO] Apache HBase - Procedure .......................... SUCCESS [3:29.751s]
[INFO] Apache HBase - Client ............................. SUCCESS [1:41.681s]
[INFO] Apache HBase - Hadoop Compatibility ............... SUCCESS [9.709s]
[INFO] Apache HBase - Hadoop Two Compatibility ........... SUCCESS [17.594s]
[INFO] Apache HBase - Prefix Tree ........................ SUCCESS [9.901s]
[INFO] Apache HBase - Server ............................. FAILURE [1:28:35.447s]
[INFO] Apache HBase - Testing Util ....................... SKIPPED
[INFO] Apache HBase - Thrift ............................. SKIPPED
[INFO] Apache HBase - Rest ............................... SKIPPED
[INFO] Apache HBase - Shell .............................. SKIPPED
[INFO] Apache HBase - Integration Tests .................. SKIPPED
[INFO] Apache HBase - Examples ........................... SKIPPED
[INFO] Apache HBase - External Block Cache ............... SKIPPED
[INFO] Apache HBase - Assembly ........................... SKIPPED
[INFO] Apache HBase - Shaded ............................. SKIPPED
[INFO] Apache HBase - Shaded - Client .................... SKIPPED
[INFO] Apache HBase - Shaded - Server .................... SKIPPED
[INFO] Apache HBase - Archetypes ......................... SKIPPED
[INFO] Apache HBase - Exemplar for hbase-client archetype SKIPPED
[INFO] Apache HBase - Exemplar for hbase-shaded-client archetype SKIPPED
[INFO] Apache HBase - Archetype builder .................. SKIPPED
[INFO] ------------------------------------------------------------------------
[INFO] BUILD FAILURE
[INFO] ------------------------------------------------------------------------
[INFO] Total time: 1:39:51.985s
[INFO] Finished at: Mon Dec 05 21:38:38 UTC 2016
[INFO] Final Memory: 99M/1655M
[INFO] ------------------------------------------------------------------------
[ERROR] Failed to execute goal org.apache.maven.plugins:maven-surefire-plugin:2.18.1:test (secondPartTestsExecution) on project hbase-server: ExecutionException: java.lang.RuntimeException: There was an error in the forked process
[ERROR] java.lang.ArrayIndexOutOfBoundsException: 1
[ERROR] at org.apache.maven.surefire.common.junit4.JUnit4ProviderUtil.generateFailingTests(JUnit4ProviderUtil.java:64)
[ERROR] at org.apache.maven.surefire.junitcore.JUnitCoreProvider.invoke(JUnitCoreProvider.java:151)
[ERROR] at org.apache.maven.surefire.booter.ForkedBooter.invokeProviderInSameClassLoader(ForkedBooter.java:203)
[ERROR] at org.apache.maven.surefire.booter.ForkedBooter.runSuitesInProcess(ForkedBooter.java:155)
[ERROR] at org.apache.maven.surefire.booter.ForkedBooter.main(ForkedBooter.java:103)
[ERROR] -> [Help 1]
[ERROR]
[ERROR] To see the full stack trace of the errors, re-run Maven with the -e switch.
[ERROR] Re-run Maven using the -X switch to enable full debug logging.
[ERROR]
[ERROR] For more information about the errors and possible solutions, please read the following articles:
[ERROR] [Help 1] http://cwiki.apache.org/confluence/display/MAVEN/MojoFailureException
[ERROR]
[ERROR] After correcting the problems, you can resume the build with the command
[ERROR] mvn <goals> -rf :hbase-server
Build step 'Invoke top-level Maven targets' marked build as failure
Performing Post build task...
Match found for :.* : True
Logical operation result is TRUE
Running script : # Post-build task script. TODO: Check this in and have all builds reference check-in.
pwd && ls
# NOTE!!!! The below code has been copied and pasted from ./dev-tools/run-test.sh
# Do not change here without syncing there and vice-versa.
ZOMBIE_TESTS_COUNT=`jps -v | grep surefirebooter | grep -e '-Dhbase.test' | wc -l`
if [[ $ZOMBIE_TESTS_COUNT != 0 ]] ; then
echo "Suspicious java process found - waiting 30s to see if there are just slow to stop"
sleep 30
ZOMBIE_TESTS_COUNT=`jps -v | grep surefirebooter | grep -e '-Dhbase.test' | wc -l`
if [[ $ZOMBIE_TESTS_COUNT != 0 ]] ; then
echo " {color:red}There appear to be $ZOMBIE_TESTS_COUNT zombie tests{color}, they should have been killed by surefire but survived"
jps -v | grep surefirebooter | grep -e '-Dhbase.test'
jps -v | grep surefirebooter | grep -e '-Dhbase.test' | cut -d ' ' -f 1 | xargs -n 1 jstack
# Exit with error
exit 1
else
echo "We're ok: there is no zombie test, but some tests took some time to stop"
fi
else
echo "We're ok: there is no zombie test"
fi
Setting JDK_1_7_LATEST__HOME=/home/jenkins/tools/java/latest1.7
Setting JDK_1_8_LATEST__HOME=/home/jenkins/tools/java/latest1.8
[3130e991] $ /bin/bash -xe /tmp/hudson4526688827089908938.sh
+ pwd
<https://builds.apache.org/job/HBase-1.4/jdk=JDK_1_7,label=Hadoop/ws/>
+ ls
bin
CHANGES.txt
conf
dev-support
extra_env_var
hbase-annotations
hbase-archetypes
hbase-assembly
hbase-checkstyle
hbase-client
hbase-common
hbase-examples
hbase-external-blockcache
hbase-hadoop2-compat
hbase-hadoop-compat
hbase-it
hbase-native-client
hbase-prefix-tree
hbase-procedure
hbase-protocol
hbase-resource-bundle
hbase-rest
hbase-server
hbase-shaded
hbase-shell
hbase-testing-util
hbase-thrift
LICENSE.txt
NOTICE.txt
pom.xml
README.txt
src
target
++ jps -v
++ grep surefirebooter
++ wc -l
++ grep -e -Dhbase.test
+ ZOMBIE_TESTS_COUNT=0
+ [[ 0 != 0 ]]
+ echo 'We'\''re ok: there is no zombie test'
We're ok: there is no zombie test
POST BUILD TASK : SUCCESS
END OF POST BUILD TASK : 0
Archiving artifacts
Setting JDK_1_7_LATEST__HOME=/home/jenkins/tools/java/latest1.7
Setting JDK_1_8_LATEST__HOME=/home/jenkins/tools/java/latest1.8
Recording test results
Setting JDK_1_7_LATEST__HOME=/home/jenkins/tools/java/latest1.7
Setting JDK_1_8_LATEST__HOME=/home/jenkins/tools/java/latest1.8
Setting JDK_1_7_LATEST__HOME=/home/jenkins/tools/java/latest1.7
Setting JDK_1_8_LATEST__HOME=/home/jenkins/tools/java/latest1.8