You are viewing a plain text version of this content. The canonical link for it is here.
Posted to dev@pulsar.apache.org by Apache Jenkins Server <je...@builds.apache.org> on 2018/06/28 17:46:35 UTC
Jenkins build is unstable: pulsar-master #570
See <https://builds.apache.org/job/pulsar-master/570/display/redirect?page=changes>
Jenkins build is unstable: pulsar-master #574
Posted by Apache Jenkins Server <je...@builds.apache.org>.
See <https://builds.apache.org/job/pulsar-master/574/display/redirect?page=changes>
Build failed in Jenkins: pulsar-master #573
Posted by Apache Jenkins Server <je...@builds.apache.org>.
See <https://builds.apache.org/job/pulsar-master/573/display/redirect?page=changes>
Changes:
[github] Fixed resetting of producer sequence id counter after receiving
------------------------------------------
[...truncated 2.37 MB...]
[INFO] Get:4 http://deb.debian.org/debian stretch Release [118 kB]
[INFO] Get:5 http://deb.debian.org/debian stretch Release.gpg [2434 B]
[INFO] Get:6 http://security.debian.org/debian-security stretch/updates/main amd64 Packages [361 kB]
[INFO] Get:7 http://deb.debian.org/debian stretch-updates/main amd64 Packages [11.0 kB]
[INFO] Get:8 http://deb.debian.org/debian stretch/main amd64 Packages [7122 kB]
[INFO] Fetched 7800 kB in 2s (3363 kB/s)
[INFO] Reading package lists...
[INFO]
[INFO] Reading package lists...
[INFO]
[INFO] Building dependency tree...
[INFO]
[INFO] Reading state information...
[INFO]
[INFO] The following additional packages will be installed:
[INFO] bind9-host geoip-database libbind9-140 libdns162 libgeoip1 libisc160
[INFO] libisccc140 libisccfg140 liblwres141 netcat-traditional
[INFO] Suggested packages:
[INFO] rblcheck geoip-bin python-kazoo-doc
[INFO] The following NEW packages will be installed:
[INFO] bind9-host dnsutils geoip-database libbind9-140 libdns162 libgeoip1
[INFO] libisc160 libisccc140 libisccfg140 liblwres141 netcat netcat-traditional
[INFO] python-kazoo
[INFO] 0 upgraded, 13 newly installed, 0 to remove and 0 not upgraded.
[INFO] Need to get 5196 kB of archives.
[INFO] After this operation, 15.4 MB of additional disk space will be used.
[INFO] Get:1 http://deb.debian.org/debian stretch/main amd64 libgeoip1 amd64 1.6.9-4 [90.5 kB]
[INFO] Get:2 http://deb.debian.org/debian stretch/main amd64 libisc160 amd64 1:9.10.3.dfsg.P4-12.3+deb9u4 [398 kB]
[INFO] Get:3 http://deb.debian.org/debian stretch/main amd64 libdns162 amd64 1:9.10.3.dfsg.P4-12.3+deb9u4 [1077 kB]
[INFO] Get:4 http://deb.debian.org/debian stretch/main amd64 libisccc140 amd64 1:9.10.3.dfsg.P4-12.3+deb9u4 [198 kB]
[INFO] Get:5 http://deb.debian.org/debian stretch/main amd64 libisccfg140 amd64 1:9.10.3.dfsg.P4-12.3+deb9u4 [223 kB]
[INFO] Get:6 http://deb.debian.org/debian stretch/main amd64 libbind9-140 amd64 1:9.10.3.dfsg.P4-12.3+deb9u4 [206 kB]
[INFO] Get:7 http://deb.debian.org/debian stretch/main amd64 liblwres141 amd64 1:9.10.3.dfsg.P4-12.3+deb9u4 [214 kB]
[INFO] Get:8 http://deb.debian.org/debian stretch/main amd64 bind9-host amd64 1:9.10.3.dfsg.P4-12.3+deb9u4 [231 kB]
[INFO] Get:9 http://deb.debian.org/debian stretch/main amd64 netcat-traditional amd64 1.10-41+b1 [67.0 kB]
[INFO] Get:10 http://deb.debian.org/debian stretch/main amd64 dnsutils amd64 1:9.10.3.dfsg.P4-12.3+deb9u4 [283 kB]
[INFO] Get:11 http://deb.debian.org/debian stretch/main amd64 geoip-database all 20170512-1 [2112 kB]
[INFO] Get:12 http://deb.debian.org/debian stretch/main amd64 python-kazoo all 2.2.1-1 [88.2 kB]
[INFO] Get:13 http://deb.debian.org/debian stretch/main amd64 netcat all 1.10-41 [8962 B]
[INFO] debconf: delaying package configuration, since apt-utils is not installed
[INFO]
[INFO] Fetched 5196 kB in 0s (21.7 MB/s)
[INFO] Selecting previously unselected package libgeoip1:amd64.
[INFO] (Reading database ...
[INFO] (Reading database ... 5%
[INFO] (Reading database ... 10%
[INFO] (Reading database ... 15%
[INFO] (Reading database ... 20%
[INFO] (Reading database ... 25%
[INFO] (Reading database ... 30%
[INFO] (Reading database ... 35%(Reading database ... 40%(Reading database ... 45%(Reading database ... 50%(Reading database ... 55%(Reading database ... 60%(Reading database ... 65%(Reading database ... 70%(Reading database ... 75%(Reading database ... 80%(Reading database ... 85%(Reading database ... 90%(Reading database ... 95%(Reading database ... 100%(Reading database ... 21470 files and directories currently installed.)
[INFO] Preparing to unpack .../00-libgeoip1_1.6.9-4_amd64.deb ...
[INFO] Unpacking libgeoip1:amd64 (1.6.9-4) ...
[INFO] Selecting previously unselected package libisc160:amd64.
[INFO] Preparing to unpack .../01-libisc160_1%3a9.10.3.dfsg.P4-12.3+deb9u4_amd64.deb ...
[INFO] Unpacking libisc160:amd64 (1:9.10.3.dfsg.P4-12.3+deb9u4) ...
[INFO] Selecting previously unselected package libdns162:amd64.
[INFO] Preparing to unpack .../02-libdns162_1%3a9.10.3.dfsg.P4-12.3+deb9u4_amd64.deb ...
[INFO] Unpacking libdns162:amd64 (1:9.10.3.dfsg.P4-12.3+deb9u4) ...
[INFO] Selecting previously unselected package libisccc140:amd64.
[INFO] Preparing to unpack .../03-libisccc140_1%3a9.10.3.dfsg.P4-12.3+deb9u4_amd64.deb ...
[INFO] Unpacking libisccc140:amd64 (1:9.10.3.dfsg.P4-12.3+deb9u4) ...
[INFO] Selecting previously unselected package libisccfg140:amd64.
[INFO] Preparing to unpack .../04-libisccfg140_1%3a9.10.3.dfsg.P4-12.3+deb9u4_amd64.deb ...
[INFO] Unpacking libisccfg140:amd64 (1:9.10.3.dfsg.P4-12.3+deb9u4) ...
[INFO] Selecting previously unselected package libbind9-140:amd64.
[INFO] Preparing to unpack .../05-libbind9-140_1%3a9.10.3.dfsg.P4-12.3+deb9u4_amd64.deb ...
[INFO] Unpacking libbind9-140:amd64 (1:9.10.3.dfsg.P4-12.3+deb9u4) ...
[INFO] Selecting previously unselected package liblwres141:amd64.
[INFO] Preparing to unpack .../06-liblwres141_1%3a9.10.3.dfsg.P4-12.3+deb9u4_amd64.deb ...
[INFO] Unpacking liblwres141:amd64 (1:9.10.3.dfsg.P4-12.3+deb9u4) ...
[INFO] Selecting previously unselected package bind9-host.
[INFO] Preparing to unpack .../07-bind9-host_1%3a9.10.3.dfsg.P4-12.3+deb9u4_amd64.deb ...
[INFO] Unpacking bind9-host (1:9.10.3.dfsg.P4-12.3+deb9u4) ...
[INFO] Selecting previously unselected package netcat-traditional.
[INFO] Preparing to unpack .../08-netcat-traditional_1.10-41+b1_amd64.deb ...
[INFO] Unpacking netcat-traditional (1.10-41+b1) ...
[INFO] Selecting previously unselected package dnsutils.
[INFO] Preparing to unpack .../09-dnsutils_1%3a9.10.3.dfsg.P4-12.3+deb9u4_amd64.deb ...
[INFO] Unpacking dnsutils (1:9.10.3.dfsg.P4-12.3+deb9u4) ...
[INFO] Selecting previously unselected package geoip-database.
[INFO] Preparing to unpack .../10-geoip-database_20170512-1_all.deb ...
[INFO] Unpacking geoip-database (20170512-1) ...
[INFO] Selecting previously unselected package python-kazoo.
[INFO] Preparing to unpack .../11-python-kazoo_2.2.1-1_all.deb ...
[INFO] Unpacking python-kazoo (2.2.1-1) ...
[INFO] Selecting previously unselected package netcat.
[INFO] Preparing to unpack .../12-netcat_1.10-41_all.deb ...
[INFO] Unpacking netcat (1.10-41) ...
[INFO] Setting up geoip-database (20170512-1) ...
[INFO] Setting up netcat-traditional (1.10-41+b1) ...
[INFO] update-alternatives: using /bin/nc.traditional to provide /bin/nc (nc) in auto mode
[INFO] Setting up libgeoip1:amd64 (1.6.9-4) ...
[INFO] Processing triggers for libc-bin (2.24-11+deb9u3) ...
[INFO] Setting up liblwres141:amd64 (1:9.10.3.dfsg.P4-12.3+deb9u4) ...
[INFO] Setting up netcat (1.10-41) ...
[INFO] Setting up python-kazoo (2.2.1-1) ...
[INFO] Setting up libisc160:amd64 (1:9.10.3.dfsg.P4-12.3+deb9u4) ...
[INFO] Setting up libisccc140:amd64 (1:9.10.3.dfsg.P4-12.3+deb9u4) ...
[INFO] Setting up libdns162:amd64 (1:9.10.3.dfsg.P4-12.3+deb9u4) ...
[INFO] Setting up libisccfg140:amd64 (1:9.10.3.dfsg.P4-12.3+deb9u4) ...
[INFO] Setting up libbind9-140:amd64 (1:9.10.3.dfsg.P4-12.3+deb9u4) ...
[INFO] Setting up bind9-host (1:9.10.3.dfsg.P4-12.3+deb9u4) ...
[INFO] Setting up dnsutils (1:9.10.3.dfsg.P4-12.3+deb9u4) ...
[INFO] Processing triggers for libc-bin (2.24-11+deb9u3) ...
[INFO] ---> dd2d2066016e
[INFO] Removing intermediate container 44d488f8c94b
[INFO] Step 3/12 : ARG PULSAR_TARBALL
[INFO] ---> Running in 3014568cc302
[INFO] ---> 197a05c3b3a3
[INFO] Removing intermediate container 3014568cc302
[INFO] Step 4/12 : ADD ${PULSAR_TARBALL} /
[INFO] ---> 213abcfd4b64
[INFO] Removing intermediate container 82f341af2f84
[INFO] Step 5/12 : RUN mv /apache-pulsar-* /pulsar
[INFO] ---> Running in ae6130fd50d0
[INFO] ---> a2fab36c37ec
[INFO] Removing intermediate container ae6130fd50d0
[INFO] Step 6/12 : COPY scripts/apply-config-from-env.py /pulsar/bin
[INFO] ---> 2c47af19a470
[INFO] Removing intermediate container 1faccf10e159
[INFO] Step 7/12 : COPY scripts/generate-zookeeper-config.sh /pulsar/bin
[INFO] ---> 759aae927e38
[INFO] Removing intermediate container 6fc626bcbfc1
[INFO] Step 8/12 : COPY scripts/pulsar-zookeeper-ruok.sh /pulsar/bin
[INFO] ---> 7d94bbf5e7ec
[INFO] Removing intermediate container ed0a7d6d322b
[INFO] Step 9/12 : COPY scripts/watch-znode.py /pulsar/bin
[INFO] ---> 90e41499a5b9
[INFO] Removing intermediate container a5686971c10b
[INFO] Step 10/12 : WORKDIR /pulsar
[INFO] ---> 96d9f458fa75
[INFO] Removing intermediate container 7b7b5361f737
[INFO] Step 11/12 : VOLUME /pulsar/conf /pulsar/data
[INFO] ---> Running in 6affba2faee9
[INFO] ---> c6190fc8e350
[INFO] Removing intermediate container 6affba2faee9
[INFO] Step 12/12 : ENV PULSAR_ROOT_LOGGER INFO,CONSOLE
[INFO] ---> Running in 470407f68b43
[INFO] ---> 68c38f79bea7
[INFO] Removing intermediate container 470407f68b43
[INFO] Successfully built 68c38f79bea7
[INFO] Successfully tagged apachepulsar/pulsar:2.2.0-incubating-SNAPSHOT
[INFO]
[INFO] Detected build of image with id 68c38f79bea7
[INFO] Building jar: <https://builds.apache.org/job/pulsar-master/ws/docker/pulsar/target/pulsar-docker-image-docker-info.jar>
[INFO] Successfully built apachepulsar/pulsar:2.2.0-incubating-SNAPSHOT
[INFO]
[INFO] --- dockerfile-maven-plugin:1.3.7:tag (add-no-repo-and-version) @ pulsar-docker-image ---
[INFO] Tagging image 68c38f79bea7 as pulsar:2.2.0-incubating-SNAPSHOT
[INFO]
[INFO] --- dockerfile-maven-plugin:1.3.7:tag (add-no-repo-and-latest) @ pulsar-docker-image ---
[INFO] Tagging image 68c38f79bea7 as pulsar:latest
[INFO]
[INFO] --- dockerfile-maven-plugin:1.3.7:tag (tag-and-push-latest) @ pulsar-docker-image ---
[INFO] Tagging image 68c38f79bea7 as apachepulsar/pulsar:latest
[INFO]
[INFO] ------------------------------------------------------------------------
[INFO] Building Apache Pulsar :: Docker Images :: Grafana 2.2.0-incubating-SNAPSHOT
[INFO] ------------------------------------------------------------------------
[INFO]
[INFO] --- git-commit-id-plugin:2.2.4:revision (git-info) @ grafana-docker-image ---
[INFO]
[INFO] --- maven-dependency-plugin:2.10:build-classpath (build-classpath) @ grafana-docker-image ---
[INFO] No dependencies found.
[INFO] Skipped writing classpath file '<https://builds.apache.org/job/pulsar-master/ws/docker/grafana/target/classpath.txt'.> No changes found.
[INFO]
[INFO] --- maven-remote-resources-plugin:1.5:process (process-resource-bundles) @ grafana-docker-image ---
[INFO]
[INFO] --- maven-site-plugin:3.5.1:attach-descriptor (attach-descriptor) @ grafana-docker-image ---
[INFO]
[INFO] --- dockerfile-maven-plugin:1.3.7:build (default) @ grafana-docker-image ---
[INFO] Building Docker context <https://builds.apache.org/job/pulsar-master/ws/docker/grafana>
[INFO]
[INFO] Image will be built as apachepulsar/pulsar-grafana:2.2.0-incubating-SNAPSHOT
[INFO]
[INFO] Step 1/7 : FROM grafana/grafana:4.3.1
[INFO] Pulling from grafana/grafana
[INFO] Image cd9a7cbe58f4: Already exists
[INFO] Image a3ed95caeb02: Already exists
[INFO] Image 1f89dd4718fb: Already exists
[INFO] Image dcb5e000075d: Already exists
[INFO] Digest: sha256:638de4abf76ae34dc5a79b5d8d7d06426b59bf2607ac74a399d441f49f886054
[INFO] Status: Downloaded newer image for grafana/grafana:4.3.1
[INFO] ---> 2cdb407c0fa4
[INFO] Step 2/7 : COPY grafana.ini /etc/grafana/grafana.ini
[INFO] ---> Using cache
[INFO] ---> 722cfcaea2ca
[INFO] Step 3/7 : COPY dashboards/* /var/lib/grafana/dashboards/
[INFO] ---> Using cache
[INFO] ---> 2507eea5c9f9
[INFO] Step 4/7 : COPY start.sh /start.sh
[INFO] ---> Using cache
[INFO] ---> 84f348bf4d1a
[INFO] Step 5/7 : EXPOSE 3000
[INFO] ---> Using cache
[INFO] ---> e4fd6e5f1e08
[INFO] Step 6/7 : ENV PROMETHEUS_URL http://prometheus:9090
[INFO] ---> Using cache
[INFO] ---> 2d05f73a97b6
[INFO] Step 7/7 : ENTRYPOINT /start.sh
[INFO] ---> Using cache
[INFO] ---> ee74882727ee
[INFO] Successfully built ee74882727ee
[INFO] Successfully tagged apachepulsar/pulsar-grafana:2.2.0-incubating-SNAPSHOT
[INFO]
[INFO] Detected build of image with id ee74882727ee
[INFO] Building jar: <https://builds.apache.org/job/pulsar-master/ws/docker/grafana/target/grafana-docker-image-docker-info.jar>
[INFO] Successfully built apachepulsar/pulsar-grafana:2.2.0-incubating-SNAPSHOT
[INFO]
[INFO] --- dockerfile-maven-plugin:1.3.7:tag (add-no-repo-and-version) @ grafana-docker-image ---
[INFO] Tagging image ee74882727ee as pulsar-grafana:2.2.0-incubating-SNAPSHOT
[INFO]
[INFO] --- dockerfile-maven-plugin:1.3.7:tag (add-no-repo-and-latest) @ grafana-docker-image ---
[INFO] Tagging image ee74882727ee as pulsar-grafana:latest
[INFO]
[INFO] --- dockerfile-maven-plugin:1.3.7:tag (tag-and-push-latest) @ grafana-docker-image ---
[INFO] Tagging image ee74882727ee as apachepulsar/pulsar-grafana:latest
[INFO] ------------------------------------------------------------------------
[INFO] Reactor Summary:
[INFO]
[INFO] Apache Pulsar :: Docker Images ..................... SUCCESS [ 7.724 s]
[INFO] Apache Pulsar :: Docker Images :: Pulsar Latest Version SUCCESS [02:33 min]
[INFO] Apache Pulsar :: Docker Images :: Grafana .......... SUCCESS [ 3.006 s]
[INFO] ------------------------------------------------------------------------
[INFO] BUILD SUCCESS
[INFO] ------------------------------------------------------------------------
[INFO] Total time: 02:44 min
[INFO] Finished at: 2018-06-29T01:32:11Z
[INFO] Final Memory: 58M/1794M
[INFO] ------------------------------------------------------------------------
[INFO] Scanning for projects...
[ERROR] [ERROR] Some problems were encountered while processing the POMs:
[FATAL] Non-resolvable parent POM for org.apache.pulsar:dashboard-docker-image:[unknown-version]: Could not find artifact org.apache.pulsar:docker-images:pom:2.1.0-incubating-SNAPSHOT and 'parent.relativePath' points at wrong local POM @ line 23, column 11
@
[ERROR] The build could not read 1 project -> [Help 1]
[ERROR]
[ERROR] The project org.apache.pulsar:dashboard-docker-image:[unknown-version] (<https://builds.apache.org/job/pulsar-master/ws/docker/../dashboard/pom.xml)> has 1 error
[ERROR] Non-resolvable parent POM for org.apache.pulsar:dashboard-docker-image:[unknown-version]: Could not find artifact org.apache.pulsar:docker-images:pom:2.1.0-incubating-SNAPSHOT and 'parent.relativePath' points at wrong local POM @ line 23, column 11 -> [Help 2]
[ERROR]
[ERROR] To see the full stack trace of the errors, re-run Maven with the -e switch.
[ERROR] Re-run Maven using the -X switch to enable full debug logging.
[ERROR]
[ERROR] For more information about the errors and possible solutions, please read the following articles:
[ERROR] [Help 1] http://cwiki.apache.org/confluence/display/MAVEN/ProjectBuildingException
[ERROR] [Help 2] http://cwiki.apache.org/confluence/display/MAVEN/UnresolvableModelException
Build step 'Execute shell' marked build as failure
Not sending mail to unregistered user github@alasdairhodge.co.uk
Not sending mail to unregistered user guosijie@gmail.com
Jenkins build is unstable: pulsar-master #572
Posted by Apache Jenkins Server <je...@builds.apache.org>.
See <https://builds.apache.org/job/pulsar-master/572/display/redirect?page=changes>
Build failed in Jenkins: pulsar-master #571
Posted by Apache Jenkins Server <je...@builds.apache.org>.
See <https://builds.apache.org/job/pulsar-master/571/display/redirect?page=changes>
Changes:
[guosijie] Enable authentication and authorization for some admin APIs (#2046)
------------------------------------------
[...truncated 2.85 MB...]
[INFO] libisc160 libisccc140 libisccfg140 liblwres141 netcat netcat-traditional
[INFO] python-kazoo
[INFO] 0 upgraded, 13 newly installed, 0 to remove and 0 not upgraded.
[INFO] Need to get 5196 kB of archives.
[INFO] After this operation, 15.4 MB of additional disk space will be used.
[INFO] Get:1 http://deb.debian.org/debian stretch/main amd64 libgeoip1 amd64 1.6.9-4 [90.5 kB]
[INFO] Get:2 http://deb.debian.org/debian stretch/main amd64 libisc160 amd64 1:9.10.3.dfsg.P4-12.3+deb9u4 [398 kB]
[INFO] Get:3 http://deb.debian.org/debian stretch/main amd64 libdns162 amd64 1:9.10.3.dfsg.P4-12.3+deb9u4 [1077 kB]
[INFO] Get:4 http://deb.debian.org/debian stretch/main amd64 libisccc140 amd64 1:9.10.3.dfsg.P4-12.3+deb9u4 [198 kB]
[INFO] Get:5 http://deb.debian.org/debian stretch/main amd64 libisccfg140 amd64 1:9.10.3.dfsg.P4-12.3+deb9u4 [223 kB]
[INFO] Get:6 http://deb.debian.org/debian stretch/main amd64 libbind9-140 amd64 1:9.10.3.dfsg.P4-12.3+deb9u4 [206 kB]
[INFO] Get:7 http://deb.debian.org/debian stretch/main amd64 liblwres141 amd64 1:9.10.3.dfsg.P4-12.3+deb9u4 [214 kB]
[INFO] Get:8 http://deb.debian.org/debian stretch/main amd64 bind9-host amd64 1:9.10.3.dfsg.P4-12.3+deb9u4 [231 kB]
[INFO] Get:9 http://deb.debian.org/debian stretch/main amd64 netcat-traditional amd64 1.10-41+b1 [67.0 kB]
[INFO] Get:10 http://deb.debian.org/debian stretch/main amd64 dnsutils amd64 1:9.10.3.dfsg.P4-12.3+deb9u4 [283 kB]
[INFO] Get:11 http://deb.debian.org/debian stretch/main amd64 geoip-database all 20170512-1 [2112 kB]
[INFO] Get:12 http://deb.debian.org/debian stretch/main amd64 python-kazoo all 2.2.1-1 [88.2 kB]
[INFO] Get:13 http://deb.debian.org/debian stretch/main amd64 netcat all 1.10-41 [8962 B]
[INFO] debconf: delaying package configuration, since apt-utils is not installed
[INFO]
[INFO] Fetched 5196 kB in 0s (20.8 MB/s)
[INFO] Selecting previously unselected package libgeoip1:amd64.
[INFO] (Reading database ...
[INFO] (Reading database ... 5%
[INFO] (Reading database ... 10%
[INFO] (Reading database ... 15%
[INFO] (Reading database ... 20%
[INFO] (Reading database ... 25%
[INFO] (Reading database ... 30%
[INFO] (Reading database ... 35%(Reading database ... 40%(Reading database ... 45%(Reading database ... 50%(Reading database ... 55%(Reading database ... 60%(Reading database ... 65%(Reading database ... 70%(Reading database ... 75%(Reading database ... 80%(Reading database ... 85%(Reading database ... 90%(Reading database ... 95%(Reading database ... 100%(Reading database ... 21470 files and directories currently installed.)
[INFO] Preparing to unpack .../00-libgeoip1_1.6.9-4_amd64.deb ...
[INFO] Unpacking libgeoip1:amd64 (1.6.9-4) ...
[INFO] Selecting previously unselected package libisc160:amd64.
[INFO] Preparing to unpack .../01-libisc160_1%3a9.10.3.dfsg.P4-12.3+deb9u4_amd64.deb ...
[INFO] Unpacking libisc160:amd64 (1:9.10.3.dfsg.P4-12.3+deb9u4) ...
[INFO] Selecting previously unselected package libdns162:amd64.
[INFO] Preparing to unpack .../02-libdns162_1%3a9.10.3.dfsg.P4-12.3+deb9u4_amd64.deb ...
[INFO] Unpacking libdns162:amd64 (1:9.10.3.dfsg.P4-12.3+deb9u4) ...
[INFO] Selecting previously unselected package libisccc140:amd64.
[INFO] Preparing to unpack .../03-libisccc140_1%3a9.10.3.dfsg.P4-12.3+deb9u4_amd64.deb ...
[INFO] Unpacking libisccc140:amd64 (1:9.10.3.dfsg.P4-12.3+deb9u4) ...
[INFO] Selecting previously unselected package libisccfg140:amd64.
[INFO] Preparing to unpack .../04-libisccfg140_1%3a9.10.3.dfsg.P4-12.3+deb9u4_amd64.deb ...
[INFO] Unpacking libisccfg140:amd64 (1:9.10.3.dfsg.P4-12.3+deb9u4) ...
[INFO] Selecting previously unselected package libbind9-140:amd64.
[INFO] Preparing to unpack .../05-libbind9-140_1%3a9.10.3.dfsg.P4-12.3+deb9u4_amd64.deb ...
[INFO] Unpacking libbind9-140:amd64 (1:9.10.3.dfsg.P4-12.3+deb9u4) ...
[INFO] Selecting previously unselected package liblwres141:amd64.
[INFO] Preparing to unpack .../06-liblwres141_1%3a9.10.3.dfsg.P4-12.3+deb9u4_amd64.deb ...
[INFO] Unpacking liblwres141:amd64 (1:9.10.3.dfsg.P4-12.3+deb9u4) ...
[INFO] Selecting previously unselected package bind9-host.
[INFO] Preparing to unpack .../07-bind9-host_1%3a9.10.3.dfsg.P4-12.3+deb9u4_amd64.deb ...
[INFO] Unpacking bind9-host (1:9.10.3.dfsg.P4-12.3+deb9u4) ...
[INFO] Selecting previously unselected package netcat-traditional.
[INFO] Preparing to unpack .../08-netcat-traditional_1.10-41+b1_amd64.deb ...
[INFO] Unpacking netcat-traditional (1.10-41+b1) ...
[INFO] Selecting previously unselected package dnsutils.
[INFO] Preparing to unpack .../09-dnsutils_1%3a9.10.3.dfsg.P4-12.3+deb9u4_amd64.deb ...
[INFO] Unpacking dnsutils (1:9.10.3.dfsg.P4-12.3+deb9u4) ...
[INFO] Selecting previously unselected package geoip-database.
[INFO] Preparing to unpack .../10-geoip-database_20170512-1_all.deb ...
[INFO] Unpacking geoip-database (20170512-1) ...
[INFO] Selecting previously unselected package python-kazoo.
[INFO] Preparing to unpack .../11-python-kazoo_2.2.1-1_all.deb ...
[INFO] Unpacking python-kazoo (2.2.1-1) ...
[INFO] Selecting previously unselected package netcat.
[INFO] Preparing to unpack .../12-netcat_1.10-41_all.deb ...
[INFO] Unpacking netcat (1.10-41) ...
[INFO] Setting up geoip-database (20170512-1) ...
[INFO] Setting up netcat-traditional (1.10-41+b1) ...
[INFO] update-alternatives: using /bin/nc.traditional to provide /bin/nc (nc) in auto mode
[INFO] Setting up libgeoip1:amd64 (1.6.9-4) ...
[INFO] Processing triggers for libc-bin (2.24-11+deb9u3) ...
[INFO] Setting up liblwres141:amd64 (1:9.10.3.dfsg.P4-12.3+deb9u4) ...
[INFO] Setting up netcat (1.10-41) ...
[INFO] Setting up python-kazoo (2.2.1-1) ...
[INFO] Setting up libisc160:amd64 (1:9.10.3.dfsg.P4-12.3+deb9u4) ...
[INFO] Setting up libisccc140:amd64 (1:9.10.3.dfsg.P4-12.3+deb9u4) ...
[INFO] Setting up libdns162:amd64 (1:9.10.3.dfsg.P4-12.3+deb9u4) ...
[INFO] Setting up libisccfg140:amd64 (1:9.10.3.dfsg.P4-12.3+deb9u4) ...
[INFO] Setting up libbind9-140:amd64 (1:9.10.3.dfsg.P4-12.3+deb9u4) ...
[INFO] Setting up bind9-host (1:9.10.3.dfsg.P4-12.3+deb9u4) ...
[INFO] Setting up dnsutils (1:9.10.3.dfsg.P4-12.3+deb9u4) ...
[INFO] Processing triggers for libc-bin (2.24-11+deb9u3) ...
[INFO] ---> 1844a76ca3ad
[INFO] Removing intermediate container 77f9b463130e
[INFO] Step 3/12 : ARG PULSAR_TARBALL
[INFO] ---> Running in 84fe532d0beb
[INFO] ---> 0946aa52cf02
[INFO] Removing intermediate container 84fe532d0beb
[INFO] Step 4/12 : ADD ${PULSAR_TARBALL} /
[INFO] ---> 25599b8ea5e6
[INFO] Removing intermediate container 4c95b8647249
[INFO] Step 5/12 : RUN mv /apache-pulsar-* /pulsar
[INFO] ---> Running in 8e5f690037f1
[INFO] ---> 1ad00a2ddcef
[INFO] Removing intermediate container 8e5f690037f1
[INFO] Step 6/12 : COPY scripts/apply-config-from-env.py /pulsar/bin
[INFO] ---> 5553b5781c74
[INFO] Removing intermediate container bae8bc10120a
[INFO] Step 7/12 : COPY scripts/generate-zookeeper-config.sh /pulsar/bin
[INFO] ---> 7dff11d24d64
[INFO] Removing intermediate container 9ea6be10cc30
[INFO] Step 8/12 : COPY scripts/pulsar-zookeeper-ruok.sh /pulsar/bin
[INFO] ---> f368b640a8cf
[INFO] Removing intermediate container 19044f963c12
[INFO] Step 9/12 : COPY scripts/watch-znode.py /pulsar/bin
[INFO] ---> 5169b0874bd9
[INFO] Removing intermediate container fc06d52161a0
[INFO] Step 10/12 : WORKDIR /pulsar
[INFO] ---> 2084fe68e3e3
[INFO] Removing intermediate container 2dac4d51d31d
[INFO] Step 11/12 : VOLUME /pulsar/conf /pulsar/data
[INFO] ---> Running in 3fc23fabe6da
[INFO] ---> 878301efc53a
[INFO] Removing intermediate container 3fc23fabe6da
[INFO] Step 12/12 : ENV PULSAR_ROOT_LOGGER INFO,CONSOLE
[INFO] ---> Running in 049d84f3fa1b
[INFO] ---> 310e3d4d6a0d
[INFO] Removing intermediate container 049d84f3fa1b
[INFO] Successfully built 310e3d4d6a0d
[INFO] Successfully tagged apachepulsar/pulsar:2.2.0-incubating-SNAPSHOT
[INFO]
[INFO] Detected build of image with id 310e3d4d6a0d
[INFO] Building jar: <https://builds.apache.org/job/pulsar-master/ws/docker/pulsar/target/pulsar-docker-image-docker-info.jar>
[INFO] Successfully built apachepulsar/pulsar:2.2.0-incubating-SNAPSHOT
[INFO]
[INFO] --- dockerfile-maven-plugin:1.3.7:tag (add-no-repo-and-version) @ pulsar-docker-image ---
[INFO] Tagging image 310e3d4d6a0d as pulsar:2.2.0-incubating-SNAPSHOT
[INFO]
[INFO] --- dockerfile-maven-plugin:1.3.7:tag (add-no-repo-and-latest) @ pulsar-docker-image ---
[INFO] Tagging image 310e3d4d6a0d as pulsar:latest
[INFO] Building jar: <https://builds.apache.org/job/pulsar-master/ws/docker/pulsar/target/pulsar-docker-image-docker-info.jar>
[INFO]
[INFO] --- dockerfile-maven-plugin:1.3.7:tag (tag-and-push-latest) @ pulsar-docker-image ---
[INFO] Tagging image 310e3d4d6a0d as apachepulsar/pulsar:latest
[INFO]
[INFO] ------------------------------------------------------------------------
[INFO] Building Apache Pulsar :: Docker Images :: Grafana 2.2.0-incubating-SNAPSHOT
[INFO] ------------------------------------------------------------------------
[INFO]
[INFO] --- git-commit-id-plugin:2.2.4:revision (git-info) @ grafana-docker-image ---
[INFO]
[INFO] --- maven-dependency-plugin:2.10:build-classpath (build-classpath) @ grafana-docker-image ---
[INFO] No dependencies found.
[INFO] Skipped writing classpath file '<https://builds.apache.org/job/pulsar-master/ws/docker/grafana/target/classpath.txt'.> No changes found.
[INFO]
[INFO] --- maven-remote-resources-plugin:1.5:process (process-resource-bundles) @ grafana-docker-image ---
[INFO]
[INFO] --- maven-site-plugin:3.5.1:attach-descriptor (attach-descriptor) @ grafana-docker-image ---
[INFO]
[INFO] --- dockerfile-maven-plugin:1.3.7:build (default) @ grafana-docker-image ---
[INFO] Building Docker context <https://builds.apache.org/job/pulsar-master/ws/docker/grafana>
[INFO]
[INFO] Image will be built as apachepulsar/pulsar-grafana:2.2.0-incubating-SNAPSHOT
[INFO]
[INFO] Step 1/7 : FROM grafana/grafana:4.3.1
[INFO] Pulling from grafana/grafana
[INFO] Image cd9a7cbe58f4: Pulling fs layer
[INFO] Image a3ed95caeb02: Pulling fs layer
[INFO] Image 1f89dd4718fb: Pulling fs layer
[INFO] Image dcb5e000075d: Pulling fs layer
[INFO] Image a3ed95caeb02: Download complete
[INFO] Image 1f89dd4718fb: Downloading
[INFO] Image cd9a7cbe58f4: Downloading
[INFO] Image dcb5e000075d: Downloading
[INFO] Image dcb5e000075d: Download complete
[INFO] Image 1f89dd4718fb: Verifying Checksum
[INFO] Image 1f89dd4718fb: Download complete
[INFO] Image cd9a7cbe58f4: Download complete
[INFO] Image cd9a7cbe58f4: Extracting
[INFO] Image cd9a7cbe58f4: Pull complete
[INFO] Image a3ed95caeb02: Extracting
[INFO] Image a3ed95caeb02: Pull complete
[INFO] Image 1f89dd4718fb: Extracting
[INFO] Image 1f89dd4718fb: Pull complete
[INFO] Image dcb5e000075d: Extracting
[INFO] Image dcb5e000075d: Pull complete
[INFO] Digest: sha256:638de4abf76ae34dc5a79b5d8d7d06426b59bf2607ac74a399d441f49f886054
[INFO] Status: Downloaded newer image for grafana/grafana:4.3.1
[INFO] ---> 2cdb407c0fa4
[INFO] Step 2/7 : COPY grafana.ini /etc/grafana/grafana.ini
[INFO] ---> fe1aaaaeb9fa
[INFO] Removing intermediate container 39046ce3738a
[INFO] Step 3/7 : COPY dashboards/* /var/lib/grafana/dashboards/
[INFO] ---> bdc95bd1f036
[INFO] Removing intermediate container 1278117c6a30
[INFO] Step 4/7 : COPY start.sh /start.sh
[INFO] ---> 219ebd7ac69b
[INFO] Removing intermediate container b559687c65a9
[INFO] Step 5/7 : EXPOSE 3000
[INFO] ---> Running in eb8665c9a4ce
[INFO] ---> 84ffa450e152
[INFO] Removing intermediate container eb8665c9a4ce
[INFO] Step 6/7 : ENV PROMETHEUS_URL http://prometheus:9090
[INFO] ---> Running in ff1ca04cdde0
[INFO] ---> ecbeefbc0546
[INFO] Removing intermediate container ff1ca04cdde0
[INFO] Step 7/7 : ENTRYPOINT /start.sh
[INFO] ---> Running in 822ce2a472e9
[INFO] ---> a9e13dfa6074
[INFO] Removing intermediate container 822ce2a472e9
[INFO] Successfully built a9e13dfa6074
[INFO] Successfully tagged apachepulsar/pulsar-grafana:2.2.0-incubating-SNAPSHOT
[INFO]
[INFO] Detected build of image with id a9e13dfa6074
[INFO] Building jar: <https://builds.apache.org/job/pulsar-master/ws/docker/grafana/target/grafana-docker-image-docker-info.jar>
[INFO] Successfully built apachepulsar/pulsar-grafana:2.2.0-incubating-SNAPSHOT
[INFO]
[INFO] --- dockerfile-maven-plugin:1.3.7:tag (add-no-repo-and-version) @ grafana-docker-image ---
[INFO] Tagging image a9e13dfa6074 as pulsar-grafana:2.2.0-incubating-SNAPSHOT
[INFO]
[INFO] --- dockerfile-maven-plugin:1.3.7:tag (add-no-repo-and-latest) @ grafana-docker-image ---
[INFO] Tagging image a9e13dfa6074 as pulsar-grafana:latest
[INFO] Building jar: <https://builds.apache.org/job/pulsar-master/ws/docker/grafana/target/grafana-docker-image-docker-info.jar>
[INFO]
[INFO] --- dockerfile-maven-plugin:1.3.7:tag (tag-and-push-latest) @ grafana-docker-image ---
[INFO] Tagging image a9e13dfa6074 as apachepulsar/pulsar-grafana:latest
[INFO] ------------------------------------------------------------------------
[INFO] Reactor Summary:
[INFO]
[INFO] Apache Pulsar :: Docker Images ..................... SUCCESS [ 8.517 s]
[INFO] Apache Pulsar :: Docker Images :: Pulsar Latest Version SUCCESS [02:03 min]
[INFO] Apache Pulsar :: Docker Images :: Grafana .......... SUCCESS [ 24.902 s]
[INFO] ------------------------------------------------------------------------
[INFO] BUILD SUCCESS
[INFO] ------------------------------------------------------------------------
[INFO] Total time: 02:37 min
[INFO] Finished at: 2018-06-28T19:45:11Z
[INFO] Final Memory: 60M/1783M
[INFO] ------------------------------------------------------------------------
[INFO] Scanning for projects...
[ERROR] [ERROR] Some problems were encountered while processing the POMs:
[FATAL] Non-resolvable parent POM for org.apache.pulsar:dashboard-docker-image:[unknown-version]: Could not find artifact org.apache.pulsar:docker-images:pom:2.1.0-incubating-SNAPSHOT and 'parent.relativePath' points at wrong local POM @ line 23, column 11
@
[ERROR] The build could not read 1 project -> [Help 1]
[ERROR]
[ERROR] The project org.apache.pulsar:dashboard-docker-image:[unknown-version] (<https://builds.apache.org/job/pulsar-master/ws/docker/../dashboard/pom.xml)> has 1 error
[ERROR] Non-resolvable parent POM for org.apache.pulsar:dashboard-docker-image:[unknown-version]: Could not find artifact org.apache.pulsar:docker-images:pom:2.1.0-incubating-SNAPSHOT and 'parent.relativePath' points at wrong local POM @ line 23, column 11 -> [Help 2]
[ERROR]
[ERROR] To see the full stack trace of the errors, re-run Maven with the -e switch.
[ERROR] Re-run Maven using the -X switch to enable full debug logging.
[ERROR]
[ERROR] For more information about the errors and possible solutions, please read the following articles:
[ERROR] [Help 1] http://cwiki.apache.org/confluence/display/MAVEN/ProjectBuildingException
[ERROR] [Help 2] http://cwiki.apache.org/confluence/display/MAVEN/UnresolvableModelException
Build step 'Execute shell' marked build as failure
Not sending mail to unregistered user github@alasdairhodge.co.uk
Not sending mail to unregistered user guosijie@gmail.com