You are viewing a plain text version of this content. The canonical link for it is here.
Posted to builds@hbase.apache.org by Apache Jenkins Server <je...@builds.apache.org> on 2015/01/13 09:16:57 UTC
Build failed in Jenkins: HBase-TRUNK #6016
See <https://builds.apache.org/job/HBase-TRUNK/6016/changes>
Changes:
[mstanleyjones] HBASE-12777 Redirect multi-page book to single-page book
------------------------------------------
[...truncated 1855 lines...]
Running org.apache.hadoop.hbase.quotas.TestQuotaThrottle
Running org.apache.hadoop.hbase.wal.TestWALFactory
Running org.apache.hadoop.hbase.wal.TestDefaultWALProvider
Tests run: 9, Failures: 0, Errors: 0, Skipped: 0, Time elapsed: 294.858 sec - in org.apache.hadoop.hbase.snapshot.TestSecureExportSnapshot
Running org.apache.hadoop.hbase.wal.TestSecureWAL
Tests run: 1, Failures: 0, Errors: 0, Skipped: 0, Time elapsed: 1.484 sec - in org.apache.hadoop.hbase.wal.TestSecureWAL
Tests run: 5, Failures: 0, Errors: 0, Skipped: 0, Time elapsed: 6.72 sec - in org.apache.hadoop.hbase.wal.TestDefaultWALProvider
Tests run: 7, Failures: 0, Errors: 0, Skipped: 0, Time elapsed: 13.16 sec - in org.apache.hadoop.hbase.quotas.TestQuotaThrottle
Running org.apache.hadoop.hbase.wal.TestBoundedRegionGroupingProvider
Running org.apache.hadoop.hbase.wal.TestWALSplitCompressed
Tests run: 9, Failures: 0, Errors: 0, Skipped: 0, Time elapsed: 15.987 sec - in org.apache.hadoop.hbase.wal.TestWALFactory
Running org.apache.hadoop.hbase.wal.TestWALReaderOnSecureWAL
Tests run: 55, Failures: 0, Errors: 0, Skipped: 0, Time elapsed: 239.399 sec - in org.apache.hadoop.hbase.security.access.TestAccessController
Running org.apache.hadoop.hbase.wal.TestWALSplit
Tests run: 2, Failures: 0, Errors: 0, Skipped: 0, Time elapsed: 1.939 sec - in org.apache.hadoop.hbase.wal.TestWALReaderOnSecureWAL
Running org.apache.hadoop.hbase.wal.TestWALFiltering
Running org.apache.hadoop.hbase.wal.TestDefaultWALProviderWithHLogKey
Tests run: 5, Failures: 0, Errors: 0, Skipped: 0, Time elapsed: 13.99 sec - in org.apache.hadoop.hbase.wal.TestDefaultWALProviderWithHLogKey
Running org.apache.hadoop.hbase.TestLocalHBaseCluster
Tests run: 5, Failures: 0, Errors: 0, Skipped: 0, Time elapsed: 25.957 sec - in org.apache.hadoop.hbase.wal.TestBoundedRegionGroupingProvider
Tests run: 1, Failures: 0, Errors: 0, Skipped: 0, Time elapsed: 7.061 sec - in org.apache.hadoop.hbase.TestLocalHBaseCluster
Running org.apache.hadoop.hbase.master.TestRegionPlacement2
Tests run: 2, Failures: 0, Errors: 0, Skipped: 0, Time elapsed: 2.003 sec - in org.apache.hadoop.hbase.master.TestRegionPlacement2
Tests run: 1, Failures: 0, Errors: 0, Skipped: 0, Time elapsed: 32.015 sec - in org.apache.hadoop.hbase.wal.TestWALFiltering
Running org.apache.hadoop.hbase.master.TestActiveMasterManager
Running org.apache.hadoop.hbase.master.TestMasterOperationsForRegionReplicas
Tests run: 2, Failures: 0, Errors: 0, Skipped: 0, Time elapsed: 1.197 sec - in org.apache.hadoop.hbase.master.TestActiveMasterManager
Running org.apache.hadoop.hbase.master.TestSplitLogManager
Running org.apache.hadoop.hbase.master.TestRegionPlacement
Tests run: 2, Failures: 0, Errors: 0, Skipped: 0, Time elapsed: 16.413 sec - in org.apache.hadoop.hbase.master.TestMasterOperationsForRegionReplicas
Running org.apache.hadoop.hbase.master.TestMasterFileSystem
Tests run: 2, Failures: 0, Errors: 0, Skipped: 0, Time elapsed: 1.16 sec - in org.apache.hadoop.hbase.master.TestMasterFileSystem
Tests run: 2, Failures: 0, Errors: 0, Skipped: 0, Time elapsed: 18.935 sec - in org.apache.hadoop.hbase.master.TestRegionPlacement
Running org.apache.hadoop.hbase.master.TestDeadServer
Running org.apache.hadoop.hbase.master.TestMasterFailover
Tests run: 3, Failures: 0, Errors: 0, Skipped: 0, Time elapsed: 0.358 sec - in org.apache.hadoop.hbase.master.TestDeadServer
Running org.apache.hadoop.hbase.master.TestMasterStatusServlet
Tests run: 4, Failures: 0, Errors: 0, Skipped: 0, Time elapsed: 1.476 sec - in org.apache.hadoop.hbase.master.TestMasterStatusServlet
Running org.apache.hadoop.hbase.master.handler.TestTableDescriptorModification
Tests run: 3, Failures: 0, Errors: 0, Skipped: 0, Time elapsed: 3.777 sec - in org.apache.hadoop.hbase.master.handler.TestTableDescriptorModification
Running org.apache.hadoop.hbase.master.handler.TestCreateTableHandler
Tests run: 3, Failures: 0, Errors: 0, Skipped: 0, Time elapsed: 25.934 sec - in org.apache.hadoop.hbase.master.TestMasterFailover
Tests run: 3, Failures: 0, Errors: 0, Skipped: 0, Time elapsed: 19.705 sec - in org.apache.hadoop.hbase.master.handler.TestCreateTableHandler
Running org.apache.hadoop.hbase.master.TestMasterNoCluster
Running org.apache.hadoop.hbase.master.handler.TestTableDeleteFamilyHandler
Tests run: 1, Failures: 0, Errors: 0, Skipped: 0, Time elapsed: 2.013 sec - in org.apache.hadoop.hbase.master.handler.TestTableDeleteFamilyHandler
Running org.apache.hadoop.hbase.master.TestMaster
Tests run: 3, Failures: 0, Errors: 0, Skipped: 0, Time elapsed: 13.935 sec - in org.apache.hadoop.hbase.master.TestMasterNoCluster
Running org.apache.hadoop.hbase.master.TestGetLastFlushedSequenceId
Tests run: 4, Failures: 0, Errors: 0, Skipped: 0, Time elapsed: 6.704 sec - in org.apache.hadoop.hbase.master.TestMaster
Running org.apache.hadoop.hbase.master.snapshot.TestSnapshotFileCache
Tests run: 1, Failures: 0, Errors: 0, Skipped: 0, Time elapsed: 13.095 sec - in org.apache.hadoop.hbase.master.TestGetLastFlushedSequenceId
Running org.apache.hadoop.hbase.master.TestMasterFailoverBalancerPersistence
Tests run: 1, Failures: 0, Errors: 0, Skipped: 0, Time elapsed: 10.781 sec - in org.apache.hadoop.hbase.master.TestMasterFailoverBalancerPersistence
Tests run: 4, Failures: 0, Errors: 0, Skipped: 0, Time elapsed: 17.331 sec - in org.apache.hadoop.hbase.master.snapshot.TestSnapshotFileCache
Running org.apache.hadoop.hbase.master.TestRollingRestart
Running org.apache.hadoop.hbase.master.TestMasterMetrics
Tests run: 2, Failures: 0, Errors: 0, Skipped: 0, Time elapsed: 1.486 sec - in org.apache.hadoop.hbase.master.TestMasterMetrics
Running org.apache.hadoop.hbase.master.TestMasterShutdown
Tests run: 2, Failures: 0, Errors: 0, Skipped: 0, Time elapsed: 12.105 sec - in org.apache.hadoop.hbase.master.TestMasterShutdown
Tests run: 1, Failures: 0, Errors: 0, Skipped: 0, Time elapsed: 19.55 sec - in org.apache.hadoop.hbase.master.TestRollingRestart
Running org.apache.hadoop.hbase.master.TestRestartCluster
Running org.apache.hadoop.hbase.master.cleaner.TestLogsCleaner
Tests run: 1, Failures: 0, Errors: 0, Skipped: 0, Time elapsed: 12.058 sec - in org.apache.hadoop.hbase.master.cleaner.TestLogsCleaner
Tests run: 15, Failures: 0, Errors: 0, Skipped: 0, Time elapsed: 139.498 sec - in org.apache.hadoop.hbase.master.TestSplitLogManager
Running org.apache.hadoop.hbase.master.cleaner.TestSnapshotFromMaster
Running org.apache.hadoop.hbase.master.cleaner.TestHFileCleaner
Tests run: 3, Failures: 0, Errors: 0, Skipped: 0, Time elapsed: 1.032 sec - in org.apache.hadoop.hbase.master.cleaner.TestHFileCleaner
Tests run: 31, Failures: 0, Errors: 0, Skipped: 0, Time elapsed: 190.518 sec - in org.apache.hadoop.hbase.wal.TestWALSplitCompressed
Tests run: 2, Failures: 0, Errors: 0, Skipped: 0, Time elapsed: 30.257 sec - in org.apache.hadoop.hbase.master.TestRestartCluster
Running org.apache.hadoop.hbase.master.TestClusterStatusPublisher
Tests run: 31, Failures: 0, Errors: 0, Skipped: 0, Time elapsed: 193.529 sec - in org.apache.hadoop.hbase.wal.TestWALSplit
Tests run: 4, Failures: 0, Errors: 0, Skipped: 0, Time elapsed: 10.597 sec - in org.apache.hadoop.hbase.master.cleaner.TestSnapshotFromMaster
Tests run: 3, Failures: 0, Errors: 0, Skipped: 0, Time elapsed: 0.516 sec - in org.apache.hadoop.hbase.master.TestClusterStatusPublisher
Running org.apache.hadoop.hbase.master.TestHMasterRPCException
Running org.apache.hadoop.hbase.master.TestMasterTransitions
Running org.apache.hadoop.hbase.master.TestTableLockManager
Running org.apache.hadoop.hbase.master.TestMasterMetricsWrapper
Tests run: 3, Failures: 0, Errors: 0, Skipped: 3, Time elapsed: 1.816 sec - in org.apache.hadoop.hbase.master.TestMasterTransitions
Tests run: 1, Failures: 0, Errors: 0, Skipped: 0, Time elapsed: 2.896 sec - in org.apache.hadoop.hbase.master.TestHMasterRPCException
Tests run: 1, Failures: 0, Errors: 0, Skipped: 0, Time elapsed: 1.489 sec - in org.apache.hadoop.hbase.master.TestMasterMetricsWrapper
Running org.apache.hadoop.hbase.master.balancer.TestDefaultLoadBalancer
Running org.apache.hadoop.hbase.master.balancer.TestStochasticLoadBalancer
Running org.apache.hadoop.hbase.master.balancer.TestBaseLoadBalancer
Tests run: 1, Failures: 0, Errors: 0, Skipped: 0, Time elapsed: 1.936 sec - in org.apache.hadoop.hbase.master.balancer.TestDefaultLoadBalancer
Tests run: 7, Failures: 0, Errors: 0, Skipped: 0, Time elapsed: 0.633 sec - in org.apache.hadoop.hbase.master.balancer.TestBaseLoadBalancer
Running org.apache.hadoop.hbase.master.TestMasterRestartAfterDisablingTable
Running org.apache.hadoop.hbase.master.TestAssignmentListener
Tests run: 2, Failures: 0, Errors: 0, Skipped: 0, Time elapsed: 5.538 sec - in org.apache.hadoop.hbase.master.TestAssignmentListener
Running org.apache.hadoop.hbase.master.TestAssignmentManagerOnCluster
Running org.apache.hadoop.hbase.master.TestDistributedLogSplitting
Tests run: 1, Failures: 0, Errors: 0, Skipped: 0, Time elapsed: 13.119 sec - in org.apache.hadoop.hbase.master.TestMasterRestartAfterDisablingTable
Running org.apache.hadoop.hbase.TestMetaTableAccessorNoCluster
Tests run: 2, Failures: 0, Errors: 0, Skipped: 0, Time elapsed: 3.384 sec - in org.apache.hadoop.hbase.TestMetaTableAccessorNoCluster
Running org.apache.hadoop.hbase.mapred.TestTableSnapshotInputFormat
Tests run: 20, Failures: 0, Errors: 0, Skipped: 0, Time elapsed: 33.431 sec - in org.apache.hadoop.hbase.master.TestAssignmentManagerOnCluster
Running org.apache.hadoop.hbase.mapred.TestTableMapReduceUtil
Tests run: 5, Failures: 0, Errors: 0, Skipped: 0, Time elapsed: 94.083 sec - in org.apache.hadoop.hbase.master.TestTableLockManager
Running org.apache.hadoop.hbase.mapred.TestTableInputFormat
Tests run: 10, Failures: 0, Errors: 0, Skipped: 0, Time elapsed: 5.963 sec - in org.apache.hadoop.hbase.mapred.TestTableInputFormat
Running org.apache.hadoop.hbase.mapred.TestTableMapReduce
Tests run: 18, Failures: 0, Errors: 0, Skipped: 0, Time elapsed: 135.707 sec - in org.apache.hadoop.hbase.master.TestDistributedLogSplitting
Running org.apache.hadoop.hbase.TestIOFencing
Tests run: 4, Failures: 0, Errors: 0, Skipped: 0, Time elapsed: 95.973 sec - in org.apache.hadoop.hbase.mapred.TestTableMapReduceUtil
Running org.apache.hadoop.hbase.TestMetaTableLocator
Tests run: 7, Failures: 0, Errors: 0, Skipped: 0, Time elapsed: 3.547 sec - in org.apache.hadoop.hbase.TestMetaTableLocator
Running org.apache.hadoop.hbase.util.TestRegionSplitter
Tests run: 6, Failures: 0, Errors: 0, Skipped: 0, Time elapsed: 5.038 sec - in org.apache.hadoop.hbase.util.TestRegionSplitter
Running org.apache.hadoop.hbase.util.TestFSHDFSUtils
Tests run: 3, Failures: 0, Errors: 0, Skipped: 0, Time elapsed: 4.794 sec - in org.apache.hadoop.hbase.util.TestFSHDFSUtils
Running org.apache.hadoop.hbase.util.TestFSVisitor
Tests run: 3, Failures: 0, Errors: 0, Skipped: 0, Time elapsed: 3.003 sec - in org.apache.hadoop.hbase.util.TestFSVisitor
Running org.apache.hadoop.hbase.util.TestMiniClusterLoadParallel
Tests run: 2, Failures: 0, Errors: 0, Skipped: 0, Time elapsed: 101.364 sec - in org.apache.hadoop.hbase.mapred.TestTableMapReduce
Running org.apache.hadoop.hbase.util.hbck.TestOfflineMetaRebuildOverlap
Tests run: 4, Failures: 0, Errors: 0, Skipped: 0, Time elapsed: 36.519 sec - in org.apache.hadoop.hbase.util.TestMiniClusterLoadParallel
Running org.apache.hadoop.hbase.util.hbck.TestOfflineMetaRebuildHole
Tests run: 1, Failures: 0, Errors: 0, Skipped: 0, Time elapsed: 20.217 sec - in org.apache.hadoop.hbase.util.hbck.TestOfflineMetaRebuildOverlap
Running org.apache.hadoop.hbase.util.hbck.TestOfflineMetaRebuildBase
Tests run: 1, Failures: 0, Errors: 0, Skipped: 0, Time elapsed: 18.418 sec - in org.apache.hadoop.hbase.util.hbck.TestOfflineMetaRebuildHole
Running org.apache.hadoop.hbase.util.TestFSTableDescriptors
Tests run: 16, Failures: 0, Errors: 0, Skipped: 0, Time elapsed: 2.594 sec - in org.apache.hadoop.hbase.util.TestFSTableDescriptors
Running org.apache.hadoop.hbase.util.TestMiniClusterLoadEncoded
Tests run: 1, Failures: 0, Errors: 0, Skipped: 0, Time elapsed: 20.886 sec - in org.apache.hadoop.hbase.util.hbck.TestOfflineMetaRebuildBase
Running org.apache.hadoop.hbase.util.TestDefaultEnvironmentEdge
Tests run: 1, Failures: 0, Errors: 0, Skipped: 0, Time elapsed: 0.427 sec - in org.apache.hadoop.hbase.util.TestDefaultEnvironmentEdge
Running org.apache.hadoop.hbase.util.TestTableName
Tests run: 5, Failures: 0, Errors: 0, Skipped: 0, Time elapsed: 0.568 sec - in org.apache.hadoop.hbase.util.TestTableName
Running org.apache.hadoop.hbase.util.TestMiniClusterLoadSequential
Tests run: 5, Failures: 0, Errors: 0, Skipped: 0, Time elapsed: 36.862 sec - in org.apache.hadoop.hbase.util.TestMiniClusterLoadEncoded
Running org.apache.hadoop.hbase.util.TestIdLock
Tests run: 6, Failures: 0, Errors: 0, Skipped: 0, Time elapsed: 277.77 sec - in org.apache.hadoop.hbase.mapred.TestTableSnapshotInputFormat
Running org.apache.hadoop.hbase.util.TestCoprocessorScanPolicy
Tests run: 1, Failures: 0, Errors: 0, Skipped: 0, Time elapsed: 15.41 sec - in org.apache.hadoop.hbase.util.TestIdLock
Tests run: 4, Failures: 0, Errors: 0, Skipped: 0, Time elapsed: 4.221 sec - in org.apache.hadoop.hbase.util.TestCoprocessorScanPolicy
Running org.apache.hadoop.hbase.util.TestFSUtils
Running org.apache.hadoop.hbase.util.TestMergeTool
Tests run: 4, Failures: 0, Errors: 0, Skipped: 0, Time elapsed: 37.328 sec - in org.apache.hadoop.hbase.util.TestMiniClusterLoadSequential
Running org.apache.hadoop.hbase.util.TestMergeTable
Tests run: 8, Failures: 0, Errors: 0, Skipped: 0, Time elapsed: 15.464 sec - in org.apache.hadoop.hbase.util.TestFSUtils
Running org.apache.hadoop.hbase.util.TestHBaseFsckEncryption
Tests run: 1, Failures: 0, Errors: 0, Skipped: 0, Time elapsed: 18.914 sec - in org.apache.hadoop.hbase.util.TestMergeTool
Tests run: 1, Failures: 0, Errors: 0, Skipped: 0, Time elapsed: 20.435 sec - in org.apache.hadoop.hbase.util.TestMergeTable
Tests run: 2, Failures: 0, Errors: 0, Skipped: 0, Time elapsed: 182.079 sec - in org.apache.hadoop.hbase.TestIOFencing
Running org.apache.hadoop.hbase.util.TestProcessBasedCluster
Tests run: 1, Failures: 0, Errors: 0, Skipped: 0, Time elapsed: 0.13 sec - in org.apache.hadoop.hbase.util.TestProcessBasedCluster
Tests run: 1, Failures: 0, Errors: 0, Skipped: 0, Time elapsed: 9.668 sec - in org.apache.hadoop.hbase.util.TestHBaseFsckEncryption
Running org.apache.hadoop.hbase.util.TestHBaseFsck
Running org.apache.hadoop.hbase.TestMetaTableAccessor
Tests run: 8, Failures: 0, Errors: 0, Skipped: 0, Time elapsed: 4.876 sec - in org.apache.hadoop.hbase.TestMetaTableAccessor
Tests run: 23, Failures: 0, Errors: 0, Skipped: 0, Time elapsed: 563.577 sec - in org.apache.hadoop.hbase.master.balancer.TestStochasticLoadBalancer
Tests run: 49, Failures: 0, Errors: 0, Skipped: 1, Time elapsed: 284.116 sec - in org.apache.hadoop.hbase.util.TestHBaseFsck
Results :
Tests in error:
TestHFileOutputFormat2.testMRIncrementalLoadWithSplit:370->doIncrementalLoadTest:428 » IO
Tests run: 2201, Failures: 0, Errors: 1, Skipped: 25
[INFO] ------------------------------------------------------------------------
[INFO] Reactor Summary:
[INFO]
[INFO] HBase ............................................. SUCCESS [3.114s]
[INFO] HBase - Checkstyle ................................ SUCCESS [0.668s]
[INFO] HBase - Annotations ............................... SUCCESS [0.835s]
[INFO] HBase - Protocol .................................. SUCCESS [13.261s]
[INFO] HBase - Common .................................... SUCCESS [56.510s]
[INFO] HBase - Client .................................... SUCCESS [1:15.341s]
[INFO] HBase - Hadoop Compatibility ...................... SUCCESS [7.016s]
[INFO] HBase - Hadoop Two Compatibility .................. SUCCESS [6.355s]
[INFO] HBase - Prefix Tree ............................... SUCCESS [8.609s]
[INFO] HBase - Server .................................... FAILURE [1:06:00.327s]
[INFO] HBase - Testing Util .............................. SKIPPED
[INFO] HBase - Thrift .................................... SKIPPED
[INFO] HBase - Shell ..................................... SKIPPED
[INFO] HBase - Integration Tests ......................... SKIPPED
[INFO] HBase - Examples .................................. SKIPPED
[INFO] HBase - Rest ...................................... SKIPPED
[INFO] HBase - Assembly .................................. SKIPPED
[INFO] ------------------------------------------------------------------------
[INFO] BUILD FAILURE
[INFO] ------------------------------------------------------------------------
[INFO] Total time: 1:08:52.841s
[INFO] Finished at: Tue Jan 13 08:14:19 UTC 2015
[INFO] Final Memory: 57M/835M
[INFO] ------------------------------------------------------------------------
[ERROR] Failed to execute goal org.apache.maven.plugins:maven-surefire-plugin:2.18:test (secondPartTestsExecution) on project hbase-server: There are test failures.
[ERROR]
[ERROR] Please refer to <https://builds.apache.org/job/HBase-TRUNK/ws/hbase-server/target/surefire-reports> for the individual test results.
[ERROR] -> [Help 1]
[ERROR]
[ERROR] To see the full stack trace of the errors, re-run Maven with the -e switch.
[ERROR] Re-run Maven using the -X switch to enable full debug logging.
[ERROR]
[ERROR] For more information about the errors and possible solutions, please read the following articles:
[ERROR] [Help 1] http://cwiki.apache.org/confluence/display/MAVEN/MojoFailureException
[ERROR]
[ERROR] After correcting the problems, you can resume the build with the command
[ERROR] mvn <goals> -rf :hbase-server
Build step 'Invoke top-level Maven targets' marked build as failure
[FINDBUGS] Skipping publisher since build result is FAILURE
Performing Post build task...
Match found for :.* : True
Logical operation result is TRUE
Running script : ZOMBIE_TESTS_COUNT=`jps | grep surefirebooter | wc -l`
if [[ $ZOMBIE_TESTS_COUNT != 0 ]] ; then
#It seems sometimes the tests are not dying immediately. Let's give them 10s
echo "Suspicious java process found - waiting 10s to see if there are just slow to stop"
sleep 10
ZOMBIE_TESTS_COUNT=`jps | grep surefirebooter | wc -l`
if [[ $ZOMBIE_TESTS_COUNT != 0 ]] ; then
echo "There are $ZOMBIE_TESTS_COUNT zombie tests, they should have been killed by surefire but survived"
echo "************ BEGIN zombies jstack extract"
ZB_STACK=`jps | grep surefirebooter | cut -d ' ' -f 1 | xargs -n 1 jstack | grep ".test" | grep "\.java"`
jps | grep surefirebooter | cut -d ' ' -f 1 | xargs -n 1 jstack
echo "************ END zombies jstack extract"
JIRA_COMMENT="$JIRA_COMMENT
{color:red}-1 core zombie tests{color}. There are ${ZOMBIE_TESTS_COUNT} zombie test(s): ${ZB_STACK}"
BAD=1
jps | grep surefirebooter | cut -d ' ' -f 1 | xargs kill -9
else
echo "We're ok: there is no zombie test, but some tests took some time to stop"
fi
else
echo "We're ok: there is no zombie test"
fi
[HBase-TRUNK] $ /bin/bash -xe /tmp/hudson95892793913088417.sh
++ jps
++ grep surefirebooter
++ wc -l
+ ZOMBIE_TESTS_COUNT=0
+ [[ 0 != 0 ]]
+ echo 'We'\''re ok: there is no zombie test'
We're ok: there is no zombie test
POST BUILD TASK : SUCCESS
END OF POST BUILD TASK : 0
Archiving artifacts
Sending artifact delta relative to HBase-TRUNK #6014
Archived 1822 artifacts
Archive block size is 32768
Received 31 blocks and 357928935 bytes
Compression is 0.3%
Took 1 min 51 sec
Recording test results
Updating HBASE-12777
Jenkins build is back to normal : HBase-TRUNK #6018
Posted by Apache Jenkins Server <je...@builds.apache.org>.
See <https://builds.apache.org/job/HBase-TRUNK/6018/changes>
Build failed in Jenkins: HBase-TRUNK #6017
Posted by Apache Jenkins Server <je...@builds.apache.org>.
See <https://builds.apache.org/job/HBase-TRUNK/6017/changes>
Changes:
[tedyu] HBASE-11144 Filter to support scanning multiple row key ranges (Jiajia Li)
------------------------------------------
[...truncated 1875 lines...]
Running org.apache.hadoop.hbase.client.TestSnapshotFromClient
Tests run: 49, Failures: 0, Errors: 0, Skipped: 1, Time elapsed: 289.044 sec - in org.apache.hadoop.hbase.util.TestHBaseFsck
Tests run: 5, Failures: 0, Errors: 0, Skipped: 0, Time elapsed: 10.733 sec - in org.apache.hadoop.hbase.client.TestSnapshotFromClient
Tests run: 5, Failures: 0, Errors: 0, Skipped: 0, Time elapsed: 48.838 sec - in org.apache.hadoop.hbase.client.TestCloneSnapshotFromClient
Running org.apache.hadoop.hbase.client.TestFromClientSideNoCodec
Tests run: 2, Failures: 0, Errors: 0, Skipped: 0, Time elapsed: 2.301 sec - in org.apache.hadoop.hbase.client.TestFromClientSideNoCodec
Running org.apache.hadoop.hbase.client.TestAdmin1
Running org.apache.hadoop.hbase.client.TestMultipleTimestamps
Tests run: 8, Failures: 0, Errors: 0, Skipped: 0, Time elapsed: 4.935 sec - in org.apache.hadoop.hbase.client.TestMultipleTimestamps
Running org.apache.hadoop.hbase.client.TestPutWithDelete
Tests run: 1, Failures: 0, Errors: 0, Skipped: 0, Time elapsed: 2.142 sec - in org.apache.hadoop.hbase.client.TestPutWithDelete
Running org.apache.hadoop.hbase.client.TestHCM
Running org.apache.hadoop.hbase.client.TestSnapshotFromClientWithRegionReplicas
Tests run: 2, Failures: 0, Errors: 0, Skipped: 0, Time elapsed: 45.04 sec - in org.apache.hadoop.hbase.client.TestMetaScanner
Tests run: 5, Failures: 0, Errors: 0, Skipped: 0, Time elapsed: 10.677 sec - in org.apache.hadoop.hbase.client.TestSnapshotFromClientWithRegionReplicas
Running org.apache.hadoop.hbase.client.TestAdmin2
Running org.apache.hadoop.hbase.client.replication.TestReplicationAdmin
Tests run: 5, Failures: 0, Errors: 0, Skipped: 0, Time elapsed: 0.38 sec - in org.apache.hadoop.hbase.client.replication.TestReplicationAdmin
Running org.apache.hadoop.hbase.client.TestSnapshotCloneIndependence
Tests run: 80, Failures: 0, Errors: 0, Skipped: 4, Time elapsed: 91.509 sec - in org.apache.hadoop.hbase.client.TestFromClientSideWithCoprocessor
Tests run: 24, Failures: 0, Errors: 0, Skipped: 0, Time elapsed: 55.911 sec - in org.apache.hadoop.hbase.client.TestAdmin1
Running org.apache.hadoop.hbase.client.TestCloneSnapshotFromClientWithRegionReplicas
Tests run: 6, Failures: 0, Errors: 0, Skipped: 0, Time elapsed: 22.752 sec - in org.apache.hadoop.hbase.client.TestSnapshotCloneIndependence
Running org.apache.hadoop.hbase.client.TestClientScannerRPCTimeout
Tests run: 1, Failures: 0, Errors: 0, Skipped: 0, Time elapsed: 7.59 sec - in org.apache.hadoop.hbase.client.TestClientScannerRPCTimeout
Running org.apache.hadoop.hbase.client.TestClientOperationInterrupt
Tests run: 23, Failures: 0, Errors: 0, Skipped: 0, Time elapsed: 46.057 sec - in org.apache.hadoop.hbase.client.TestAdmin2
Running org.apache.hadoop.hbase.client.TestRpcControllerFactory
Tests run: 1, Failures: 0, Errors: 0, Skipped: 0, Time elapsed: 2.297 sec - in org.apache.hadoop.hbase.client.TestRpcControllerFactory
Running org.apache.hadoop.hbase.client.TestScannersFromClientSide
Running org.apache.hadoop.hbase.client.TestCheckAndMutate
Tests run: 5, Failures: 0, Errors: 0, Skipped: 0, Time elapsed: 4.956 sec - in org.apache.hadoop.hbase.client.TestScannersFromClientSide
Tests run: 1, Failures: 0, Errors: 0, Skipped: 0, Time elapsed: 1.854 sec - in org.apache.hadoop.hbase.client.TestCheckAndMutate
Running org.apache.hadoop.hbase.client.TestFromClientSide
Running org.apache.hadoop.hbase.client.TestUpdateConfiguration
Tests run: 2, Failures: 0, Errors: 0, Skipped: 0, Time elapsed: 0.204 sec - in org.apache.hadoop.hbase.client.TestUpdateConfiguration
Running org.apache.hadoop.hbase.client.TestClientPushback
Tests run: 1, Failures: 0, Errors: 0, Skipped: 0, Time elapsed: 1.448 sec - in org.apache.hadoop.hbase.client.TestClientPushback
Tests run: 5, Failures: 0, Errors: 0, Skipped: 0, Time elapsed: 55.114 sec - in org.apache.hadoop.hbase.client.TestCloneSnapshotFromClientWithRegionReplicas
Running org.apache.hadoop.hbase.client.TestReplicaWithCluster
Running org.apache.hadoop.hbase.client.TestRestoreSnapshotFromClientWithRegionReplicas
Tests run: 1, Failures: 0, Errors: 0, Skipped: 0, Time elapsed: 54.017 sec - in org.apache.hadoop.hbase.client.TestClientOperationInterrupt
Running org.apache.hadoop.hbase.client.TestHTableMultiplexer
Tests run: 1, Failures: 0, Errors: 0, Skipped: 0, Time elapsed: 7.891 sec - in org.apache.hadoop.hbase.client.TestHTableMultiplexer
Running org.apache.hadoop.hbase.client.TestScannerTimeout
Tests run: 4, Failures: 0, Errors: 0, Skipped: 0, Time elapsed: 32.834 sec - in org.apache.hadoop.hbase.client.TestReplicaWithCluster
Tests run: 21, Failures: 0, Errors: 0, Skipped: 3, Time elapsed: 144.317 sec - in org.apache.hadoop.hbase.client.TestHCM
Running org.apache.hadoop.hbase.client.TestTableSnapshotScanner
Running org.apache.hadoop.hbase.client.TestReplicasClient
Tests run: 80, Failures: 0, Errors: 0, Skipped: 4, Time elapsed: 88.134 sec - in org.apache.hadoop.hbase.client.TestFromClientSide
Tests run: 4, Failures: 0, Errors: 0, Skipped: 0, Time elapsed: 39.792 sec - in org.apache.hadoop.hbase.client.TestScannerTimeout
Tests run: 3, Failures: 0, Errors: 0, Skipped: 0, Time elapsed: 34.617 sec - in org.apache.hadoop.hbase.client.TestTableSnapshotScanner
Running org.apache.hadoop.hbase.client.TestFromClientSide3
Tests run: 5, Failures: 0, Errors: 0, Skipped: 0, Time elapsed: 78.109 sec - in org.apache.hadoop.hbase.client.TestRestoreSnapshotFromClientWithRegionReplicas
Running org.apache.hadoop.hbase.client.TestRestoreSnapshotFromClient
Running org.apache.hadoop.hbase.client.TestSnapshotMetadata
Running org.apache.hadoop.hbase.client.TestHTableMultiplexerFlushCache
Tests run: 1, Failures: 0, Errors: 0, Skipped: 0, Time elapsed: 3.814 sec - in org.apache.hadoop.hbase.client.TestHTableMultiplexerFlushCache
Tests run: 4, Failures: 0, Errors: 0, Skipped: 0, Time elapsed: 12.879 sec - in org.apache.hadoop.hbase.client.TestSnapshotMetadata
Running org.apache.hadoop.hbase.TestMultiVersions
Running org.apache.hadoop.hbase.TestHColumnDescriptorDefaultVersions
Tests run: 6, Failures: 0, Errors: 0, Skipped: 0, Time elapsed: 29.498 sec - in org.apache.hadoop.hbase.client.TestFromClientSide3
Running org.apache.hadoop.hbase.procedure.TestZKProcedure
Tests run: 3, Failures: 0, Errors: 0, Skipped: 0, Time elapsed: 6.553 sec - in org.apache.hadoop.hbase.TestMultiVersions
Running org.apache.hadoop.hbase.procedure.TestZKProcedureControllers
Tests run: 4, Failures: 0, Errors: 0, Skipped: 0, Time elapsed: 3.577 sec - in org.apache.hadoop.hbase.procedure.TestZKProcedure
Tests run: 4, Failures: 0, Errors: 0, Skipped: 0, Time elapsed: 1.686 sec - in org.apache.hadoop.hbase.procedure.TestZKProcedureControllers
Tests run: 3, Failures: 0, Errors: 0, Skipped: 0, Time elapsed: 9.675 sec - in org.apache.hadoop.hbase.TestHColumnDescriptorDefaultVersions
Running org.apache.hadoop.hbase.TestZooKeeper
Running org.apache.hadoop.hbase.constraint.TestConstraint
Running org.apache.hadoop.hbase.TestNamespace
Tests run: 5, Failures: 0, Errors: 0, Skipped: 0, Time elapsed: 6.319 sec - in org.apache.hadoop.hbase.constraint.TestConstraint
Tests run: 9, Failures: 0, Errors: 0, Skipped: 1, Time elapsed: 6.992 sec - in org.apache.hadoop.hbase.TestNamespace
Running org.apache.hadoop.hbase.snapshot.TestFlushSnapshotFromClient
Tests run: 13, Failures: 0, Errors: 0, Skipped: 0, Time elapsed: 101.954 sec - in org.apache.hadoop.hbase.client.TestReplicasClient
Running org.apache.hadoop.hbase.snapshot.TestExportSnapshot
Tests run: 5, Failures: 0, Errors: 0, Skipped: 0, Time elapsed: 74.933 sec - in org.apache.hadoop.hbase.client.TestRestoreSnapshotFromClient
Running org.apache.hadoop.hbase.snapshot.TestRestoreFlushSnapshotFromClient
Running org.apache.hadoop.hbase.snapshot.TestSecureExportSnapshot
Tests run: 9, Failures: 0, Errors: 0, Skipped: 0, Time elapsed: 37.985 sec - in org.apache.hadoop.hbase.snapshot.TestFlushSnapshotFromClient
Running org.apache.hadoop.hbase.snapshot.TestSnapshotDescriptionUtils
Tests run: 2, Failures: 0, Errors: 0, Skipped: 0, Time elapsed: 0.181 sec - in org.apache.hadoop.hbase.snapshot.TestSnapshotDescriptionUtils
Running org.apache.hadoop.hbase.TestIOFencing
Tests run: 5, Failures: 0, Errors: 0, Skipped: 0, Time elapsed: 44.95 sec - in org.apache.hadoop.hbase.snapshot.TestRestoreFlushSnapshotFromClient
Running org.apache.hadoop.hbase.coprocessor.TestRegionObserverScannerOpenHook
Tests run: 3, Failures: 0, Errors: 0, Skipped: 0, Time elapsed: 8.777 sec - in org.apache.hadoop.hbase.coprocessor.TestRegionObserverScannerOpenHook
Running org.apache.hadoop.hbase.coprocessor.TestOpenTableInCoprocessor
Tests run: 2, Failures: 0, Errors: 0, Skipped: 0, Time elapsed: 4.657 sec - in org.apache.hadoop.hbase.coprocessor.TestOpenTableInCoprocessor
Running org.apache.hadoop.hbase.coprocessor.TestMasterCoprocessorExceptionWithAbort
Tests run: 1, Failures: 0, Errors: 0, Skipped: 0, Time elapsed: 26.612 sec - in org.apache.hadoop.hbase.coprocessor.TestMasterCoprocessorExceptionWithAbort
Running org.apache.hadoop.hbase.coprocessor.TestRegionServerCoprocessorEndpoint
Tests run: 1, Failures: 0, Errors: 0, Skipped: 0, Time elapsed: 1.42 sec - in org.apache.hadoop.hbase.coprocessor.TestRegionServerCoprocessorEndpoint
Running org.apache.hadoop.hbase.coprocessor.TestRegionObserverInterface
Tests run: 11, Failures: 0, Errors: 0, Skipped: 0, Time elapsed: 194.632 sec - in org.apache.hadoop.hbase.TestZooKeeper
Running org.apache.hadoop.hbase.coprocessor.TestMasterCoprocessorExceptionWithRemove
Tests run: 13, Failures: 0, Errors: 0, Skipped: 0, Time elapsed: 35.725 sec - in org.apache.hadoop.hbase.coprocessor.TestRegionObserverInterface
Tests run: 1, Failures: 0, Errors: 0, Skipped: 0, Time elapsed: 4.638 sec - in org.apache.hadoop.hbase.coprocessor.TestMasterCoprocessorExceptionWithRemove
Running org.apache.hadoop.hbase.coprocessor.TestAggregateProtocol
Running org.apache.hadoop.hbase.coprocessor.TestBatchCoprocessorEndpoint
Tests run: 4, Failures: 0, Errors: 0, Skipped: 0, Time elapsed: 1.76 sec - in org.apache.hadoop.hbase.coprocessor.TestBatchCoprocessorEndpoint
Tests run: 44, Failures: 0, Errors: 0, Skipped: 0, Time elapsed: 5.499 sec - in org.apache.hadoop.hbase.coprocessor.TestAggregateProtocol
Running org.apache.hadoop.hbase.coprocessor.TestRegionServerObserver
Running org.apache.hadoop.hbase.coprocessor.TestHTableWrapper
Tests run: 1, Failures: 0, Errors: 0, Skipped: 0, Time elapsed: 2.639 sec - in org.apache.hadoop.hbase.coprocessor.TestHTableWrapper
Tests run: 1, Failures: 0, Errors: 0, Skipped: 0, Time elapsed: 12.114 sec - in org.apache.hadoop.hbase.coprocessor.TestRegionServerObserver
Running org.apache.hadoop.hbase.coprocessor.TestRegionServerCoprocessorExceptionWithAbort
Running org.apache.hadoop.hbase.coprocessor.TestClassLoading
Tests run: 2, Failures: 0, Errors: 0, Skipped: 0, Time elapsed: 180.164 sec - in org.apache.hadoop.hbase.TestIOFencing
Tests run: 2, Failures: 0, Errors: 0, Skipped: 0, Time elapsed: 13.469 sec - in org.apache.hadoop.hbase.coprocessor.TestRegionServerCoprocessorExceptionWithAbort
Running org.apache.hadoop.hbase.coprocessor.TestDoubleColumnInterpreter
Tests run: 9, Failures: 0, Errors: 0, Skipped: 0, Time elapsed: 15.701 sec - in org.apache.hadoop.hbase.coprocessor.TestClassLoading
Tests run: 38, Failures: 0, Errors: 0, Skipped: 0, Time elapsed: 4.928 sec - in org.apache.hadoop.hbase.coprocessor.TestDoubleColumnInterpreter
Running org.apache.hadoop.hbase.coprocessor.TestRegionObserverBypass
Tests run: 2, Failures: 0, Errors: 0, Skipped: 0, Time elapsed: 3.68 sec - in org.apache.hadoop.hbase.coprocessor.TestRegionObserverBypass
Running org.apache.hadoop.hbase.coprocessor.TestRowProcessorEndpoint
Running org.apache.hadoop.hbase.coprocessor.TestCoprocessorStop
Running org.apache.hadoop.hbase.coprocessor.TestRegionServerCoprocessorExceptionWithRemove
Tests run: 4, Failures: 0, Errors: 0, Skipped: 0, Time elapsed: 8.059 sec - in org.apache.hadoop.hbase.coprocessor.TestRowProcessorEndpoint
Running org.apache.hadoop.hbase.coprocessor.TestBigDecimalColumnInterpreter
Tests run: 1, Failures: 0, Errors: 0, Skipped: 0, Time elapsed: 16.321 sec - in org.apache.hadoop.hbase.coprocessor.TestCoprocessorStop
Tests run: 1, Failures: 0, Errors: 0, Skipped: 0, Time elapsed: 12.973 sec - in org.apache.hadoop.hbase.coprocessor.TestRegionServerCoprocessorExceptionWithRemove
Tests run: 38, Failures: 0, Errors: 0, Skipped: 0, Time elapsed: 4.53 sec - in org.apache.hadoop.hbase.coprocessor.TestBigDecimalColumnInterpreter
Running org.apache.hadoop.hbase.coprocessor.TestMasterObserver
Running org.apache.hadoop.hbase.coprocessor.TestWALObserver
Running org.apache.hadoop.hbase.coprocessor.TestCoprocessorEndpoint
Tests run: 7, Failures: 0, Errors: 0, Skipped: 0, Time elapsed: 8.615 sec - in org.apache.hadoop.hbase.coprocessor.TestMasterObserver
Running org.apache.hadoop.hbase.TestGlobalMemStoreSize
Tests run: 6, Failures: 0, Errors: 0, Skipped: 0, Time elapsed: 8.457 sec - in org.apache.hadoop.hbase.coprocessor.TestWALObserver
Running org.apache.hadoop.hbase.TestJMXListener
Tests run: 1, Failures: 0, Errors: 0, Skipped: 0, Time elapsed: 11.426 sec - in org.apache.hadoop.hbase.TestGlobalMemStoreSize
Running org.apache.hadoop.hbase.TestMetaTableLocator
Tests run: 7, Failures: 0, Errors: 0, Skipped: 0, Time elapsed: 5.421 sec - in org.apache.hadoop.hbase.TestMetaTableLocator
Tests run: 9, Failures: 0, Errors: 0, Skipped: 0, Time elapsed: 284.721 sec - in org.apache.hadoop.hbase.snapshot.TestExportSnapshot
Running org.apache.hadoop.hbase.zookeeper.TestZKMulti
Tests run: 6, Failures: 0, Errors: 0, Skipped: 0, Time elapsed: 0.321 sec - in org.apache.hadoop.hbase.zookeeper.TestZKMulti
Running org.apache.hadoop.hbase.zookeeper.lock.TestZKInterProcessReadWriteLock
Tests run: 2, Failures: 0, Errors: 0, Skipped: 0, Time elapsed: 15.974 sec - in org.apache.hadoop.hbase.TestJMXListener
Running org.apache.hadoop.hbase.zookeeper.TestZKLeaderManager
Tests run: 1, Failures: 0, Errors: 0, Skipped: 0, Time elapsed: 0.135 sec - in org.apache.hadoop.hbase.zookeeper.TestZKLeaderManager
Running org.apache.hadoop.hbase.zookeeper.TestZooKeeperACL
Tests run: 6, Failures: 0, Errors: 0, Skipped: 0, Time elapsed: 0.276 sec - in org.apache.hadoop.hbase.zookeeper.TestZooKeeperACL
Running org.apache.hadoop.hbase.zookeeper.TestRecoverableZooKeeper
Tests run: 1, Failures: 0, Errors: 0, Skipped: 0, Time elapsed: 1.216 sec - in org.apache.hadoop.hbase.zookeeper.TestRecoverableZooKeeper
Running org.apache.hadoop.hbase.zookeeper.TestHQuorumPeer
Running org.apache.hadoop.hbase.zookeeper.TestZooKeeperNodeTracker
Tests run: 3, Failures: 0, Errors: 0, Skipped: 0, Time elapsed: 0.872 sec - in org.apache.hadoop.hbase.zookeeper.TestZooKeeperNodeTracker
Running org.apache.hadoop.hbase.TestClusterBootOrder
Tests run: 3, Failures: 0, Errors: 0, Skipped: 0, Time elapsed: 8.648 sec - in org.apache.hadoop.hbase.zookeeper.TestHQuorumPeer
Tests run: 9, Failures: 0, Errors: 0, Skipped: 0, Time elapsed: 289.564 sec - in org.apache.hadoop.hbase.snapshot.TestSecureExportSnapshot
Tests run: 6, Failures: 0, Errors: 0, Skipped: 0, Time elapsed: 24.471 sec - in org.apache.hadoop.hbase.zookeeper.lock.TestZKInterProcessReadWriteLock
Tests run: 2, Failures: 0, Errors: 0, Skipped: 0, Time elapsed: 25.947 sec - in org.apache.hadoop.hbase.TestClusterBootOrder
Tests run: 6, Failures: 0, Errors: 0, Skipped: 0, Time elapsed: 553.148 sec - in org.apache.hadoop.hbase.coprocessor.TestCoprocessorEndpoint
Results :
Tests in error:
TestAcidGuarantees.testScanAtomicity:354->runTestAtomicity:261->runTestAtomicity:322 » Runtime
Tests run: 2219, Failures: 0, Errors: 1, Skipped: 25
[INFO] ------------------------------------------------------------------------
[INFO] Reactor Summary:
[INFO]
[INFO] HBase ............................................. SUCCESS [3.093s]
[INFO] HBase - Checkstyle ................................ SUCCESS [0.649s]
[INFO] HBase - Annotations ............................... SUCCESS [0.852s]
[INFO] HBase - Protocol .................................. SUCCESS [12.565s]
[INFO] HBase - Common .................................... SUCCESS [1:04.498s]
[INFO] HBase - Client .................................... SUCCESS [1:20.130s]
[INFO] HBase - Hadoop Compatibility ...................... SUCCESS [6.984s]
[INFO] HBase - Hadoop Two Compatibility .................. SUCCESS [6.149s]
[INFO] HBase - Prefix Tree ............................... SUCCESS [8.352s]
[INFO] HBase - Server .................................... FAILURE [1:10:05.591s]
[INFO] HBase - Testing Util .............................. SKIPPED
[INFO] HBase - Thrift .................................... SKIPPED
[INFO] HBase - Shell ..................................... SKIPPED
[INFO] HBase - Integration Tests ......................... SKIPPED
[INFO] HBase - Examples .................................. SKIPPED
[INFO] HBase - Rest ...................................... SKIPPED
[INFO] HBase - Assembly .................................. SKIPPED
[INFO] ------------------------------------------------------------------------
[INFO] BUILD FAILURE
[INFO] ------------------------------------------------------------------------
[INFO] Total time: 1:13:09.705s
[INFO] Finished at: Tue Jan 13 16:18:46 UTC 2015
[INFO] Final Memory: 57M/974M
[INFO] ------------------------------------------------------------------------
[ERROR] Failed to execute goal org.apache.maven.plugins:maven-surefire-plugin:2.18:test (secondPartTestsExecution) on project hbase-server: There are test failures.
[ERROR]
[ERROR] Please refer to <https://builds.apache.org/job/HBase-TRUNK/ws/hbase-server/target/surefire-reports> for the individual test results.
[ERROR] -> [Help 1]
[ERROR]
[ERROR] To see the full stack trace of the errors, re-run Maven with the -e switch.
[ERROR] Re-run Maven using the -X switch to enable full debug logging.
[ERROR]
[ERROR] For more information about the errors and possible solutions, please read the following articles:
[ERROR] [Help 1] http://cwiki.apache.org/confluence/display/MAVEN/MojoFailureException
[ERROR]
[ERROR] After correcting the problems, you can resume the build with the command
[ERROR] mvn <goals> -rf :hbase-server
Build step 'Invoke top-level Maven targets' marked build as failure
[FINDBUGS] Skipping publisher since build result is FAILURE
Performing Post build task...
Match found for :.* : True
Logical operation result is TRUE
Running script : ZOMBIE_TESTS_COUNT=`jps | grep surefirebooter | wc -l`
if [[ $ZOMBIE_TESTS_COUNT != 0 ]] ; then
#It seems sometimes the tests are not dying immediately. Let's give them 10s
echo "Suspicious java process found - waiting 10s to see if there are just slow to stop"
sleep 10
ZOMBIE_TESTS_COUNT=`jps | grep surefirebooter | wc -l`
if [[ $ZOMBIE_TESTS_COUNT != 0 ]] ; then
echo "There are $ZOMBIE_TESTS_COUNT zombie tests, they should have been killed by surefire but survived"
echo "************ BEGIN zombies jstack extract"
ZB_STACK=`jps | grep surefirebooter | cut -d ' ' -f 1 | xargs -n 1 jstack | grep ".test" | grep "\.java"`
jps | grep surefirebooter | cut -d ' ' -f 1 | xargs -n 1 jstack
echo "************ END zombies jstack extract"
JIRA_COMMENT="$JIRA_COMMENT
{color:red}-1 core zombie tests{color}. There are ${ZOMBIE_TESTS_COUNT} zombie test(s): ${ZB_STACK}"
BAD=1
jps | grep surefirebooter | cut -d ' ' -f 1 | xargs kill -9
else
echo "We're ok: there is no zombie test, but some tests took some time to stop"
fi
else
echo "We're ok: there is no zombie test"
fi
[HBase-TRUNK] $ /bin/bash -xe /tmp/hudson3635223302096017732.sh
++ jps
++ grep surefirebooter
++ wc -l
+ ZOMBIE_TESTS_COUNT=0
+ [[ 0 != 0 ]]
+ echo 'We'\''re ok: there is no zombie test'
We're ok: there is no zombie test
POST BUILD TASK : SUCCESS
END OF POST BUILD TASK : 0
Archiving artifacts
Sending artifact delta relative to HBase-TRUNK #6014
Archived 1825 artifacts
Archive block size is 32768
Received 31 blocks and 361233048 bytes
Compression is 0.3%
Took 1 min 46 sec
Recording test results
Updating HBASE-11144