You are viewing a plain text version of this content. The canonical link for it is here.
Posted to dev@lucene.apache.org by Policeman Jenkins Server <je...@thetaphi.de> on 2015/08/03 08:21:30 UTC
[JENKINS] Lucene-Solr-trunk-Linux (64bit/jdk1.8.0_51) - Build #
13711 - Still Failing!
Build: http://jenkins.thetaphi.de/job/Lucene-Solr-trunk-Linux/13711/
Java: 64bit/jdk1.8.0_51 -XX:+UseCompressedOops -XX:+UseConcMarkSweepGC
1 tests failed.
FAILED: org.apache.solr.cloud.CdcrReplicationDistributedZkTest.doTests
Error Message:
Error from server at https://127.0.0.1:49092/rq_jl/source_collection_shard1_replica1: ClusterState says we are the leader (https://127.0.0.1:49092/rq_jl/source_collection_shard1_replica1), but locally we don't think so. Request came from null
Stack Trace:
org.apache.solr.client.solrj.impl.HttpSolrClient$RemoteSolrException: Error from server at https://127.0.0.1:49092/rq_jl/source_collection_shard1_replica1: ClusterState says we are the leader (https://127.0.0.1:49092/rq_jl/source_collection_shard1_replica1), but locally we don't think so. Request came from null
at __randomizedtesting.SeedInfo.seed([EA39C87A9358B705:E259BD569C569F0E]:0)
at org.apache.solr.client.solrj.impl.HttpSolrClient.executeMethod(HttpSolrClient.java:560)
at org.apache.solr.client.solrj.impl.HttpSolrClient.request(HttpSolrClient.java:234)
at org.apache.solr.client.solrj.impl.HttpSolrClient.request(HttpSolrClient.java:226)
at org.apache.solr.client.solrj.impl.LBHttpSolrClient.doRequest(LBHttpSolrClient.java:376)
at org.apache.solr.client.solrj.impl.LBHttpSolrClient.request(LBHttpSolrClient.java:328)
at org.apache.solr.client.solrj.impl.CloudSolrClient.directUpdate(CloudSolrClient.java:635)
at org.apache.solr.client.solrj.impl.CloudSolrClient.sendRequest(CloudSolrClient.java:967)
at org.apache.solr.client.solrj.impl.CloudSolrClient.requestWithRetryOnStaleState(CloudSolrClient.java:856)
at org.apache.solr.client.solrj.impl.CloudSolrClient.request(CloudSolrClient.java:799)
at org.apache.solr.client.solrj.SolrRequest.process(SolrRequest.java:135)
at org.apache.solr.client.solrj.SolrClient.add(SolrClient.java:107)
at org.apache.solr.client.solrj.SolrClient.add(SolrClient.java:72)
at org.apache.solr.client.solrj.SolrClient.add(SolrClient.java:86)
at org.apache.solr.cloud.BaseCdcrDistributedZkTest.index(BaseCdcrDistributedZkTest.java:184)
at org.apache.solr.cloud.CdcrReplicationDistributedZkTest.doTestOps(CdcrReplicationDistributedZkTest.java:436)
at org.apache.solr.cloud.CdcrReplicationDistributedZkTest.doTests(CdcrReplicationDistributedZkTest.java:52)
at sun.reflect.NativeMethodAccessorImpl.invoke0(Native Method)
at sun.reflect.NativeMethodAccessorImpl.invoke(NativeMethodAccessorImpl.java:62)
at sun.reflect.DelegatingMethodAccessorImpl.invoke(DelegatingMethodAccessorImpl.java:43)
at java.lang.reflect.Method.invoke(Method.java:497)
at com.carrotsearch.randomizedtesting.RandomizedRunner.invoke(RandomizedRunner.java:1627)
at com.carrotsearch.randomizedtesting.RandomizedRunner$6.evaluate(RandomizedRunner.java:836)
at com.carrotsearch.randomizedtesting.RandomizedRunner$7.evaluate(RandomizedRunner.java:872)
at com.carrotsearch.randomizedtesting.RandomizedRunner$8.evaluate(RandomizedRunner.java:886)
at org.apache.solr.BaseDistributedSearchTestCase$ShardsRepeatRule$ShardsFixedStatement.callStatement(BaseDistributedSearchTestCase.java:966)
at org.apache.solr.BaseDistributedSearchTestCase$ShardsRepeatRule$ShardsStatement.evaluate(BaseDistributedSearchTestCase.java:941)
at com.carrotsearch.randomizedtesting.rules.SystemPropertiesRestoreRule$1.evaluate(SystemPropertiesRestoreRule.java:57)
at org.apache.lucene.util.TestRuleSetupTeardownChained$1.evaluate(TestRuleSetupTeardownChained.java:50)
at org.apache.lucene.util.AbstractBeforeAfterRule$1.evaluate(AbstractBeforeAfterRule.java:46)
at org.apache.lucene.util.TestRuleThreadAndTestName$1.evaluate(TestRuleThreadAndTestName.java:49)
at org.apache.lucene.util.TestRuleIgnoreAfterMaxFailures$1.evaluate(TestRuleIgnoreAfterMaxFailures.java:65)
at org.apache.lucene.util.TestRuleMarkFailure$1.evaluate(TestRuleMarkFailure.java:48)
at com.carrotsearch.randomizedtesting.rules.StatementAdapter.evaluate(StatementAdapter.java:36)
at com.carrotsearch.randomizedtesting.ThreadLeakControl$StatementRunner.run(ThreadLeakControl.java:365)
at com.carrotsearch.randomizedtesting.ThreadLeakControl.forkTimeoutingTask(ThreadLeakControl.java:798)
at com.carrotsearch.randomizedtesting.ThreadLeakControl$3.evaluate(ThreadLeakControl.java:458)
at com.carrotsearch.randomizedtesting.RandomizedRunner.runSingleTest(RandomizedRunner.java:845)
at com.carrotsearch.randomizedtesting.RandomizedRunner$3.evaluate(RandomizedRunner.java:747)
at com.carrotsearch.randomizedtesting.RandomizedRunner$4.evaluate(RandomizedRunner.java:781)
at com.carrotsearch.randomizedtesting.RandomizedRunner$5.evaluate(RandomizedRunner.java:792)
at com.carrotsearch.randomizedtesting.rules.StatementAdapter.evaluate(StatementAdapter.java:36)
at com.carrotsearch.randomizedtesting.rules.SystemPropertiesRestoreRule$1.evaluate(SystemPropertiesRestoreRule.java:57)
at org.apache.lucene.util.AbstractBeforeAfterRule$1.evaluate(AbstractBeforeAfterRule.java:46)
at com.carrotsearch.randomizedtesting.rules.StatementAdapter.evaluate(StatementAdapter.java:36)
at org.apache.lucene.util.TestRuleStoreClassName$1.evaluate(TestRuleStoreClassName.java:42)
at com.carrotsearch.randomizedtesting.rules.NoShadowingOrOverridesOnMethodsRule$1.evaluate(NoShadowingOrOverridesOnMethodsRule.java:39)
at com.carrotsearch.randomizedtesting.rules.NoShadowingOrOverridesOnMethodsRule$1.evaluate(NoShadowingOrOverridesOnMethodsRule.java:39)
at com.carrotsearch.randomizedtesting.rules.StatementAdapter.evaluate(StatementAdapter.java:36)
at com.carrotsearch.randomizedtesting.rules.StatementAdapter.evaluate(StatementAdapter.java:36)
at com.carrotsearch.randomizedtesting.rules.StatementAdapter.evaluate(StatementAdapter.java:36)
at org.apache.lucene.util.TestRuleAssertionsRequired$1.evaluate(TestRuleAssertionsRequired.java:54)
at org.apache.lucene.util.TestRuleMarkFailure$1.evaluate(TestRuleMarkFailure.java:48)
at org.apache.lucene.util.TestRuleIgnoreAfterMaxFailures$1.evaluate(TestRuleIgnoreAfterMaxFailures.java:65)
at org.apache.lucene.util.TestRuleIgnoreTestSuites$1.evaluate(TestRuleIgnoreTestSuites.java:55)
at com.carrotsearch.randomizedtesting.rules.StatementAdapter.evaluate(StatementAdapter.java:36)
at com.carrotsearch.randomizedtesting.ThreadLeakControl$StatementRunner.run(ThreadLeakControl.java:365)
at java.lang.Thread.run(Thread.java:745)
Build Log:
[...truncated 10848 lines...]
[junit4] Suite: org.apache.solr.cloud.CdcrReplicationDistributedZkTest
[junit4] 2> Creating dataDir: /home/jenkins/workspace/Lucene-Solr-trunk-Linux/solr/build/solr-core/test/J2/temp/solr.cloud.CdcrReplicationDistributedZkTest_EA39C87A9358B705-001/init-core-data-001
[junit4] 2> 1024386 INFO (SUITE-CdcrReplicationDistributedZkTest-seed#[EA39C87A9358B705]-worker) [ ] o.a.s.SolrTestCaseJ4 Randomized ssl (true) and clientAuth (false)
[junit4] 2> 1024386 INFO (SUITE-CdcrReplicationDistributedZkTest-seed#[EA39C87A9358B705]-worker) [ ] o.a.s.BaseDistributedSearchTestCase Setting hostContext system property: /rq_jl/
[junit4] 2> 1024388 INFO (TEST-CdcrReplicationDistributedZkTest.doTests-seed#[EA39C87A9358B705]) [ ] o.a.s.c.ZkTestServer STARTING ZK TEST SERVER
[junit4] 2> 1024388 INFO (Thread-3462) [ ] o.a.s.c.ZkTestServer client port:0.0.0.0/0.0.0.0:0
[junit4] 2> 1024388 INFO (Thread-3462) [ ] o.a.s.c.ZkTestServer Starting server
[junit4] 2> 1024488 INFO (TEST-CdcrReplicationDistributedZkTest.doTests-seed#[EA39C87A9358B705]) [ ] o.a.s.c.ZkTestServer start zk server on port:53782
[junit4] 2> 1024488 INFO (TEST-CdcrReplicationDistributedZkTest.doTests-seed#[EA39C87A9358B705]) [ ] o.a.s.c.c.SolrZkClient Using default ZkCredentialsProvider
[junit4] 2> 1024488 INFO (TEST-CdcrReplicationDistributedZkTest.doTests-seed#[EA39C87A9358B705]) [ ] o.a.s.c.c.ConnectionManager Waiting for client to connect to ZooKeeper
[junit4] 2> 1024490 INFO (zkCallback-1077-thread-1) [ ] o.a.s.c.c.ConnectionManager Watcher org.apache.solr.common.cloud.ConnectionManager@2dfdefd6 name:ZooKeeperConnection Watcher:127.0.0.1:53782 got event WatchedEvent state:SyncConnected type:None path:null path:null type:None
[junit4] 2> 1024490 INFO (TEST-CdcrReplicationDistributedZkTest.doTests-seed#[EA39C87A9358B705]) [ ] o.a.s.c.c.ConnectionManager Client is connected to ZooKeeper
[junit4] 2> 1024490 INFO (TEST-CdcrReplicationDistributedZkTest.doTests-seed#[EA39C87A9358B705]) [ ] o.a.s.c.c.SolrZkClient Using default ZkACLProvider
[junit4] 2> 1024490 INFO (TEST-CdcrReplicationDistributedZkTest.doTests-seed#[EA39C87A9358B705]) [ ] o.a.s.c.c.SolrZkClient makePath: /solr
[junit4] 2> 1024491 INFO (TEST-CdcrReplicationDistributedZkTest.doTests-seed#[EA39C87A9358B705]) [ ] o.a.s.c.c.SolrZkClient Using default ZkCredentialsProvider
[junit4] 2> 1024492 INFO (TEST-CdcrReplicationDistributedZkTest.doTests-seed#[EA39C87A9358B705]) [ ] o.a.s.c.c.ConnectionManager Waiting for client to connect to ZooKeeper
[junit4] 2> 1024493 INFO (zkCallback-1078-thread-1) [ ] o.a.s.c.c.ConnectionManager Watcher org.apache.solr.common.cloud.ConnectionManager@83135e0 name:ZooKeeperConnection Watcher:127.0.0.1:53782/solr got event WatchedEvent state:SyncConnected type:None path:null path:null type:None
[junit4] 2> 1024493 INFO (TEST-CdcrReplicationDistributedZkTest.doTests-seed#[EA39C87A9358B705]) [ ] o.a.s.c.c.ConnectionManager Client is connected to ZooKeeper
[junit4] 2> 1024493 INFO (TEST-CdcrReplicationDistributedZkTest.doTests-seed#[EA39C87A9358B705]) [ ] o.a.s.c.c.SolrZkClient Using default ZkACLProvider
[junit4] 2> 1024493 INFO (TEST-CdcrReplicationDistributedZkTest.doTests-seed#[EA39C87A9358B705]) [ ] o.a.s.c.c.SolrZkClient makePath: /collections/collection1
[junit4] 2> 1024494 INFO (TEST-CdcrReplicationDistributedZkTest.doTests-seed#[EA39C87A9358B705]) [ ] o.a.s.c.c.SolrZkClient makePath: /collections/collection1/shards
[junit4] 2> 1024494 INFO (TEST-CdcrReplicationDistributedZkTest.doTests-seed#[EA39C87A9358B705]) [ ] o.a.s.c.c.SolrZkClient makePath: /collections/control_collection
[junit4] 2> 1024495 INFO (TEST-CdcrReplicationDistributedZkTest.doTests-seed#[EA39C87A9358B705]) [ ] o.a.s.c.c.SolrZkClient makePath: /collections/control_collection/shards
[junit4] 2> 1024495 INFO (TEST-CdcrReplicationDistributedZkTest.doTests-seed#[EA39C87A9358B705]) [ ] o.a.s.c.AbstractZkTestCase put /home/jenkins/workspace/Lucene-Solr-trunk-Linux/solr/core/src/test-files/solr/collection1/conf/solrconfig-cdcr.xml to /configs/conf1/solrconfig.xml
[junit4] 2> 1024496 INFO (TEST-CdcrReplicationDistributedZkTest.doTests-seed#[EA39C87A9358B705]) [ ] o.a.s.c.c.SolrZkClient makePath: /configs/conf1/solrconfig.xml
[junit4] 2> 1024497 INFO (TEST-CdcrReplicationDistributedZkTest.doTests-seed#[EA39C87A9358B705]) [ ] o.a.s.c.AbstractZkTestCase put /home/jenkins/workspace/Lucene-Solr-trunk-Linux/solr/core/src/test-files/solr/collection1/conf/schema15.xml to /configs/conf1/schema.xml
[junit4] 2> 1024497 INFO (TEST-CdcrReplicationDistributedZkTest.doTests-seed#[EA39C87A9358B705]) [ ] o.a.s.c.c.SolrZkClient makePath: /configs/conf1/schema.xml
[junit4] 2> 1024498 INFO (TEST-CdcrReplicationDistributedZkTest.doTests-seed#[EA39C87A9358B705]) [ ] o.a.s.c.AbstractZkTestCase put /home/jenkins/workspace/Lucene-Solr-trunk-Linux/solr/core/src/test-files/solr/collection1/conf/solrconfig.snippet.randomindexconfig.xml to /configs/conf1/solrconfig.snippet.randomindexconfig.xml
[junit4] 2> 1024498 INFO (TEST-CdcrReplicationDistributedZkTest.doTests-seed#[EA39C87A9358B705]) [ ] o.a.s.c.c.SolrZkClient makePath: /configs/conf1/solrconfig.snippet.randomindexconfig.xml
[junit4] 2> 1024499 INFO (TEST-CdcrReplicationDistributedZkTest.doTests-seed#[EA39C87A9358B705]) [ ] o.a.s.c.AbstractZkTestCase put /home/jenkins/workspace/Lucene-Solr-trunk-Linux/solr/core/src/test-files/solr/collection1/conf/stopwords.txt to /configs/conf1/stopwords.txt
[junit4] 2> 1024499 INFO (TEST-CdcrReplicationDistributedZkTest.doTests-seed#[EA39C87A9358B705]) [ ] o.a.s.c.c.SolrZkClient makePath: /configs/conf1/stopwords.txt
[junit4] 2> 1024499 INFO (TEST-CdcrReplicationDistributedZkTest.doTests-seed#[EA39C87A9358B705]) [ ] o.a.s.c.AbstractZkTestCase put /home/jenkins/workspace/Lucene-Solr-trunk-Linux/solr/core/src/test-files/solr/collection1/conf/protwords.txt to /configs/conf1/protwords.txt
[junit4] 2> 1024499 INFO (TEST-CdcrReplicationDistributedZkTest.doTests-seed#[EA39C87A9358B705]) [ ] o.a.s.c.c.SolrZkClient makePath: /configs/conf1/protwords.txt
[junit4] 2> 1024500 INFO (TEST-CdcrReplicationDistributedZkTest.doTests-seed#[EA39C87A9358B705]) [ ] o.a.s.c.AbstractZkTestCase put /home/jenkins/workspace/Lucene-Solr-trunk-Linux/solr/core/src/test-files/solr/collection1/conf/currency.xml to /configs/conf1/currency.xml
[junit4] 2> 1024500 INFO (TEST-CdcrReplicationDistributedZkTest.doTests-seed#[EA39C87A9358B705]) [ ] o.a.s.c.c.SolrZkClient makePath: /configs/conf1/currency.xml
[junit4] 2> 1024501 INFO (TEST-CdcrReplicationDistributedZkTest.doTests-seed#[EA39C87A9358B705]) [ ] o.a.s.c.AbstractZkTestCase put /home/jenkins/workspace/Lucene-Solr-trunk-Linux/solr/core/src/test-files/solr/collection1/conf/enumsConfig.xml to /configs/conf1/enumsConfig.xml
[junit4] 2> 1024501 INFO (TEST-CdcrReplicationDistributedZkTest.doTests-seed#[EA39C87A9358B705]) [ ] o.a.s.c.c.SolrZkClient makePath: /configs/conf1/enumsConfig.xml
[junit4] 2> 1024502 INFO (TEST-CdcrReplicationDistributedZkTest.doTests-seed#[EA39C87A9358B705]) [ ] o.a.s.c.AbstractZkTestCase put /home/jenkins/workspace/Lucene-Solr-trunk-Linux/solr/core/src/test-files/solr/collection1/conf/open-exchange-rates.json to /configs/conf1/open-exchange-rates.json
[junit4] 2> 1024502 INFO (TEST-CdcrReplicationDistributedZkTest.doTests-seed#[EA39C87A9358B705]) [ ] o.a.s.c.c.SolrZkClient makePath: /configs/conf1/open-exchange-rates.json
[junit4] 2> 1024503 INFO (TEST-CdcrReplicationDistributedZkTest.doTests-seed#[EA39C87A9358B705]) [ ] o.a.s.c.AbstractZkTestCase put /home/jenkins/workspace/Lucene-Solr-trunk-Linux/solr/core/src/test-files/solr/collection1/conf/mapping-ISOLatin1Accent.txt to /configs/conf1/mapping-ISOLatin1Accent.txt
[junit4] 2> 1024503 INFO (TEST-CdcrReplicationDistributedZkTest.doTests-seed#[EA39C87A9358B705]) [ ] o.a.s.c.c.SolrZkClient makePath: /configs/conf1/mapping-ISOLatin1Accent.txt
[junit4] 2> 1024504 INFO (TEST-CdcrReplicationDistributedZkTest.doTests-seed#[EA39C87A9358B705]) [ ] o.a.s.c.AbstractZkTestCase put /home/jenkins/workspace/Lucene-Solr-trunk-Linux/solr/core/src/test-files/solr/collection1/conf/old_synonyms.txt to /configs/conf1/old_synonyms.txt
[junit4] 2> 1024504 INFO (TEST-CdcrReplicationDistributedZkTest.doTests-seed#[EA39C87A9358B705]) [ ] o.a.s.c.c.SolrZkClient makePath: /configs/conf1/old_synonyms.txt
[junit4] 2> 1024504 INFO (TEST-CdcrReplicationDistributedZkTest.doTests-seed#[EA39C87A9358B705]) [ ] o.a.s.c.AbstractZkTestCase put /home/jenkins/workspace/Lucene-Solr-trunk-Linux/solr/core/src/test-files/solr/collection1/conf/synonyms.txt to /configs/conf1/synonyms.txt
[junit4] 2> 1024504 INFO (TEST-CdcrReplicationDistributedZkTest.doTests-seed#[EA39C87A9358B705]) [ ] o.a.s.c.c.SolrZkClient makePath: /configs/conf1/synonyms.txt
[junit4] 2> 1024505 INFO (TEST-CdcrReplicationDistributedZkTest.doTests-seed#[EA39C87A9358B705]) [ ] o.a.s.c.c.SolrZkClient Using default ZkCredentialsProvider
[junit4] 2> 1024506 INFO (TEST-CdcrReplicationDistributedZkTest.doTests-seed#[EA39C87A9358B705]) [ ] o.a.s.c.c.ConnectionManager Waiting for client to connect to ZooKeeper
[junit4] 2> 1024506 INFO (zkCallback-1079-thread-1) [ ] o.a.s.c.c.ConnectionManager Watcher org.apache.solr.common.cloud.ConnectionManager@5e617253 name:ZooKeeperConnection Watcher:127.0.0.1:53782/solr got event WatchedEvent state:SyncConnected type:None path:null path:null type:None
[junit4] 2> 1024506 INFO (TEST-CdcrReplicationDistributedZkTest.doTests-seed#[EA39C87A9358B705]) [ ] o.a.s.c.c.ConnectionManager Client is connected to ZooKeeper
[junit4] 2> 1024507 INFO (TEST-CdcrReplicationDistributedZkTest.doTests-seed#[EA39C87A9358B705]) [ ] o.a.s.c.c.SolrZkClient Using default ZkACLProvider
[junit4] 2> 1024507 INFO (TEST-CdcrReplicationDistributedZkTest.doTests-seed#[EA39C87A9358B705]) [ ] o.a.s.SolrTestCaseJ4 ###Starting doTests
[junit4] 2> 1024559 INFO (TEST-CdcrReplicationDistributedZkTest.doTests-seed#[EA39C87A9358B705]) [ ] o.a.s.SolrTestCaseJ4 Writing core.properties file to /home/jenkins/workspace/Lucene-Solr-trunk-Linux/solr/build/solr-core/test/J2/temp/solr.cloud.CdcrReplicationDistributedZkTest_EA39C87A9358B705-001/jetty-001/cores/collection1
[junit4] 2> 1024560 INFO (TEST-CdcrReplicationDistributedZkTest.doTests-seed#[EA39C87A9358B705]) [ ] o.e.j.s.Server jetty-9.2.11.v20150529
[junit4] 2> 1024561 INFO (TEST-CdcrReplicationDistributedZkTest.doTests-seed#[EA39C87A9358B705]) [ ] o.e.j.s.h.ContextHandler Started o.e.j.s.ServletContextHandler@3cc71e34{/rq_jl,null,AVAILABLE}
[junit4] 2> 1024564 INFO (TEST-CdcrReplicationDistributedZkTest.doTests-seed#[EA39C87A9358B705]) [ ] o.e.j.s.ServerConnector Started ServerConnector@756e0a29{SSL-http/1.1}{127.0.0.1:57509}
[junit4] 2> 1024564 INFO (TEST-CdcrReplicationDistributedZkTest.doTests-seed#[EA39C87A9358B705]) [ ] o.e.j.s.Server Started @1026263ms
[junit4] 2> 1024564 INFO (TEST-CdcrReplicationDistributedZkTest.doTests-seed#[EA39C87A9358B705]) [ ] o.a.s.c.s.e.JettySolrRunner Jetty properties: {shards=shard1, hostContext=/rq_jl, hostPort=57509, coreRootDirectory=/home/jenkins/workspace/Lucene-Solr-trunk-Linux/solr/build/solr-core/test/J2/temp/solr.cloud.CdcrReplicationDistributedZkTest_EA39C87A9358B705-001/jetty-001/cores}
[junit4] 2> 1024565 INFO (TEST-CdcrReplicationDistributedZkTest.doTests-seed#[EA39C87A9358B705]) [ ] o.a.s.s.SolrDispatchFilter SolrDispatchFilter.init(): sun.misc.Launcher$AppClassLoader@4e0e2f2a
[junit4] 2> 1024565 INFO (TEST-CdcrReplicationDistributedZkTest.doTests-seed#[EA39C87A9358B705]) [ ] o.a.s.c.SolrResourceLoader new SolrResourceLoader for directory: '/home/jenkins/workspace/Lucene-Solr-trunk-Linux/solr/build/solr-core/test/J2/temp/solr.cloud.CdcrReplicationDistributedZkTest_EA39C87A9358B705-001/jetty-001/'
[junit4] 2> 1024575 INFO (TEST-CdcrReplicationDistributedZkTest.doTests-seed#[EA39C87A9358B705]) [ ] o.a.s.c.c.SolrZkClient Using default ZkCredentialsProvider
[junit4] 2> 1024576 INFO (TEST-CdcrReplicationDistributedZkTest.doTests-seed#[EA39C87A9358B705]) [ ] o.a.s.c.c.ConnectionManager Waiting for client to connect to ZooKeeper
[junit4] 2> 1024576 INFO (zkCallback-1080-thread-1) [ ] o.a.s.c.c.ConnectionManager Watcher org.apache.solr.common.cloud.ConnectionManager@10afe530 name:ZooKeeperConnection Watcher:127.0.0.1:53782/solr got event WatchedEvent state:SyncConnected type:None path:null path:null type:None
[junit4] 2> 1024576 INFO (TEST-CdcrReplicationDistributedZkTest.doTests-seed#[EA39C87A9358B705]) [ ] o.a.s.c.c.ConnectionManager Client is connected to ZooKeeper
[junit4] 2> 1024577 INFO (TEST-CdcrReplicationDistributedZkTest.doTests-seed#[EA39C87A9358B705]) [ ] o.a.s.c.c.SolrZkClient Using default ZkACLProvider
[junit4] 2> 1024577 INFO (TEST-CdcrReplicationDistributedZkTest.doTests-seed#[EA39C87A9358B705]) [ ] o.a.s.s.SolrDispatchFilter Loading solr.xml from SolrHome (not found in ZooKeeper)
[junit4] 2> 1024577 INFO (TEST-CdcrReplicationDistributedZkTest.doTests-seed#[EA39C87A9358B705]) [ ] o.a.s.c.SolrXmlConfig Loading container configuration from /home/jenkins/workspace/Lucene-Solr-trunk-Linux/solr/build/solr-core/test/J2/temp/solr.cloud.CdcrReplicationDistributedZkTest_EA39C87A9358B705-001/jetty-001/solr.xml
[junit4] 2> 1024580 INFO (TEST-CdcrReplicationDistributedZkTest.doTests-seed#[EA39C87A9358B705]) [ ] o.a.s.c.CoresLocator Config-defined core root directory: /home/jenkins/workspace/Lucene-Solr-trunk-Linux/solr/build/solr-core/test/J2/temp/solr.cloud.CdcrReplicationDistributedZkTest_EA39C87A9358B705-001/jetty-001/cores
[junit4] 2> 1024580 INFO (TEST-CdcrReplicationDistributedZkTest.doTests-seed#[EA39C87A9358B705]) [ ] o.a.s.c.CoreContainer New CoreContainer 439716428
[junit4] 2> 1024580 INFO (TEST-CdcrReplicationDistributedZkTest.doTests-seed#[EA39C87A9358B705]) [ ] o.a.s.c.CoreContainer Loading cores into CoreContainer [instanceDir=/home/jenkins/workspace/Lucene-Solr-trunk-Linux/solr/build/solr-core/test/J2/temp/solr.cloud.CdcrReplicationDistributedZkTest_EA39C87A9358B705-001/jetty-001/]
[junit4] 2> 1024580 INFO (TEST-CdcrReplicationDistributedZkTest.doTests-seed#[EA39C87A9358B705]) [ ] o.a.s.c.CoreContainer loading shared library: /home/jenkins/workspace/Lucene-Solr-trunk-Linux/solr/build/solr-core/test/J2/temp/solr.cloud.CdcrReplicationDistributedZkTest_EA39C87A9358B705-001/jetty-001/lib
[junit4] 2> 1024580 WARN (TEST-CdcrReplicationDistributedZkTest.doTests-seed#[EA39C87A9358B705]) [ ] o.a.s.c.SolrResourceLoader Can't find (or read) directory to add to classloader: lib (resolved as: /home/jenkins/workspace/Lucene-Solr-trunk-Linux/solr/build/solr-core/test/J2/temp/solr.cloud.CdcrReplicationDistributedZkTest_EA39C87A9358B705-001/jetty-001/lib).
[junit4] 2> 1024585 INFO (TEST-CdcrReplicationDistributedZkTest.doTests-seed#[EA39C87A9358B705]) [ ] o.a.s.h.c.HttpShardHandlerFactory created with socketTimeout : 90000,urlScheme : ,connTimeout : 15000,maxConnectionsPerHost : 20,maxConnections : 10000,corePoolSize : 0,maximumPoolSize : 2147483647,maxThreadIdleTime : 5,sizeOfQueue : -1,fairnessPolicy : false,useRetries : false,
[junit4] 2> 1024586 INFO (TEST-CdcrReplicationDistributedZkTest.doTests-seed#[EA39C87A9358B705]) [ ] o.a.s.u.UpdateShardHandler Creating UpdateShardHandler HTTP client with params: socketTimeout=340000&connTimeout=45000&retry=true
[junit4] 2> 1024587 INFO (TEST-CdcrReplicationDistributedZkTest.doTests-seed#[EA39C87A9358B705]) [ ] o.a.s.l.LogWatcher SLF4J impl is org.slf4j.impl.Log4jLoggerFactory
[junit4] 2> 1024587 INFO (TEST-CdcrReplicationDistributedZkTest.doTests-seed#[EA39C87A9358B705]) [ ] o.a.s.l.LogWatcher Registering Log Listener [Log4j (org.slf4j.impl.Log4jLoggerFactory)]
[junit4] 2> 1024587 INFO (TEST-CdcrReplicationDistributedZkTest.doTests-seed#[EA39C87A9358B705]) [ ] o.a.s.c.ZkContainer Zookeeper client=127.0.0.1:53782/solr
[junit4] 2> 1024588 INFO (TEST-CdcrReplicationDistributedZkTest.doTests-seed#[EA39C87A9358B705]) [ ] o.a.s.c.ZkController zkHost includes chroot
[junit4] 2> 1024588 INFO (TEST-CdcrReplicationDistributedZkTest.doTests-seed#[EA39C87A9358B705]) [ ] o.a.s.c.c.SolrZkClient Using default ZkCredentialsProvider
[junit4] 2> 1024589 INFO (TEST-CdcrReplicationDistributedZkTest.doTests-seed#[EA39C87A9358B705]) [ ] o.a.s.c.c.ConnectionManager Waiting for client to connect to ZooKeeper
[junit4] 2> 1024589 INFO (zkCallback-1082-thread-1) [ ] o.a.s.c.c.ConnectionManager Watcher org.apache.solr.common.cloud.ConnectionManager@342a7c1c name:ZooKeeperConnection Watcher:127.0.0.1:53782 got event WatchedEvent state:SyncConnected type:None path:null path:null type:None
[junit4] 2> 1024589 INFO (TEST-CdcrReplicationDistributedZkTest.doTests-seed#[EA39C87A9358B705]) [ ] o.a.s.c.c.ConnectionManager Client is connected to ZooKeeper
[junit4] 2> 1024590 INFO (TEST-CdcrReplicationDistributedZkTest.doTests-seed#[EA39C87A9358B705]) [ ] o.a.s.c.c.SolrZkClient Using default ZkACLProvider
[junit4] 2> 1024591 INFO (TEST-CdcrReplicationDistributedZkTest.doTests-seed#[EA39C87A9358B705]) [n:127.0.0.1:57509_rq_jl ] o.a.s.c.c.ConnectionManager Waiting for client to connect to ZooKeeper
[junit4] 2> 1024591 INFO (zkCallback-1083-thread-1-processing-n:127.0.0.1:57509_rq_jl) [n:127.0.0.1:57509_rq_jl ] o.a.s.c.c.ConnectionManager Watcher org.apache.solr.common.cloud.ConnectionManager@42584624 name:ZooKeeperConnection Watcher:127.0.0.1:53782/solr got event WatchedEvent state:SyncConnected type:None path:null path:null type:None
[junit4] 2> 1024591 INFO (TEST-CdcrReplicationDistributedZkTest.doTests-seed#[EA39C87A9358B705]) [n:127.0.0.1:57509_rq_jl ] o.a.s.c.c.ConnectionManager Client is connected to ZooKeeper
[junit4] 2> 1024592 INFO (TEST-CdcrReplicationDistributedZkTest.doTests-seed#[EA39C87A9358B705]) [n:127.0.0.1:57509_rq_jl ] o.a.s.c.c.SolrZkClient makePath: /overseer/queue
[junit4] 2> 1024593 INFO (TEST-CdcrReplicationDistributedZkTest.doTests-seed#[EA39C87A9358B705]) [n:127.0.0.1:57509_rq_jl ] o.a.s.c.c.SolrZkClient makePath: /overseer/collection-queue-work
[junit4] 2> 1024594 INFO (TEST-CdcrReplicationDistributedZkTest.doTests-seed#[EA39C87A9358B705]) [n:127.0.0.1:57509_rq_jl ] o.a.s.c.c.SolrZkClient makePath: /overseer/collection-map-running
[junit4] 2> 1024594 INFO (TEST-CdcrReplicationDistributedZkTest.doTests-seed#[EA39C87A9358B705]) [n:127.0.0.1:57509_rq_jl ] o.a.s.c.c.SolrZkClient makePath: /overseer/collection-map-completed
[junit4] 2> 1024595 INFO (TEST-CdcrReplicationDistributedZkTest.doTests-seed#[EA39C87A9358B705]) [n:127.0.0.1:57509_rq_jl ] o.a.s.c.c.SolrZkClient makePath: /overseer/collection-map-failure
[junit4] 2> 1024596 INFO (TEST-CdcrReplicationDistributedZkTest.doTests-seed#[EA39C87A9358B705]) [n:127.0.0.1:57509_rq_jl ] o.a.s.c.c.SolrZkClient makePath: /live_nodes
[junit4] 2> 1024596 INFO (TEST-CdcrReplicationDistributedZkTest.doTests-seed#[EA39C87A9358B705]) [n:127.0.0.1:57509_rq_jl ] o.a.s.c.c.SolrZkClient makePath: /aliases.json
[junit4] 2> 1024597 INFO (TEST-CdcrReplicationDistributedZkTest.doTests-seed#[EA39C87A9358B705]) [n:127.0.0.1:57509_rq_jl ] o.a.s.c.c.SolrZkClient makePath: /clusterstate.json
[junit4] 2> 1024597 INFO (TEST-CdcrReplicationDistributedZkTest.doTests-seed#[EA39C87A9358B705]) [n:127.0.0.1:57509_rq_jl ] o.a.s.c.ZkController Register node as live in ZooKeeper:/live_nodes/127.0.0.1:57509_rq_jl
[junit4] 2> 1024598 INFO (TEST-CdcrReplicationDistributedZkTest.doTests-seed#[EA39C87A9358B705]) [n:127.0.0.1:57509_rq_jl ] o.a.s.c.c.SolrZkClient makePath: /live_nodes/127.0.0.1:57509_rq_jl
[junit4] 2> 1024599 INFO (TEST-CdcrReplicationDistributedZkTest.doTests-seed#[EA39C87A9358B705]) [n:127.0.0.1:57509_rq_jl ] o.a.s.c.c.SolrZkClient makePath: /overseer_elect
[junit4] 2> 1024599 INFO (TEST-CdcrReplicationDistributedZkTest.doTests-seed#[EA39C87A9358B705]) [n:127.0.0.1:57509_rq_jl ] o.a.s.c.c.SolrZkClient makePath: /overseer_elect/election
[junit4] 2> 1024600 INFO (TEST-CdcrReplicationDistributedZkTest.doTests-seed#[EA39C87A9358B705]) [n:127.0.0.1:57509_rq_jl ] o.a.s.c.Overseer Overseer (id=null) closing
[junit4] 2> 1024600 INFO (TEST-CdcrReplicationDistributedZkTest.doTests-seed#[EA39C87A9358B705]) [n:127.0.0.1:57509_rq_jl ] o.a.s.c.LeaderElector Joined leadership election with path: /overseer_elect/election/94278920735490053-127.0.0.1:57509_rq_jl-n_0000000000
[junit4] 2> 1024601 INFO (TEST-CdcrReplicationDistributedZkTest.doTests-seed#[EA39C87A9358B705]) [n:127.0.0.1:57509_rq_jl ] o.a.s.c.OverseerElectionContext I am going to be the leader 127.0.0.1:57509_rq_jl
[junit4] 2> 1024601 INFO (TEST-CdcrReplicationDistributedZkTest.doTests-seed#[EA39C87A9358B705]) [n:127.0.0.1:57509_rq_jl ] o.a.s.c.c.SolrZkClient makePath: /overseer_elect/leader
[junit4] 2> 1024601 INFO (TEST-CdcrReplicationDistributedZkTest.doTests-seed#[EA39C87A9358B705]) [n:127.0.0.1:57509_rq_jl ] o.a.s.c.Overseer Overseer (id=94278920735490053-127.0.0.1:57509_rq_jl-n_0000000000) starting
[junit4] 2> 1024602 INFO (TEST-CdcrReplicationDistributedZkTest.doTests-seed#[EA39C87A9358B705]) [n:127.0.0.1:57509_rq_jl ] o.a.s.c.c.SolrZkClient makePath: /overseer/queue-work
[junit4] 2> 1024604 INFO (TEST-CdcrReplicationDistributedZkTest.doTests-seed#[EA39C87A9358B705]) [n:127.0.0.1:57509_rq_jl ] o.a.s.c.OverseerAutoReplicaFailoverThread Starting OverseerAutoReplicaFailoverThread autoReplicaFailoverWorkLoopDelay=10000 autoReplicaFailoverWaitAfterExpiration=30000 autoReplicaFailoverBadNodeExpiration=60000
[junit4] 2> 1024604 INFO (OverseerCollectionProcessor-94278920735490053-127.0.0.1:57509_rq_jl-n_0000000000) [n:127.0.0.1:57509_rq_jl ] o.a.s.c.OverseerCollectionProcessor Process current queue of collection creations
[junit4] 2> 1024604 INFO (TEST-CdcrReplicationDistributedZkTest.doTests-seed#[EA39C87A9358B705]) [n:127.0.0.1:57509_rq_jl ] o.a.s.c.c.ZkStateReader Updating cluster state from ZooKeeper...
[junit4] 2> 1024605 INFO (OverseerStateUpdate-94278920735490053-127.0.0.1:57509_rq_jl-n_0000000000) [n:127.0.0.1:57509_rq_jl ] o.a.s.c.Overseer Starting to work on the main queue
[junit4] 2> 1024606 INFO (TEST-CdcrReplicationDistributedZkTest.doTests-seed#[EA39C87A9358B705]) [n:127.0.0.1:57509_rq_jl ] o.a.s.c.CoreContainer No authentication plugin used.
[junit4] 2> 1024606 INFO (TEST-CdcrReplicationDistributedZkTest.doTests-seed#[EA39C87A9358B705]) [n:127.0.0.1:57509_rq_jl ] o.a.s.c.CoreContainer Security conf doesn't exist. Skipping setup for authorization module.
[junit4] 2> 1024606 INFO (TEST-CdcrReplicationDistributedZkTest.doTests-seed#[EA39C87A9358B705]) [n:127.0.0.1:57509_rq_jl ] o.a.s.c.CoresLocator Looking for core definitions underneath /home/jenkins/workspace/Lucene-Solr-trunk-Linux/solr/build/solr-core/test/J2/temp/solr.cloud.CdcrReplicationDistributedZkTest_EA39C87A9358B705-001/jetty-001/cores
[junit4] 2> 1024607 INFO (TEST-CdcrReplicationDistributedZkTest.doTests-seed#[EA39C87A9358B705]) [n:127.0.0.1:57509_rq_jl ] o.a.s.c.SolrCore Created CoreDescriptor: {name=collection1, config=solrconfig.xml, transient=false, schema=schema.xml, loadOnStartup=true, configSetProperties=configsetprops.json, instanceDir=/home/jenkins/workspace/Lucene-Solr-trunk-Linux/solr/build/solr-core/test/J2/temp/solr.cloud.CdcrReplicationDistributedZkTest_EA39C87A9358B705-001/jetty-001/cores/collection1, collection=tmp_collection, absoluteInstDir=/home/jenkins/workspace/Lucene-Solr-trunk-Linux/solr/build/solr-core/test/J2/temp/solr.cloud.CdcrReplicationDistributedZkTest_EA39C87A9358B705-001/jetty-001/cores/collection1/, coreNodeName=, dataDir=data/, shard=}
[junit4] 2> 1024607 INFO (TEST-CdcrReplicationDistributedZkTest.doTests-seed#[EA39C87A9358B705]) [n:127.0.0.1:57509_rq_jl ] o.a.s.c.CoresLocator Found core collection1 in /home/jenkins/workspace/Lucene-Solr-trunk-Linux/solr/build/solr-core/test/J2/temp/solr.cloud.CdcrReplicationDistributedZkTest_EA39C87A9358B705-001/jetty-001/cores/collection1/
[junit4] 2> 1024607 INFO (TEST-CdcrReplicationDistributedZkTest.doTests-seed#[EA39C87A9358B705]) [n:127.0.0.1:57509_rq_jl ] o.a.s.c.CoresLocator Found 1 core definitions
[junit4] 2> 1024607 INFO (TEST-CdcrReplicationDistributedZkTest.doTests-seed#[EA39C87A9358B705]) [n:127.0.0.1:57509_rq_jl ] o.a.s.s.SolrDispatchFilter user.dir=/home/jenkins/workspace/Lucene-Solr-trunk-Linux/solr/build/solr-core/test/J2
[junit4] 2> 1024608 INFO (TEST-CdcrReplicationDistributedZkTest.doTests-seed#[EA39C87A9358B705]) [n:127.0.0.1:57509_rq_jl ] o.a.s.s.SolrDispatchFilter SolrDispatchFilter.init() done
[junit4] 2> 1024607 INFO (coreLoadExecutor-4433-thread-1-processing-n:127.0.0.1:57509_rq_jl) [n:127.0.0.1:57509_rq_jl c:tmp_collection x:collection1] o.a.s.c.ZkController publishing state=down
[junit4] 2> 1024608 INFO (coreLoadExecutor-4433-thread-1-processing-n:127.0.0.1:57509_rq_jl) [n:127.0.0.1:57509_rq_jl c:tmp_collection x:collection1] o.a.s.c.ZkController numShards not found on descriptor - reading it from system property
[junit4] 2> 1024608 INFO (zkCallback-1083-thread-1-processing-n:127.0.0.1:57509_rq_jl) [n:127.0.0.1:57509_rq_jl ] o.a.s.c.DistributedQueue NodeChildrenChanged fired on path /overseer/queue state SyncConnected
[junit4] 2> 1024608 INFO (coreLoadExecutor-4433-thread-1-processing-n:127.0.0.1:57509_rq_jl) [n:127.0.0.1:57509_rq_jl c:tmp_collection x:collection1] o.a.s.c.ZkController look for our core node name
[junit4] 2> 1024608 INFO (OverseerStateUpdate-94278920735490053-127.0.0.1:57509_rq_jl-n_0000000000) [n:127.0.0.1:57509_rq_jl ] o.a.s.c.Overseer processMessage: queueSize: 1, message = {
[junit4] 2> "core":"collection1",
[junit4] 2> "roles":null,
[junit4] 2> "base_url":"https://127.0.0.1:57509/rq_jl",
[junit4] 2> "node_name":"127.0.0.1:57509_rq_jl",
[junit4] 2> "numShards":"2",
[junit4] 2> "state":"down",
[junit4] 2> "shard":null,
[junit4] 2> "collection":"tmp_collection",
[junit4] 2> "operation":"state"} current state version: 0
[junit4] 2> 1024609 INFO (OverseerStateUpdate-94278920735490053-127.0.0.1:57509_rq_jl-n_0000000000) [n:127.0.0.1:57509_rq_jl ] o.a.s.c.o.ReplicaMutator Update state numShards=2 message={
[junit4] 2> "core":"collection1",
[junit4] 2> "roles":null,
[junit4] 2> "base_url":"https://127.0.0.1:57509/rq_jl",
[junit4] 2> "node_name":"127.0.0.1:57509_rq_jl",
[junit4] 2> "numShards":"2",
[junit4] 2> "state":"down",
[junit4] 2> "shard":null,
[junit4] 2> "collection":"tmp_collection",
[junit4] 2> "operation":"state"}
[junit4] 2> 1024609 INFO (OverseerStateUpdate-94278920735490053-127.0.0.1:57509_rq_jl-n_0000000000) [n:127.0.0.1:57509_rq_jl ] o.a.s.c.o.ClusterStateMutator building a new cName: tmp_collection
[junit4] 2> 1024609 INFO (OverseerStateUpdate-94278920735490053-127.0.0.1:57509_rq_jl-n_0000000000) [n:127.0.0.1:57509_rq_jl ] o.a.s.c.o.ReplicaMutator Assigning new node to shard shard=shard2
[junit4] 2> 1024610 INFO (zkCallback-1083-thread-1-processing-n:127.0.0.1:57509_rq_jl) [n:127.0.0.1:57509_rq_jl ] o.a.s.c.c.ZkStateReader A cluster state change: WatchedEvent state:SyncConnected type:NodeDataChanged path:/clusterstate.json, has occurred - updating... (live nodes size: 1)
[junit4] 2> 1024611 INFO (zkCallback-1083-thread-1-processing-n:127.0.0.1:57509_rq_jl) [n:127.0.0.1:57509_rq_jl ] o.a.s.c.c.ZkStateReader Updated cluster state version to 1
[junit4] 2> 1025608 INFO (coreLoadExecutor-4433-thread-1-processing-n:127.0.0.1:57509_rq_jl) [n:127.0.0.1:57509_rq_jl c:tmp_collection x:collection1] o.a.s.c.ZkController waiting to find shard id in clusterstate for collection1
[junit4] 2> 1025609 INFO (coreLoadExecutor-4433-thread-1-processing-n:127.0.0.1:57509_rq_jl) [n:127.0.0.1:57509_rq_jl c:tmp_collection x:collection1] o.a.s.c.ZkController Check for collection zkNode:tmp_collection
[junit4] 2> 1025609 INFO (coreLoadExecutor-4433-thread-1-processing-n:127.0.0.1:57509_rq_jl) [n:127.0.0.1:57509_rq_jl c:tmp_collection x:collection1] o.a.s.c.ZkController Creating collection in ZooKeeper:tmp_collection
[junit4] 2> 1025609 INFO (coreLoadExecutor-4433-thread-1-processing-n:127.0.0.1:57509_rq_jl) [n:127.0.0.1:57509_rq_jl c:tmp_collection x:collection1] o.a.s.c.ZkController Looking for collection configName
[junit4] 2> 1025611 INFO (coreLoadExecutor-4433-thread-1-processing-n:127.0.0.1:57509_rq_jl) [n:127.0.0.1:57509_rq_jl c:tmp_collection x:collection1] o.a.s.c.ZkController Only one config set found in zk - using it:conf1
[junit4] 2> 1025611 INFO (coreLoadExecutor-4433-thread-1-processing-n:127.0.0.1:57509_rq_jl) [n:127.0.0.1:57509_rq_jl c:tmp_collection x:collection1] o.a.s.c.c.SolrZkClient makePath: /collections/tmp_collection
[junit4] 2> 1025614 INFO (coreLoadExecutor-4433-thread-1-processing-n:127.0.0.1:57509_rq_jl) [n:127.0.0.1:57509_rq_jl c:tmp_collection x:collection1] o.a.s.c.c.ZkStateReader Load collection config from:/collections/tmp_collection
[junit4] 2> 1025614 INFO (coreLoadExecutor-4433-thread-1-processing-n:127.0.0.1:57509_rq_jl) [n:127.0.0.1:57509_rq_jl c:tmp_collection x:collection1] o.a.s.c.c.ZkStateReader path=/collections/tmp_collection configName=conf1 specified config exists in ZooKeeper
[junit4] 2> 1025614 INFO (coreLoadExecutor-4433-thread-1-processing-n:127.0.0.1:57509_rq_jl) [n:127.0.0.1:57509_rq_jl c:tmp_collection x:collection1] o.a.s.c.SolrResourceLoader new SolrResourceLoader for directory: '/home/jenkins/workspace/Lucene-Solr-trunk-Linux/solr/build/solr-core/test/J2/temp/solr.cloud.CdcrReplicationDistributedZkTest_EA39C87A9358B705-001/jetty-001/cores/collection1/'
[junit4] 2> 1025635 INFO (coreLoadExecutor-4433-thread-1-processing-n:127.0.0.1:57509_rq_jl) [n:127.0.0.1:57509_rq_jl c:tmp_collection x:collection1] o.a.s.c.Config loaded config solrconfig.xml with version 0
[junit4] 2> 1025642 INFO (coreLoadExecutor-4433-thread-1-processing-n:127.0.0.1:57509_rq_jl) [n:127.0.0.1:57509_rq_jl c:tmp_collection x:collection1] o.a.s.c.SolrConfig current version of requestparams : -1
[junit4] 2> 1025646 INFO (coreLoadExecutor-4433-thread-1-processing-n:127.0.0.1:57509_rq_jl) [n:127.0.0.1:57509_rq_jl c:tmp_collection x:collection1] o.a.s.c.SolrConfig Using Lucene MatchVersion: 6.0.0
[junit4] 2> 1025652 INFO (coreLoadExecutor-4433-thread-1-processing-n:127.0.0.1:57509_rq_jl) [n:127.0.0.1:57509_rq_jl c:tmp_collection x:collection1] o.a.s.c.Config Loaded SolrConfig: solrconfig.xml
[junit4] 2> 1025653 INFO (coreLoadExecutor-4433-thread-1-processing-n:127.0.0.1:57509_rq_jl) [n:127.0.0.1:57509_rq_jl c:tmp_collection x:collection1] o.a.s.s.IndexSchema Reading Solr Schema from /configs/conf1/schema.xml
[junit4] 2> 1025658 INFO (coreLoadExecutor-4433-thread-1-processing-n:127.0.0.1:57509_rq_jl) [n:127.0.0.1:57509_rq_jl c:tmp_collection x:collection1] o.a.s.s.IndexSchema [collection1] Schema name=test
[junit4] 2> 1025754 INFO (coreLoadExecutor-4433-thread-1-processing-n:127.0.0.1:57509_rq_jl) [n:127.0.0.1:57509_rq_jl c:tmp_collection x:collection1] o.a.s.s.IndexSchema default search field in schema is text
[junit4] 2> 1025755 INFO (coreLoadExecutor-4433-thread-1-processing-n:127.0.0.1:57509_rq_jl) [n:127.0.0.1:57509_rq_jl c:tmp_collection x:collection1] o.a.s.s.IndexSchema unique key field: id
[junit4] 2> 1025756 INFO (coreLoadExecutor-4433-thread-1-processing-n:127.0.0.1:57509_rq_jl) [n:127.0.0.1:57509_rq_jl c:tmp_collection x:collection1] o.a.s.s.FileExchangeRateProvider Reloading exchange rates from file currency.xml
[junit4] 2> 1025757 INFO (coreLoadExecutor-4433-thread-1-processing-n:127.0.0.1:57509_rq_jl) [n:127.0.0.1:57509_rq_jl c:tmp_collection x:collection1] o.a.s.s.FileExchangeRateProvider Reloading exchange rates from file currency.xml
[junit4] 2> 1025765 INFO (coreLoadExecutor-4433-thread-1-processing-n:127.0.0.1:57509_rq_jl) [n:127.0.0.1:57509_rq_jl c:tmp_collection x:collection1] o.a.s.c.ConfigSetProperties Did not find ConfigSet properties, assuming default properties: Can't find resource 'configsetprops.json' in classpath or '/configs/conf1', cwd=/home/jenkins/workspace/Lucene-Solr-trunk-Linux/solr/build/solr-core/test/J2
[junit4] 2> 1025766 INFO (coreLoadExecutor-4433-thread-1-processing-n:127.0.0.1:57509_rq_jl) [n:127.0.0.1:57509_rq_jl c:tmp_collection x:collection1] o.a.s.c.CoreContainer Creating SolrCore 'collection1' using configuration from collection tmp_collection
[junit4] 2> 1025766 INFO (coreLoadExecutor-4433-thread-1-processing-n:127.0.0.1:57509_rq_jl) [n:127.0.0.1:57509_rq_jl c:tmp_collection s:shard2 r:core_node1 x:collection1] o.a.s.c.SolrCore org.apache.solr.core.MockDirectoryFactory
[junit4] 2> 1025766 INFO (coreLoadExecutor-4433-thread-1-processing-n:127.0.0.1:57509_rq_jl) [n:127.0.0.1:57509_rq_jl c:tmp_collection s:shard2 r:core_node1 x:collection1] o.a.s.c.SolrCore [[collection1] ] Opening new SolrCore at [/home/jenkins/workspace/Lucene-Solr-trunk-Linux/solr/build/solr-core/test/J2/temp/solr.cloud.CdcrReplicationDistributedZkTest_EA39C87A9358B705-001/jetty-001/cores/collection1/], dataDir=[null]
[junit4] 2> 1025766 INFO (coreLoadExecutor-4433-thread-1-processing-n:127.0.0.1:57509_rq_jl) [n:127.0.0.1:57509_rq_jl c:tmp_collection s:shard2 r:core_node1 x:collection1] o.a.s.c.JmxMonitoredMap JMX monitoring is enabled. Adding Solr mbeans to JMX Server: com.sun.jmx.mbeanserver.JmxMBeanServer@49a926a
[junit4] 2> 1025766 INFO (coreLoadExecutor-4433-thread-1-processing-n:127.0.0.1:57509_rq_jl) [n:127.0.0.1:57509_rq_jl c:tmp_collection s:shard2 r:core_node1 x:collection1] o.a.s.c.CachingDirectoryFactory return new directory for /home/jenkins/workspace/Lucene-Solr-trunk-Linux/solr/build/solr-core/test/J2/temp/solr.cloud.CdcrReplicationDistributedZkTest_EA39C87A9358B705-001/jetty-001/cores/collection1/data
[junit4] 2> 1025767 INFO (coreLoadExecutor-4433-thread-1-processing-n:127.0.0.1:57509_rq_jl) [n:127.0.0.1:57509_rq_jl c:tmp_collection s:shard2 r:core_node1 x:collection1] o.a.s.c.SolrCore New index directory detected: old=null new=/home/jenkins/workspace/Lucene-Solr-trunk-Linux/solr/build/solr-core/test/J2/temp/solr.cloud.CdcrReplicationDistributedZkTest_EA39C87A9358B705-001/jetty-001/cores/collection1/data/index/
[junit4] 2> 1025767 WARN (coreLoadExecutor-4433-thread-1-processing-n:127.0.0.1:57509_rq_jl) [n:127.0.0.1:57509_rq_jl c:tmp_collection s:shard2 r:core_node1 x:collection1] o.a.s.c.SolrCore [collection1] Solr index directory '/home/jenkins/workspace/Lucene-Solr-trunk-Linux/solr/build/solr-core/test/J2/temp/solr.cloud.CdcrReplicationDistributedZkTest_EA39C87A9358B705-001/jetty-001/cores/collection1/data/index' doesn't exist. Creating new index...
[junit4] 2> 1025767 INFO (coreLoadExecutor-4433-thread-1-processing-n:127.0.0.1:57509_rq_jl) [n:127.0.0.1:57509_rq_jl c:tmp_collection s:shard2 r:core_node1 x:collection1] o.a.s.c.CachingDirectoryFactory return new directory for /home/jenkins/workspace/Lucene-Solr-trunk-Linux/solr/build/solr-core/test/J2/temp/solr.cloud.CdcrReplicationDistributedZkTest_EA39C87A9358B705-001/jetty-001/cores/collection1/data/index
[junit4] 2> 1025767 INFO (coreLoadExecutor-4433-thread-1-processing-n:127.0.0.1:57509_rq_jl) [n:127.0.0.1:57509_rq_jl c:tmp_collection s:shard2 r:core_node1 x:collection1] o.a.s.u.RandomMergePolicy RandomMergePolicy wrapping class org.apache.lucene.index.TieredMergePolicy: [TieredMergePolicy: maxMergeAtOnce=22, maxMergeAtOnceExplicit=45, maxMergedSegmentMB=76.341796875, floorSegmentMB=1.3857421875, forceMergeDeletesPctAllowed=23.6286078466698, segmentsPerTier=13.0, maxCFSSegmentSizeMB=8.796093022207999E12, noCFSRatio=0.0
[junit4] 2> 1025767 INFO (coreLoadExecutor-4433-thread-1-processing-n:127.0.0.1:57509_rq_jl) [n:127.0.0.1:57509_rq_jl c:tmp_collection s:shard2 r:core_node1 x:collection1] o.a.s.c.SolrCore SolrDeletionPolicy.onCommit: commits: num=1
[junit4] 2> commit{dir=MockDirectoryWrapper(RAMDirectory@81d3fe9 lockFactory=org.apache.lucene.store.SingleInstanceLockFactory@2191e524),segFN=segments_1,generation=1}
[junit4] 2> 1025768 INFO (coreLoadExecutor-4433-thread-1-processing-n:127.0.0.1:57509_rq_jl) [n:127.0.0.1:57509_rq_jl c:tmp_collection s:shard2 r:core_node1 x:collection1] o.a.s.c.SolrCore newest commit generation = 1
[junit4] 2> 1025768 INFO (OldIndexDirectoryCleanupThreadForCore-collection1) [n:127.0.0.1:57509_rq_jl c:tmp_collection s:shard2 r:core_node1 x:collection1] o.a.s.c.SolrCore Looking for old index directories to cleanup for core collection1 in /home/jenkins/workspace/Lucene-Solr-trunk-Linux/solr/build/solr-core/test/J2/temp/solr.cloud.CdcrReplicationDistributedZkTest_EA39C87A9358B705-001/jetty-001/cores/collection1/data/
[junit4] 2> 1025768 WARN (OldIndexDirectoryCleanupThreadForCore-collection1) [n:127.0.0.1:57509_rq_jl c:tmp_collection s:shard2 r:core_node1 x:collection1] o.a.s.c.DirectoryFactory /home/jenkins/workspace/Lucene-Solr-trunk-Linux/solr/build/solr-core/test/J2/temp/solr.cloud.CdcrReplicationDistributedZkTest_EA39C87A9358B705-001/jetty-001/cores/collection1/data/ does not point to a valid data directory; skipping clean-up of old index directories.
[junit4] 2> 1025770 INFO (coreLoadExecutor-4433-thread-1-processing-n:127.0.0.1:57509_rq_jl) [n:127.0.0.1:57509_rq_jl c:tmp_collection s:shard2 r:core_node1 x:collection1] o.a.s.u.p.UpdateRequestProcessorChain creating updateRequestProcessorChain "cdcr-processor-chain"
[junit4] 2> 1025782 INFO (coreLoadExecutor-4433-thread-1-processing-n:127.0.0.1:57509_rq_jl) [n:127.0.0.1:57509_rq_jl c:tmp_collection s:shard2 r:core_node1 x:collection1] o.a.s.c.SolrCore no updateRequestProcessorChain defined as default, creating implicit default
[junit4] 2> 1025787 INFO (coreLoadExecutor-4433-thread-1-processing-n:127.0.0.1:57509_rq_jl) [n:127.0.0.1:57509_rq_jl c:tmp_collection s:shard2 r:core_node1 x:collection1] o.a.s.h.l.XMLLoader xsltCacheLifetimeSeconds=60
[junit4] 2> 1025788 INFO (coreLoadExecutor-4433-thread-1-processing-n:127.0.0.1:57509_rq_jl) [n:127.0.0.1:57509_rq_jl c:tmp_collection s:shard2 r:core_node1 x:collection1] o.a.s.h.l.XMLLoader xsltCacheLifetimeSeconds=60
[junit4] 2> 1025789 INFO (coreLoadExecutor-4433-thread-1-processing-n:127.0.0.1:57509_rq_jl) [n:127.0.0.1:57509_rq_jl c:tmp_collection s:shard2 r:core_node1 x:collection1] o.a.s.h.l.XMLLoader xsltCacheLifetimeSeconds=60
[junit4] 2> 1025790 INFO (coreLoadExecutor-4433-thread-1-processing-n:127.0.0.1:57509_rq_jl) [n:127.0.0.1:57509_rq_jl c:tmp_collection s:shard2 r:core_node1 x:collection1] o.a.s.h.l.XMLLoader xsltCacheLifetimeSeconds=60
[junit4] 2> 1025797 INFO (coreLoadExecutor-4433-thread-1-processing-n:127.0.0.1:57509_rq_jl) [n:127.0.0.1:57509_rq_jl c:tmp_collection s:shard2 r:core_node1 x:collection1] o.a.s.c.RequestHandlers Registered paths: /admin/mbeans,standard,/update/csv,/update/json/docs,/admin/luke,/admin/segments,/get,/admin/system,/replication,/admin/properties,/config,/schema,/admin/plugins,/admin/logging,/update/json,/admin/threads,/admin/ping,/cdcr,/update,/admin/file
[junit4] 2> 1025797 INFO (coreLoadExecutor-4433-thread-1-processing-n:127.0.0.1:57509_rq_jl) [n:127.0.0.1:57509_rq_jl c:tmp_collection s:shard2 r:core_node1 x:collection1] o.a.s.c.SolrCore Using default statsCache cache: org.apache.solr.search.stats.LocalStatsCache
[junit4] 2> 1025805 INFO (coreLoadExecutor-4433-thread-1-processing-n:127.0.0.1:57509_rq_jl) [n:127.0.0.1:57509_rq_jl c:tmp_collection s:shard2 r:core_node1 x:collection1] o.a.s.u.UpdateHandler Using UpdateLog implementation: org.apache.solr.update.CdcrUpdateLog
[junit4] 2> 1025805 INFO (coreLoadExecutor-4433-thread-1-processing-n:127.0.0.1:57509_rq_jl) [n:127.0.0.1:57509_rq_jl c:tmp_collection s:shard2 r:core_node1 x:collection1] o.a.s.u.UpdateLog Initializing UpdateLog: dataDir= defaultSyncLevel=FLUSH numRecordsToKeep=100 maxNumLogsToKeep=10 numVersionBuckets=65536
[junit4] 2> 1025806 INFO (coreLoadExecutor-4433-thread-1-processing-n:127.0.0.1:57509_rq_jl) [n:127.0.0.1:57509_rq_jl c:tmp_collection s:shard2 r:core_node1 x:collection1] o.a.s.c.SolrCore Hard AutoCommit: disabled
[junit4] 2> 1025806 INFO (coreLoadExecutor-4433-thread-1-processing-n:127.0.0.1:57509_rq_jl) [n:127.0.0.1:57509_rq_jl c:tmp_collection s:shard2 r:core_node1 x:collection1] o.a.s.c.SolrCore Soft AutoCommit: disabled
[junit4] 2> 1025807 INFO (coreLoadExecutor-4433-thread-1-processing-n:127.0.0.1:57509_rq_jl) [n:127.0.0.1:57509_rq_jl c:tmp_collection s:shard2 r:core_node1 x:collection1] o.a.s.u.RandomMergePolicy RandomMergePolicy wrapping class org.apache.lucene.index.TieredMergePolicy: [TieredMergePolicy: maxMergeAtOnce=11, maxMergeAtOnceExplicit=11, maxMergedSegmentMB=58.080078125, floorSegmentMB=2.046875, forceMergeDeletesPctAllowed=10.961649011181382, segmentsPerTier=31.0, maxCFSSegmentSizeMB=8.796093022207999E12, noCFSRatio=0.8013965819604078
[junit4] 2> 1025807 INFO (coreLoadExecutor-4433-thread-1-processing-n:127.0.0.1:57509_rq_jl) [n:127.0.0.1:57509_rq_jl c:tmp_collection s:shard2 r:core_node1 x:collection1] o.a.s.c.SolrCore SolrDeletionPolicy.onInit: commits: num=1
[junit4] 2> commit{dir=MockDirectoryWrapper(RAMDirectory@81d3fe9 lockFactory=org.apache.lucene.store.SingleInstanceLockFactory@2191e524),segFN=segments_1,generation=1}
[junit4] 2> 1025807 INFO (coreLoadExecutor-4433-thread-1-processing-n:127.0.0.1:57509_rq_jl) [n:127.0.0.1:57509_rq_jl c:tmp_collection s:shard2 r:core_node1 x:collection1] o.a.s.c.SolrCore newest commit generation = 1
[junit4] 2> 1025807 INFO (coreLoadExecutor-4433-thread-1-processing-n:127.0.0.1:57509_rq_jl) [n:127.0.0.1:57509_rq_jl c:tmp_collection s:shard2 r:core_node1 x:collection1] o.a.s.s.SolrIndexSearcher Opening Searcher@6331564c[collection1] main
[junit4] 2> 1025807 INFO (coreLoadExecutor-4433-thread-1-processing-n:127.0.0.1:57509_rq_jl) [n:127.0.0.1:57509_rq_jl c:tmp_collection s:shard2 r:core_node1 x:collection1] o.a.s.c.c.ZkStateReader Load collection config from:/collections/tmp_collection
[junit4] 2> 1025808 INFO (coreLoadExecutor-4433-thread-1-processing-n:127.0.0.1:57509_rq_jl) [n:127.0.0.1:57509_rq_jl c:tmp_collection s:shard2 r:core_node1 x:collection1] o.a.s.c.c.ZkStateReader path=/collections/tmp_collection configName=conf1 specified config exists in ZooKeeper
[junit4] 2> 1025808 INFO (coreLoadExecutor-4433-thread-1-processing-n:127.0.0.1:57509_rq_jl) [n:127.0.0.1:57509_rq_jl c:tmp_collection s:shard2 r:core_node1 x:collection1] o.a.s.r.ManagedResourceStorage Setting up ZooKeeper-based storage for the RestManager with znodeBase: /configs/conf1
[junit4] 2> 1025808 INFO (coreLoadExecutor-4433-thread-1-processing-n:127.0.0.1:57509_rq_jl) [n:127.0.0.1:57509_rq_jl c:tmp_collection s:shard2 r:core_node1 x:collection1] o.a.s.r.ManagedResourceStorage Configured ZooKeeperStorageIO with znodeBase: /configs/conf1
[junit4] 2> 1025808 INFO (coreLoadExecutor-4433-thread-1-processing-n:127.0.0.1:57509_rq_jl) [n:127.0.0.1:57509_rq_jl c:tmp_collection s:shard2 r:core_node1 x:collection1] o.a.s.r.RestManager Initializing RestManager with initArgs: {}
[junit4] 2> 1025808 INFO (coreLoadExecutor-4433-thread-1-processing-n:127.0.0.1:57509_rq_jl) [n:127.0.0.1:57509_rq_jl c:tmp_collection s:shard2 r:core_node1 x:collection1] o.a.s.r.ManagedResourceStorage Reading _rest_managed.json using ZooKeeperStorageIO:path=/configs/conf1
[junit4] 2> 1025809 INFO (coreLoadExecutor-4433-thread-1-processing-n:127.0.0.1:57509_rq_jl) [n:127.0.0.1:57509_rq_jl c:tmp_collection s:shard2 r:core_node1 x:collection1] o.a.s.r.ManagedResourceStorage No data found for znode /configs/conf1/_rest_managed.json
[junit4] 2> 1025809 INFO (coreLoadExecutor-4433-thread-1-processing-n:127.0.0.1:57509_rq_jl) [n:127.0.0.1:57509_rq_jl c:tmp_collection s:shard2 r:core_node1 x:collection1] o.a.s.r.ManagedResourceStorage Loaded null at path _rest_managed.json using ZooKeeperStorageIO:path=/configs/conf1
[junit4] 2> 1025809 INFO (coreLoadExecutor-4433-thread-1-processing-n:127.0.0.1:57509_rq_jl) [n:127.0.0.1:57509_rq_jl c:tmp_collection s:shard2 r:core_node1 x:collection1] o.a.s.r.RestManager Initializing 0 registered ManagedResources
[junit4] 2> 1025809 INFO (coreLoadExecutor-4433-thread-1-processing-n:127.0.0.1:57509_rq_jl) [n:127.0.0.1:57509_rq_jl c:tmp_collection s:shard2 r:core_node1 x:collection1] o.a.s.h.ReplicationHandler Commits will be reserved for 10000
[junit4] 2> 1025810 INFO (coreLoadExecutor-4433-thread-1-processing-n:127.0.0.1:57509_rq_jl) [n:127.0.0.1:57509_rq_jl c:tmp_collection s:shard2 r:core_node1 x:collection1] o.a.s.c.c.SolrZkClient makePath: /collections/tmp_collection/cdcr/state
[junit4] 2> 1025811 INFO (coreLoadExecutor-4433-thread-1-processing-n:127.0.0.1:57509_rq_jl) [n:127.0.0.1:57509_rq_jl c:tmp_collection s:shard2 r:core_node1 x:collection1] o.a.s.h.CdcrBufferStateManager Created znode /collections/tmp_collection/cdcr/state/buffer
[junit4] 2> 1025812 INFO (coreLoadExecutor-4433-thread-1-processing-n:127.0.0.1:57509_rq_jl) [n:127.0.0.1:57509_rq_jl c:tmp_collection s:shard2 r:core_node1 x:collection1] o.a.s.h.CdcrProcessStateManager Created znode /collections/tmp_collection/cdcr/state/process
[junit4] 2> 1025817 INFO (searcherExecutor-4434-thread-1-processing-n:127.0.0.1:57509_rq_jl x:collection1 s:shard2 c:tmp_collection r:core_node1) [n:127.0.0.1:57509_rq_jl c:tmp_collection s:shard2 r:core_node1 x:collection1] o.a.s.c.SolrCore [collection1] Registered new searcher Searcher@6331564c[collection1] main{ExitableDirectoryReader(UninvertingDirectoryReader())}
[junit4] 2> 1025817 INFO (coreLoadExecutor-4433-thread-1-processing-n:127.0.0.1:57509_rq_jl) [n:127.0.0.1:57509_rq_jl c:tmp_collection s:shard2 r:core_node1 x:collection1] o.a.s.u.UpdateLog Looking up max value of version field to seed version buckets
[junit4] 2> 1025817 INFO (coreLoadExecutor-4433-thread-1-processing-n:127.0.0.1:57509_rq_jl) [n:127.0.0.1:57509_rq_jl c:tmp_collection s:shard2 r:core_node1 x:collection1] o.a.s.u.VersionInfo Refreshing highest value of _version_ for 65536 version buckets from index
[junit4] 2> 1025818 INFO (coreLoadExecutor-4433-thread-1-processing-n:127.0.0.1:57509_rq_jl) [n:127.0.0.1:57509_rq_jl c:tmp_collection s:shard2 r:core_node1 x:collection1] o.a.s.u.VersionInfo No terms found for _version_, cannot seed version bucket highest value from index
[junit4] 2> 1025818 INFO (coreLoadExecutor-4433-thread-1-processing-n:127.0.0.1:57509_rq_jl) [n:127.0.0.1:57509_rq_jl c:tmp_collection s:shard2 r:core_node1 x:collection1] o.a.s.u.UpdateLog Could not find max version in index or recent updates, using new clock 1508462733266255872
[junit4] 2> 1025819 INFO (coreLoadExecutor-4433-thread-1-processing-n:127.0.0.1:57509_rq_jl) [n:127.0.0.1:57509_rq_jl c:tmp_collection s:shard2 r:core_node1 x:collection1] o.a.s.u.UpdateLog Took 2 ms to seed version buckets with highest version 1508462733266255872
[junit4] 2> 1025820 INFO (coreLoadExecutor-4433-thread-1-processing-n:127.0.0.1:57509_rq_jl) [n:127.0.0.1:57509_rq_jl c:tmp_collection s:shard2 r:core_node1 x:collection1] o.a.s.c.ZkController watch zkdir /configs/conf1
[junit4] 2> 1025820 INFO (coreLoadExecutor-4433-thread-1-processing-n:127.0.0.1:57509_rq_jl) [n:127.0.0.1:57509_rq_jl c:tmp_collection s:shard2 r:core_node1 x:collection1] o.a.s.c.CoreContainer registering core: collection1
[junit4] 2> 1025820 INFO (coreZkRegister-4427-thread-1-processing-n:127.0.0.1:57509_rq_jl x:collection1 s:shard2 c:tmp_collection r:core_node1) [n:127.0.0.1:57509_rq_jl c:tmp_collection s:shard2 r:core_node1 x:collection1] o.a.s.c.ZkController Register replica - core:collection1 address:https://127.0.0.1:57509/rq_jl collection:tmp_collection shard:shard2
[junit4] 2> 1025821 INFO (coreZkRegister-4427-thread-1-processing-n:127.0.0.1:57509_rq_jl x:collection1 s:shard2 c:tmp_collection r:core_node1) [n:127.0.0.1:57509_rq_jl c:tmp_collection s:shard2 r:core_node1 x:collection1] o.a.s.c.c.SolrZkClient makePath: /collections/tmp_collection/leader_elect/shard2/election
[junit4] 2> 1025826 INFO (coreZkRegister-4427-thread-1-processing-n:127.0.0.1:57509_rq_jl x:collection1 s:shard2 c:tmp_collection r:core_node1) [n:127.0.0.1:57509_rq_jl c:tmp_collection s:shard2 r:core_node1 x:collection1] o.a.s.c.LeaderElector Joined leadership election with path: /collections/tmp_collection/leader_elect/shard2/election/94278920735490053-core_node1-n_0000000000
[junit4] 2> 1025827 INFO (coreZkRegister-4427-thread-1-processing-n:127.0.0.1:57509_rq_jl x:collection1 s:shard2 c:tmp_collection r:core_node1) [n:127.0.0.1:57509_rq_jl c:tmp_collection s:shard2 r:core_node1 x:collection1] o.a.s.c.ShardLeaderElectionContext Running the leader process for shard shard2
[junit4] 2> 1025828 INFO (zkCallback-1083-thread-1-processing-n:127.0.0.1:57509_rq_jl) [n:127.0.0.1:57509_rq_jl ] o.a.s.c.DistributedQueue NodeChildrenChanged fired on path /overseer/queue state SyncConnected
[junit4] 2> 1025828 INFO (coreZkRegister-4427-thread-1-processing-n:127.0.0.1:57509_rq_jl x:collection1 s:shard2 c:tmp_collection r:core_node1) [n:127.0.0.1:57509_rq_jl c:tmp_collection s:shard2 r:core_node1 x:collection1] o.a.s.c.ShardLeaderElectionContext Enough replicas found to continue.
[junit4] 2> 1025828 INFO (coreZkRegister-4427-thread-1-processing-n:127.0.0.1:57509_rq_jl x:collection1 s:shard2 c:tmp_collection r:core_node1) [n:127.0.0.1:57509_rq_jl c:tmp_collection s:shard2 r:core_node1 x:collection1] o.a.s.c.ShardLeaderElectionContext I may be the new leader - try and sync
[junit4] 2> 1025828 INFO (coreZkRegister-4427-thread-1-processing-n:127.0.0.1:57509_rq_jl x:collection1 s:shard2 c:tmp_collection r:core_node1) [n:127.0.0.1:57509_rq_jl c:tmp_collection s:shard2 r:core_node1 x:collection1] o.a.s.c.SyncStrategy Sync replicas to https://127.0.0.1:57509/rq_jl/collection1/
[junit4] 2> 1025828 INFO (OverseerStateUpdate-94278920735490053-127.0.0.1:57509_rq_jl-n_0000000000) [n:127.0.0.1:57509_rq_jl ] o.a.s.c.Overseer processMessage: queueSize: 1, message = {
[junit4] 2> "operation":"leader",
[junit4] 2> "shard":"shard2",
[junit4] 2> "collection":"tmp_collection"} current state version: 1
[junit4] 2> 1025828 INFO (coreZkRegister-4427-thread-1-processing-n:127.0.0.1:57509_rq_jl x:collection1 s:shard2 c:tmp_collection r:core_node1) [n:127.0.0.1:57509_rq_jl c:tmp_collection s:shard2 r:core_node1 x:collection1] o.a.s.c.SyncStrategy Sync Success - now sync replicas to me
[junit4] 2> 1025828 INFO (coreZkRegister-4427-thread-1-processing-n:127.0.0.1:57509_rq_jl x:collection1 s:shard2 c:tmp_collection r:core_node1) [n:127.0.0.1:57509_rq_jl c:tmp_collection s:shard2 r:core_node1 x:collection1] o.a.s.c.SyncStrategy https://127.0.0.1:57509/rq_jl/collection1/ has no replicas
[junit4] 2> 1025829 INFO (coreZkRegister-4427-thread-1-processing-n:127.0.0.1:57509_rq_jl x:collection1 s:shard2 c:tmp_collection r:core_node1) [n:127.0.0.1:57509_rq_jl c:tmp_collection s:shard2 r:core_node1 x:collection1] o.a.s.c.ShardLeaderElectionContext I am the new leader: https://127.0.0.1:57509/rq_jl/collection1/ shard2
[junit4] 2> 1025829 INFO (coreZkRegister-4427-thread-1-processing-n:127.0.0.1:57509_rq_jl x:collection1 s:shard2 c:tmp_collection r:core_node1) [n:127.0.0.1:57509_rq_jl c:tmp_collection s:shard2 r:core_node1 x:collection1] o.a.s.c.c.SolrZkClient makePath: /collections/tmp_collection/leaders/shard2
[junit4] 2> 1025830 INFO (zkCallback-1083-thread-1-processing-n:127.0.0.1:57509_rq_jl) [n:127.0.0.1:57509_rq_jl ] o.a.s.h.CdcrProcessStateManager Received new leader state @ tmp_collection:shard2
[junit4] 2> 1025831 INFO (zkCallback-1083-thread-2-processing-n:127.0.0.1:57509_rq_jl) [n:127.0.0.1:57509_rq_jl ] o.a.s.c.DistributedQueue NodeChildrenChanged fired on path /overseer/queue state SyncConnected
[junit4] 2> 1025832 INFO (OverseerStateUpdate-94278920735490053-127.0.0.1:57509_rq_jl-n_0000000000) [n:127.0.0.1:57509_rq_jl ] o.a.s.c.Overseer processMessage: queueSize: 1, message = {
[junit4] 2> "operation":"leader",
[junit4] 2> "shard":"shard2",
[junit4] 2> "collection":"tmp_collection",
[junit4] 2> "base_url":"https://127.0.0.1:57509/rq_jl",
[junit4] 2> "core":"collection1",
[junit4] 2> "state":"active"} current state version: 1
[junit4] 2> 1025934 INFO (zkCallback-1083-thread-1-processing-n:127.0.0.1:57509_rq_jl) [n:127.0.0.1:57509_rq_jl ] o.a.s.c.c.ZkStateReader A cluster state change: WatchedEvent state:SyncConnected type:NodeDataChanged path:/clusterstate.json, has occurred - updating... (live nodes size: 1)
[junit4] 2> 1025935 INFO (zkCallback-1083-thread-1-processing-n:127.0.0.1:57509_rq_jl) [n:127.0.0.1:57509_rq_jl ] o.a.s.c.c.ZkStateReader Updated cluster state version to 2
[junit4] 2> 1025982 INFO (coreZkRegister-4427-thread-1-processing-n:127.0.0.1:57509_rq_jl x:collection1 s:shard2 c:tmp_collection r:core_node1) [n:127.0.0.1:57509_rq_jl c:tmp_collection s:shard2 r:core_node1 x:collection1] o.a.s.c.ZkController We are https://127.0.0.1:57509/rq_jl/collection1/ and leader is https://127.0.0.1:57509/rq_jl/collection1/
[junit4] 2> 1025982 INFO (coreZkRegister-4427-thread-1-processing-n:127.0.0.1:57509_rq_jl x:collection1 s:shard2 c:tmp_collection r:core_node1) [n:127.0.0.1:57509_rq_jl c:tmp_collection s:shard2 r:core_node1 x:collection1] o.a.s.c.ZkController No LogReplay needed for core=collection1 baseURL=https://127.0.0.1:57509/rq_jl
[junit4] 2> 1025982 INFO (coreZkRegister-4427-thread-1-processing-n:127.0.0.1:57509_rq_jl x:collection1 s:shard2 c:tmp_collection r:core_node1) [n:127.0.0.1:57509_rq_jl c:tmp_collection s:shard2 r:core_node1 x:collection1] o.a.s.c.ZkController I am the leader, no recovery necessary
[junit4] 2> 1025982 INFO (coreZkRegister-4427-thread-1-processing-n:127.0.0.1:57509_rq_jl x:collection1 s:shard2 c:tmp_collection r:core_node1) [n:127.0.0.1:57509_rq_jl c:tmp_collection s:shard2 r:core_node1 x:collection1] o.a.s.c.ZkController publishing state=active
[junit4] 2> 1025982 INFO (coreZkRegister-4427-thread-1-processing-n:127.0.0.1:57509_rq_jl x:collection1 s:shard2 c:tmp_collection r:core_node1) [n:127.0.0.1:57509_rq_jl c:tmp_collection s:shard2 r:core_node1 x:collection1] o.a.s.c.ZkController numShards not found on descriptor - reading it from system property
[junit4] 2> 1025983 INFO (zkCallback-1083-thread-1-processing-n:127.0.0.1:57509_rq_jl) [n:127.0.0.1:57509_rq_jl ] o.a.s.c.DistributedQueue NodeChildrenChanged fired on path /overseer/queue state SyncConnected
[junit4] 2> 1025983 INFO (OverseerStateUpdate-94278920735490053-127.0.0.1:57509_rq_jl-n_0000000000) [n:127.0.0.1:57509_rq_jl ] o.a.s.c.Overseer processMessage: queueSize: 1, message = {
[junit4] 2> "core":"collection1",
[junit4] 2> "core_node_name":"core_node1",
[junit4] 2> "roles":null,
[junit4] 2> "base_url":"https://127.0.0.1:57509/rq_jl",
[junit4] 2> "node_name":"127.0.0.1:57509_rq_jl",
[junit4] 2> "numShards":"2",
[junit4] 2> "state":"active",
[junit4] 2> "shard":"shard2",
[junit4] 2> "collection":"tmp_collection",
[junit4] 2> "operation":"state"} current state version: 2
[junit4] 2> 1025984 INFO (OverseerStateUpdate-94278920735490053-127.0.0.1:57509_rq_jl-n_0000000000) [n:127.0.0.1:57509_rq_jl ] o.a.s.c.o.ReplicaMutator Update state numShards=2 message={
[junit4] 2> "core":"collection1",
[junit4] 2> "core_node_name":"core_node1",
[junit4] 2> "roles":null,
[junit4] 2> "base_url":"https://127.0.0.1:57509/rq_jl",
[junit4] 2> "node_name":"127.0.0.1:57509_rq_jl",
[junit4] 2> "numShards":"2",
[junit4] 2> "state":"active",
[junit4] 2> "shard":"shard2",
[junit4] 2> "collection":"tmp_collection",
[junit4] 2> "operation":"state"}
[junit4] 2> 1026086 INFO (zkCallback-1083-thread-1-processing-n:127.0.0.1:57509_rq_jl) [n:127.0.0.1:57509_rq_jl ] o.a.s.c.c.ZkStateReader A cluster state change: WatchedEvent state:SyncConnected type:NodeDataChanged path:/clusterstate.json, has occurred - updating... (live nodes size: 1)
[junit4] 2> 1026086 INFO (zkCallback-1083-thread-1-processing-n:127.0.0.1:57509_rq_jl) [n:127.0.0.1:57509_rq_jl ] o.a.s.c.c.ZkStateReader Updated cluster state version to 3
[junit4] 2> 1026158 INFO (TEST-CdcrReplicationDistributedZkTest.doTests-seed#[EA39C87A9358B705]) [ ] o.a.s.SolrTestCaseJ4 Writing core.properties file to /home/jenkins/workspace/Lucene-Solr-trunk-Linux/solr/build/solr-core/test/J2/temp/solr.cloud.CdcrReplicationDistributedZkTest_EA39C87A9358B705-001/jetty-002/cores/collection1
[junit4] 2> 1026159 INFO (TEST-CdcrReplicationDistributedZkTest.doTests-seed#[EA39C87A9358B705]) [ ] o.e.j.s.Server jetty-9.2.11.v20150529
[junit4] 2> 1026161 INFO (TEST-CdcrReplicationDistributedZkTest.doTests-seed#[EA39C87A9358B705]) [ ] o.e.j.s.h.ContextHandler Started o.e.j.s.ServletContextHandler@5a898a38{/rq_jl,null,AVAILABLE}
[junit4] 2> 1026163 INFO (TEST-CdcrReplicationDistributedZkTest.doTests-seed#[EA39C87A9358B705]) [ ] o.e.j.s.ServerConnector Started ServerConnector@2fd74357{SSL-http/1.1}{127.0.0.1:59614}
[junit4] 2> 1026163 INFO (TEST-CdcrReplicationDistributedZkTest.doTests-seed#[EA39C87A9358B705]) [ ] o.e.j.s.Server Started @1027862ms
[junit4] 2> 1026163 INFO (TEST-CdcrReplicationDistributedZkTest.doTests-seed#[EA39C87A9358B705]) [ ] o.a.s.c.s.e.JettySolrRunner Jetty properties: {shards=shard2, hostContext=/rq_jl, hostPort=59614, coreRootDirectory=/home/jenkins/workspace/Lucene-Solr-trunk-Linux/solr/build/solr-core/test/J2/temp/solr.cloud.CdcrReplicationDistributedZkTest_EA39C87A9358B705-001/jetty-002/cores}
[junit4] 2> 1026164 INFO (TEST-CdcrReplicationDistributedZkTest.doTests-seed#[EA39C87A9358B705]) [ ] o.a.s.s.SolrDispatchFilter SolrDispatchFilter.init(): sun.misc.Launcher$AppClassLoader@4e0e2f2a
[junit4] 2> 1026164 INFO (TEST-CdcrReplicationDistributedZkTest.doTests-seed#[EA39C87A9358B705]) [ ] o.a.s.c.SolrResourceLoader new SolrResourceLoader for directory: '/home/jenkins/workspace/Lucene-Solr-trunk-Linux/solr/build/solr-core/test/J2/temp/solr.cloud.CdcrReplicationDistributedZkTest_EA39C87A9358B705-001/jetty-002/'
[junit4] 2> 1026175 INFO (TEST-CdcrReplicationDistributedZkTest.doTests-seed#[EA39C87A9358B705]) [ ] o.a.s.c.c.SolrZkClient Using default ZkCredentialsProvider
[junit4] 2> 1026175 INFO (TEST-CdcrReplicationDistributedZkTest.doTests-seed#[EA39C87A9358B705]) [ ] o.a.s.c.c.ConnectionManager Waiting for client to connect to ZooKeeper
[junit4] 2> 1026176 INFO (zkCallback-1084-thread-1) [ ] o.a.s.c.c.ConnectionManager Watcher org.apache.solr.common.cloud.ConnectionManager@2b6d1e8e name:ZooKeeperConnection Watcher:127.0.0.1:53782/solr got event WatchedEvent state:SyncConnected type:None path:null path:null type:None
[junit4] 2> 1026176 INFO (TEST-CdcrReplicationDistributedZkTest.doTests-seed#[EA39C87A9358B705]) [ ] o.a.s.c.c.ConnectionManager Client is connected to ZooKeeper
[junit4] 2> 1026177 INFO (TEST-CdcrReplicationDistributedZkTest.doTests-seed#[EA39C87A9358B705]) [ ] o.a.s.c.c.SolrZkClient Using default ZkACLProvider
[junit4] 2> 1026177 INFO (TEST-CdcrReplicationDistributedZkTest.doTests-seed#[EA39C87A9358B705]) [ ] o.a.s.s.SolrDispatchFilter Loading solr.xml from SolrHome (not found in ZooKeeper)
[junit4] 2> 1026177 INFO (TEST-CdcrReplicationDistributedZkTest.doTests-seed#[EA39C87A9358B705]) [ ] o.a.s.c.SolrXmlConfig Loading container configuration from /home/jenkins/workspace/Lucene-Solr-trunk-Linux/solr/build/solr-core/test/J2/temp/solr.cloud.CdcrReplicationDistributedZkTest_EA39C87A9358B705-001/jetty-002/solr.xml
[junit4] 2> 1026181 INFO (TEST-CdcrReplicationDistributedZkTest.doTests-seed#[EA39C87A9358B705]) [ ] o.a.s.c.CoresLocator Config-defined core root directory: /home/jenkins/workspace/Lucene-Solr-trunk-Linux/solr/build/solr-core/test/J2/temp/solr.cloud.CdcrReplicationDistributedZkTest_EA39C87A9358B705-001/jetty-002/cores
[junit4] 2> 1026181 INFO (TEST-CdcrReplicationDistributedZkTest.doTests-seed#[EA39C87A9358B705]) [ ] o.a.s.c.CoreContainer New CoreContainer 1278856573
[junit4] 2> 1026181 INFO (TEST-CdcrReplicationDistributedZkTest.doTests-seed#[EA39C87A9358B705]) [ ] o.a.s.c.CoreContainer Loading cores into CoreContainer [instanceDir=/home/jenkins/workspace/Lucene-Solr-trunk-Linux/solr/build/solr-core/test/J2/temp/solr.cloud.CdcrReplicationDistributedZkTest_EA39C87A9358B705-001/jetty-002/]
[junit4] 2> 1026181 INFO (TEST-CdcrReplicationDistributedZkTest.doTests-seed#[EA39C87A9358B705]) [ ] o.a.s.c.CoreContainer loading shared library: /home/jenkins/workspace/Lucene-Solr-trunk-Linux/solr/build/solr-core/test/J2/temp/solr.cloud.CdcrReplicationDistributedZkTest_EA39C87A9358B705-001/jetty-002/lib
[junit4] 2> 1026181 WARN (TEST-CdcrReplicationDistributedZkTest.doTests-seed#[EA39C87A9358B705]) [ ] o.a.s.c.SolrResourceLoader Can't find (or read) directory to add to classloader: lib (resolved as: /home/jenkins/workspace/Lucene-Solr-trunk-Linux/solr/build/solr-core/test/J2/temp/solr.cloud.CdcrReplicationDistributedZkTest_EA39C87A9358B705-001/jetty-002/lib).
[junit4] 2> 1026186 INFO (TEST-CdcrReplicationDistributedZkTest.doTests-seed#[EA39C87A9358B705]) [ ] o.a.s.h.c.HttpShardHandlerFactory created with socketTimeout : 90000,urlScheme : ,connTimeout : 15000,maxConnectionsPerHost : 20,maxConnections : 10000,corePoolSize : 0,maximumPoolSize : 2147483647,maxThreadIdleTime : 5,sizeOfQueue : -1,fairnessPolicy : false,useRetries : false,
[junit4] 2> 1026187 INFO (TEST-CdcrReplicationDistributedZkTest.doTests-seed#[EA39C87A9358B705]) [ ] o.a.s.u.UpdateShardHandler Creating UpdateShardHandler HTTP client with params: socketTimeout=340000&connTimeout=45000&retry=true
[junit4] 2> 1026188 INFO (TEST-CdcrReplicationDistributedZkTest.doTests-seed#[EA39C87A9358B705]) [ ] o.a.s.l.LogWatcher SLF4J impl is org.slf4j.impl.Log4jLoggerFactory
[junit4] 2> 1026188 INFO (TEST-CdcrReplicationDistributedZkTest.doTests-seed#[EA39C87A9358B705]) [ ] o.a.s.l.LogWatcher Registering Log Listener [Log4j (org.slf4j.impl.Log4jLoggerFactory)]
[junit4] 2> 1026188 INFO (TEST-CdcrReplicationDistributedZkTest.doTests-seed#[EA39C87A9358B705]) [ ] o.a.s.c.ZkContainer Zookeeper client=127.0.0.1:53782/solr
[junit4] 2> 1026188 INFO (TEST-CdcrReplicationDistributedZkTest.doTests-seed#[EA39C87A9358B705]) [ ] o.a.s.c.ZkController zkHost includes chroot
[junit4] 2> 1026188 INFO (TEST-CdcrReplicationDistributedZkTest.doTests-seed#[EA39C87A9358B705]) [ ] o.a.s.c.c.SolrZkClient Using default ZkCredentialsProvider
[junit4] 2> 1026189 INFO (TEST-CdcrReplicationDistributedZkTest.doTests-seed#[EA39C87A9358B705]) [ ] o.a.s.c.c.ConnectionManager Waiting for client to connect to ZooKeeper
[junit4] 2> 1026189 INFO (zkCallback-1086-thread-1) [ ] o.a.s.c.c.ConnectionManager Watcher org.apache.solr.common.cloud.ConnectionManager@60020185 name:ZooKeeperConnection Watcher:127.0.0.1:53782 got event WatchedEvent state:SyncConnected type:None path:null path:null type:None
[junit4] 2> 1026189 INFO (TEST-CdcrReplicationDistributedZkTest.doTests-seed#[EA39C87A9358B705]) [ ] o.a.s.c.c.ConnectionManager Client is connected to ZooKeeper
[junit4] 2> 1026190 INFO (TEST-CdcrReplicationDistributedZkTest.doTests-seed#[EA39C87A9358B705]) [ ] o.a.s.c.c.SolrZkClient Using default ZkACLProvider
[junit4] 2> 1026190 INFO (TEST-CdcrReplicationDistributedZkTest.doTests-seed#[EA39C87A9358B705]) [n:127.0.0.1:59614_rq_jl ] o.a.s.c.c.ConnectionManager Waiting for client to connect to ZooKeeper
[junit4] 2> 1026191 INFO (zkCallback-1087-thread-1-processing-n:127.0.0.1:59614_rq_jl) [n:127.0.0.1:59614_rq_jl ] o.a.s.c.c.ConnectionManager Watcher org.apache.solr.common.cloud.ConnectionManager@2d64f67c name:ZooKeeperConnection Watcher:127.0.0.1:53782/solr got event WatchedEvent state:SyncConnected type:None path:null path:null type:None
[junit4] 2> 1026191 INFO (TEST-CdcrReplicationDistributedZkTest.doTests-seed#[EA39C87A9358B705]) [n:127.0.0.1:59614_rq_jl ] o.a.s.c.c.ConnectionManager Client is connected to ZooKeeper
[junit4] 2> 1026194 INFO (TEST-CdcrReplicationDistributedZkTest.doTests-seed#[EA39C87A9358B705]) [n:127.0.0.1:59614_rq_jl ] o.a.s.c.c.ZkStateReader Updating cluster state from ZooKeeper...
[junit4] 2> 1027195 INFO (TEST-CdcrReplicationDistributedZkTest.doTests-seed#[EA39C87A9358B705]) [n:127.0.0.1:59614_rq_jl ] o.a.s.c.ZkController Register node as live in ZooKeeper:/live_nodes/127.0.0.1:59614_rq_jl
[junit4] 2> 1027196 INFO (TEST-CdcrReplicationDistributedZkTest.doTests-seed#[EA39C87A9358B705]) [n:127.0.0.1:59614_rq_jl ] o.a.s.c.c.SolrZkClient makePath: /live_nodes/127.0.0.1:59614_rq_jl
[junit4] 2> 1027197 INFO (TEST-CdcrReplicationDistributedZkTest.doTests-seed#[EA39C87A9358B705]) [n:127.0.0.1:59614_rq_jl ] o.a.s.c.Overseer Overseer (id=null) closing
[junit4] 2> 1027197 INFO (TEST-CdcrReplicationDistributedZkTest.doTests-seed#[EA39C87A9358B705]) [n:127.0.0.1:59614_rq_jl ] o.a.s.c.LeaderElector Joined leadership election with path: /overseer_elect/election/94278920735490056-127.0.0.1:59614_rq_jl-n_0000000001
[junit4] 2> 1027198 INFO (TEST-CdcrReplicationDistributedZkTest.doTests-seed#[EA39C87A9358B705]) [n:127.0.0.1:59614_rq_jl ] o.a.s.c.LeaderElector Watching path /overseer_elect/election/94278920735490053-127.0.0.1:57509_rq_jl-n_0000000000 to know if I could be the leader
[junit4] 2> 1027198 INFO (TEST-CdcrReplicationDistributedZkTest.doTests-seed#[EA39C87A9358B705]) [n:127.0.0.1:59614_rq_jl ] o.a.s.c.CoreContainer No authentication plugin used.
[junit4] 2> 1027198 INFO (TEST-CdcrReplicationDistributedZkTest.doTests-seed#[EA39C87A9358B705]) [n:127.0.0.1:59614_rq_jl ] o.a.s.c.CoreContainer Security conf doesn't exist. Skipping setup for authorization module.
[junit4] 2> 1027199 INFO (TEST-CdcrReplicationDistributedZkTest.doTests-seed#[EA39C87A9358B705]) [n:127.0.0.1:59614_rq_jl ] o.a.s.c.CoresLocator Looking for core definitions underneath /home/jenkins/workspace/Lucene-Solr-trunk-Linux/solr/build/solr-core/test/J2/temp/solr.cloud.CdcrReplicationDistributedZkTest_EA39C87A9358B705-001/jetty-002/cores
[junit4] 2> 1027199 INFO (TEST-CdcrReplicationDistributedZkTest.doTests-seed#[EA39C87A9358B705]) [n:127.0.0.1:59614_rq_jl ] o.a.s.c.SolrCore Created CoreDescriptor: {name=collection1, config=solrconfig.xml, transient=false, schema=schema.xml, loadOnStartup=true, configSetProperties=configsetprops.json, instanceDir=/home/jenkins/workspace/Lucene-Solr-trunk-Linux/solr/build/solr-core/test/J2/temp/solr.cloud.CdcrReplicationDistributedZkTest_EA39C87A9358B705-001/jetty-002/cores/collection1, collection=tmp_collection, absoluteInstDir=/home/jenkins/workspace/Lucene-Solr-trunk-Linux/solr/build/solr-core/test/J2/temp/solr.cloud.CdcrReplicationDistributedZkTest_EA39C87A9358B705-001/jetty-002/cores/collection1/, coreNodeName=, dataDir=data/, shard=}
[junit4] 2> 1027199 INFO (TEST-CdcrReplicationDistributedZkTest.doTests-seed#[EA39C87A9358B705]) [n:127.0.0.1:59614_rq_jl ] o.a.s.c.CoresLocator Found core collection1 in /home/jenkins/workspace/Lucene-Solr-trunk-Linux/solr/build/solr-core/test/J2/temp/solr.cloud.CdcrReplicationDistributedZkTest_EA39C87A9358B705-001/jetty-002/cores/collection1/
[junit4] 2> 1027199 INFO (TEST-CdcrReplicationDistributedZkTest.doTests-seed#[EA39C87A9358B705]) [n:127.0.0.1:59614_rq_jl ] o.a.s.c.CoresLocator Found 1 core definitions
[junit4] 2> 1027200 INFO (coreLoadExecutor-4445-thread-1-processing-n:127.0.0.1:59614_rq_jl) [n:127.0.0.1:59614_rq_jl c:tmp_collection x:collection1] o.a.s.c.ZkController publishing state=down
[junit4] 2> 1027200 INFO (coreLoadExecutor-4445-thread-1-processing-n:127.0.0.1:59614_rq_jl) [n:127.0.0.1:59614_rq_jl c:tmp_collection x:collection1] o.a.s.c.ZkController numShards not found on descriptor - reading it from system property
[junit4] 2> 1027200 INFO (TEST-CdcrReplicationDistributedZkTest.doTests-seed#[EA39C87A9358B705]) [n:127.0.0.1:59614_rq_jl ] o.a.s.s.SolrDispatchFilter user.dir=/home/jenkins/workspace/Lucene-Solr-trunk-Linux/solr/build/solr-core/test/J2
[junit4] 2> 1027201 INFO (TEST-CdcrReplicationDistributedZkTest.doTests-seed#[EA39C87A9358B705]) [n:127.0.0.1:59614_rq_jl ] o.a.s.s.SolrDispatchFilter SolrDispatchFilter.init() done
[junit4] 2> 1027201 INFO (coreLoadExecutor-4445-thread-1-processing-n:127.0.0.1:59614_rq_jl) [n:127.0.0.1:59614_rq_jl c:tmp_collection x:collection1] o.a.s.c.ZkController look for our core node name
[junit4] 2> 1027202 INFO (zkCallback-1083-thread-1-processing-n:127.0.0.1:57509_rq_jl) [n:127.0.0.1:57509_rq_jl ] o.a.s.c.DistributedQueue NodeChildrenChanged fired on path /overseer/queue state SyncConnected
[junit4] 2> 1027203 INFO (OverseerStateUpdate-94278920735490053-127.0.0.1:57509_rq_jl-n_0000000000) [n:127.0.0.1:57509_rq_jl ] o.a.s.c.Overseer processMessage: queueSize: 1, message = {
[junit4] 2> "core":"collection1",
[junit4] 2> "roles":null,
[junit4] 2> "base_url":"https://127.0.0.1:59614/rq_jl",
[junit4] 2> "node_name":"127.0.0.1:59614_rq_jl",
[junit4] 2> "numShards":"2",
[junit4] 2> "state":"down",
[junit4] 2> "shard":null,
[junit4] 2> "collection":"tmp_collection",
[junit4] 2> "operation":"state"} current state version: 3
[junit4] 2> 1027203 INFO (OverseerStateUpdate-94278920735490053-127.0.0.1:57509_rq_jl-n_0000000000) [n:127.0.0.1:57509_rq_jl ] o.a.s.c.o.ReplicaMutator Update state numShards=2 message={
[junit4] 2> "core":"collection1",
[junit4] 2> "roles":null,
[junit4] 2> "base_url":"https://127.0.0.1:59614/rq_jl",
[junit4] 2> "node_name":"127.0.0.1:59614_rq_jl",
[junit4] 2> "numShards":"2",
[junit4] 2> "state":"down",
[junit4] 2> "shard":null,
[junit4] 2> "collection":"tmp_collection",
[junit4] 2> "operation":"state"}
[junit4] 2> 1027203 INFO (OverseerStateUpdate-94278920735490053-127.0.0.1:57509_rq_jl-n_0000000000) [n:127.0.0.1:57509_rq_jl ] o.a.s.c.o.ReplicaMutator Collection already exists with numShards=2
[junit4] 2> 1027203 INFO (OverseerStateUpdate-94278920735490053-127.0.0.1:57509_rq_jl-n_0000000000) [n:127.0.0.1:57509_rq_jl ] o.a.s.c.o.ReplicaMutator Assigning new node to shard shard=shard1
[junit4] 2> 1027305 INFO (zkCallback-1087-thread-1-processing-n:127.0.0.1:59614_rq_jl) [n:127.0.0.1:59614_rq_jl ] o.a.s.c.c.ZkStateReader A cluster state change: WatchedEvent state:SyncConnected type:NodeDataChanged path:/clusterstate.json, has occurred - updating... (live nodes size: 2)
[junit4] 2> 1027305 INFO (zkCallback-1083-thread-1-processing-n:127.0.0.1:57509_rq_jl) [n:127.0.0.1:57509_rq_jl ] o.a.s.c.c.ZkStateReader A cluster state change: WatchedEvent state:SyncConnected type:NodeDataChanged path:/clusterstate.json, has occurred - updating... (live nodes size: 2)
[junit4] 2> 1027305 INFO (zkCallback-1087-thread-1-processing-n:127.0.0.1:59614_rq_jl) [n:127.0.0.1:59614_rq_jl ] o.a.s.c.c.ZkStateReader Updated cluster state version to 4
[junit4] 2> 1027305 INFO (zkCallback-1083-thread-1-processing-n:127.0.0.1:57509_rq_jl) [n:127.0.0.1:57509_rq_jl ] o.a.s.c.c.ZkStateReader Updated cluster state version to 4
[junit4] 2> 1028201 INFO (coreLoadExecutor-4445-thread-1-processing-n:127.0.0.1:59614_rq_jl) [n:127.0.0.1:59614_rq_jl c:tmp_collection x:collection1] o.a.s.c.ZkController waiting to find shard id in clusterstate for collection1
[junit4] 2> 1028201 INFO (coreLoadExecutor-4445-thread-1-processing-n:127.0.0.1:59614_rq_jl) [n:127.0.0.1:59614_rq_jl c:tmp_collection x:collection1] o.a.s.c.ZkController Check for collection zkNode:tmp_collection
[junit4] 2> 1028201 INFO (coreLoadExecutor-4445-thread-1-processing-n:127.0.0.1:59614_rq_jl) [n:127.0.0.1:59614_rq_jl c:tmp_collection x:collection1] o.a.s.c.ZkController Collection zkNode exists
[junit4] 2> 1028201 INFO (coreLoadExecutor-4445-thread-1-processing-n:127.0.0.1:59614_rq_jl) [n:127.0.0.1:59614_rq_jl c:tmp_collection x:collection1] o.a.s.c.c.ZkStateReader Load collection config from:/collections/tmp_collection
[junit4] 2> 1028202 INFO (coreLoadExecutor-4445-thread-1-processing-n:127.0.0.1:59614_rq_jl) [n:127.0.0.1:59614_rq_jl c:tmp_collection x:collection1] o.a.s.c.c.ZkStateReader path=/collections/tmp_collection configName=conf1 specified config exists in ZooKeeper
[junit4] 2> 1028202 INFO (coreLoadExecutor-4445-thread-1-processing-n:127.0.0.1:59614_rq_jl) [n:127.0.0.1:59614_rq_jl c:tmp_collection x:collection1] o.a.s.c.SolrResourceLoader new SolrResourceLoader for directory: '/home/jenkins/workspace/Lucene-Solr-trunk-Linux/solr/build/solr-core/test/J2/temp/solr.cloud.CdcrReplicationDistributedZkTest_EA39C87A9358B705-001/jetty-002/cores/collection1/'
[junit4] 2> 1028210 INFO (coreLoadExecutor-4445-thread-1-processing-n:127.0.0.1:59614_rq_jl) [n:127.0.0.1:59614_rq_jl c:tmp_collection x:collection1] o.a.s.c.Config loaded config solrconfig.xml with version 0
[junit4] 2> 1028213 INFO (coreLoadExecutor-4445-thread-1-processing-n:127.0.0.1:59614_rq_jl) [n:127.0.0.1:59614_rq_jl c:tmp_collection x:collection1] o.a.s.c.SolrConfig current version of requestparams : -1
[junit4] 2> 1028215 INFO (coreLoadExecutor-4445-thread-1-processing-n:127.0.0.1:59614_rq_jl) [n:127.0.0.1:59614_rq_jl c:tmp_collection x:collection1] o.a.s.c.SolrConfig Using Lucene MatchVersion: 6.0.0
[junit4] 2> 1028219 INFO (coreLoadExecutor-4445-thread-1-processing-n:127.0.0.1:59614_rq_jl) [n:127.0.0.1:59614_rq_jl c:tmp_collection x:collection1] o.a.s.c.Config Loaded SolrConfig: solrconfig.xml
[junit4] 2> 1028219 INFO (coreLoadExecutor-4445-thread-1-processing-n:127.0.0.1:59614_rq_jl) [n:127.0.0.1:59614_rq_jl c:tmp_collection x:collection1] o.a.s.s.IndexSchema Reading Solr Schema from /configs/conf1/schema.xml
[junit4] 2> 1028223 INFO (coreLoadExecutor-4445-thread-1-processing-n:127.0.0.1:59614_rq_jl) [n:127.0.0.1:59614_rq_jl c:tmp_collection x:collection1] o.a.s.s.IndexSchema [collection1] Schema name=test
[junit4] 2> 1028283 INFO (coreLoadExecutor-4445-thread-1-processing-n:127.0.0.1:59614_rq_jl) [n:127.0.0.1:59614_rq_jl c:tmp_collection x:collection1] o.a.s.s.IndexSchema default search field in schema is text
[junit4] 2> 1028284 INFO (coreLoadExecutor-4445-thread-1-processing-n:127.0.0.1:59614_rq_jl) [n:127.0.0.1:59614_rq_jl c:tmp_collection x:collection1] o.a.s.s.IndexSchema unique key field: id
[junit4] 2> 1028285 INFO (coreLoadExecutor-4445-thread-1-processing-n:127.0.0.1:59614_rq_jl) [n:127.0.0.1:59614_rq_jl c:tmp_collection x:collection1] o.a.s.s.FileExchangeRateProvider Reloading exchange rates from file currency.xml
[junit4] 2> 1028286 INFO (coreLoadExecutor-4445-thread-1-processing-n:127.0.0.1:59614_rq_jl) [n:127.0.0.1:59614_rq_jl c:tmp_collection x:collection1] o.a.s.s.FileExchangeRateProvider Reloading exchange rates from file currency.xml
[junit4] 2> 1028293 INFO (coreLoadExecutor-4445-thread-1-processing-n:127.0.0.1:59614_rq_jl) [n:127.0.0.1:59614_rq_jl c:tmp_collection x:collection1] o.a.s.c.ConfigSetProperties Did not find ConfigSet properties, assuming default properties: Can't find resource 'configsetprops.json' in classpath or '/configs/conf1', cwd=/home/jenkins/workspace/Lucene-Solr-trunk-Linux/solr/build/solr-core/test/J2
[junit4] 2> 1028293 INFO (coreLoadExecutor-4445-thread-1-processing-n:127.0.0.1:59614_rq_jl) [n:127.0.0.1:59614_rq_jl c:tmp_collection x:collection1] o.a.s.c.CoreContainer Creating SolrCore 'collection1' using configuration from collection tmp_collection
[junit4] 2> 1028293 INFO (coreLoadExecutor-4445-thread-1-processing-n:127.0.0.1:59614_rq_jl) [n:127.0.0.1:59614_rq_jl c:tmp_collection s:shard1 r:core_node2 x:collection1] o.a.s.c.SolrCore org.apache.solr.core.MockDirectoryFactory
[junit4] 2> 1028294 INFO (coreLoadExecutor-4445-thread-1-processing-n:127.0.0.1:59614_rq_jl) [n:127.0.0.1:59614_rq_jl c:tmp_collection s:shard1 r:core_node2 x:collection1] o.a.s.c.SolrCore [[collection1] ] Opening new SolrCore at [/home/jenkins/workspace/Lucene-Solr-trunk-Linux/solr/build/solr-core/test/J2/temp/solr.cloud.CdcrReplicationDistributedZkTest_EA39C87A9358B705-001/jetty-002/cores/collection1/], dataDir=[null]
[junit4] 2> 1028294 INFO (coreLoadExecutor-4445-thread-1-processing-n:127.0.0.1:59614_rq_jl) [n:127.0.0.1:59614_rq_jl c:tmp_collection s:shard1 r:core_node2 x:collection1] o.a.s.c.JmxMonitoredMap JMX monitoring is enabled. Adding Solr mbeans to JMX Server: com.sun.jmx.mbeanserver.JmxMBeanServer@49a926a
[junit4] 2> 1028294 INFO (coreLoadExecutor-4445-thread-1-processing-n:127.0.0.1:59614_rq_jl) [n:127.0.0.1:59614_rq_jl c:tmp_collection s:shard1 r:core_node2 x:collection1] o.a.s.c.CachingDirectoryFactory return new directory for /home/jenkins/workspace/Lucene-Solr-trunk-Linux/solr/build/solr-core/test/J2/temp/solr.cloud.CdcrReplicationDistributedZkTest_EA39C87A9358B705-001/jetty-002/cores/collection1/data
[junit4] 2> 1028294 INFO (coreLoadExecutor-4445-thread-1-processing-n:127.0.0.1:59614_rq_jl) [n:127.0.0.1:59614_rq_jl c:tmp_collection s:shard1 r:core_node2 x:collection1] o.a.s.c.SolrCore New index directory detected: old=null new=/home/jenkins/workspace/Lucene-Solr-trunk-Linux/solr/build/solr-core/test/J2/temp/solr.cloud.CdcrReplicationDistributedZkTest_EA39C87A9358B705-001/jetty-002/cores/collection1/data/index/
[junit4] 2> 1028294 WARN (coreLoadExecutor-4445-thread-1-processing-n:127.0.0.1:59614_rq_jl) [n:127.0.0.1:59614_rq_jl c:tmp_collection s:shard1 r:core_node2 x:collection1] o.a.s.c.SolrCore [collection1] Solr index directory '/home/jenkins/workspace/Lucene-Solr-trunk-Linux/solr/build/solr-core/test/J2/temp/solr.cloud.CdcrReplicationDistributedZkTest_EA39C87A9358B705-001/jetty-002/cores/collection1/data/index' doesn't exist. Creating new index...
[junit4] 2> 1028295 INFO (coreLoadExecutor-4445-thread-1-processing-n:127.0.0.1:59614_rq_jl) [n:127.0.0.1:59614_rq_jl c:tmp_collection s:shard1 r:core_node2 x:collection1] o.a.s.c.CachingDirectoryFactory return new directory for /home/jenkins/workspace/Lucene-Solr-trunk-Linux/solr/build/solr-core/test/J2/temp/solr.cloud.CdcrReplicationDistributedZkTest_EA39C87A9358B705-001/jetty-002/cores/collection1/data/index
[junit4] 2> 1028295 INFO (coreLoadExecutor-4445-thread-1-processing-n:127.0.0.1:59614_rq_jl) [n:127.0.0.1:59614_rq_jl c:tmp_collection s:shard1 r:core_node2 x:collection1] o.a.s.u.RandomMergePolicy RandomMergePolicy wrapping class org.apache.lucene.index.TieredMergePolicy: [TieredMergePolicy: maxMergeAtOnce=22, maxMergeAtOnceExplicit=45, maxMergedSegmentMB=76.341796875, floorSegmentMB=1.3857421875, forceMergeDeletesPctAllowed=23.6286078466698, segmentsPerTier=13.0, maxCFSSegmentSizeMB=8.796093022207999E12, noCFSRatio=0.0
[junit4] 2> 1028295 INFO (coreLoadExecutor-4445-thread-1-processing-n:127.0.0.1:59614_rq_jl) [n:127.0.0.1:59614_rq_jl c:tmp_collection s:shard1 r:core_node2 x:collection1] o.a.s.c.SolrCore SolrDeletionPolicy.onCommit: commits: num=1
[junit4] 2> commit{dir=MockDirectoryWrapper(RAMDirectory@3633d117 lockFactory=org.apache.lucene.store.SingleInstanceLockFactory@18f78edc),segFN=segments_1,generation=1}
[junit4] 2> 1028295 INFO (coreLoadExecutor-4445-thread-1-processing-n:127.0.0.1:59614_rq_jl) [n:127.0.0.1:59614_rq_jl c:tmp_collection s:shard1 r:core_node2 x:collection1] o.a.s.c.SolrCore newest commit generation = 1
[junit4] 2> 1028296 INFO (OldIndexDirectoryCleanupThreadForCore-collection1) [n:127.0.0.1:59614_rq_jl c:tmp_collection s:shard1 r:core_node2 x:collection1] o.a.s.c.SolrCore Looking for old index directories to cleanup for core collection1 in /home/jenkins/workspace/Lucene-Solr-trunk-Linux/solr/build/solr-core/test/J2/temp/solr.cloud.CdcrReplicationDistributedZkTest_EA39C87A9358B705-001/jetty-002/cores/collection1/data/
[junit4] 2> 1028296 WARN (OldIndexDirectoryCleanupThreadForCore-collection1) [n:127.0.0.1:59614_rq_jl c:tmp_collection s:shard1 r:core_node2 x:collection1] o.a.s.c.DirectoryFactory /home/jenkins/workspace/Lucene-Solr-trunk-Linux/solr/build/solr-core/test/J2/temp/solr.cloud.CdcrReplicationDistributedZkTest_EA39C87A9358B705-001/jetty-002/cores/collection1/data/ does not point to a valid data directory; skipping clean-up of old index directories.
[junit4] 2> 1028298 INFO (coreLoadExecutor-4445-thread-1-processing-n:127.0.0.1:59614_rq_jl) [n:127.0.0.1:59614_rq_jl c:tmp_collection s:shard1 r:core_node2 x:collection1] o.a.s.u.p.UpdateRequestProcessorChain creating updateRequestProcessorChain "cdcr-processor-chain"
[junit4] 2> 1028298 INFO (coreLoadExecutor-4445-thread-1-processing-n:127.0.0.1:59614_rq_jl) [n:127.0.0.1:59614_rq_jl c:tmp_collection s:shard1 r:core_node2 x:collection1] o.a.s.c.SolrCore no updateRequestProcessorChain defined as default, creating implicit default
[junit4] 2> 1028300 INFO (coreLoadExecutor-4445-thread-1-processing-n:127.0.0.1:59614_rq_jl) [n:127.0.0.1:59614_rq_jl c:tmp_collection s:shard1 r:core_node2 x:collection1] o.a.s.h.l.XMLLoader xsltCacheLifetimeSeconds=60
[junit4] 2> 1028300 INFO (coreLoadExecutor-4445-thread-1-processing-n:127.0.0.1:59614_rq_jl) [n:127.0.0.1:59614_rq_jl c:tmp_collection s:shard1 r:core_node2 x:collection1] o.a.s.h.l.XMLLoader xsltCacheLifetimeSeconds=60
[junit4] 2> 1028301 INFO (coreLoadExecutor-4445-thread-1-processing-n:127.0.0.1:59614_rq_jl) [n:127.0.0.1:59614_rq_jl c:tmp_collection s:shard1 r:core_node2 x:collection1] o.a.s.h.l.XMLLoader xsltCacheLifetimeSeconds=60
[junit4] 2> 1028302 INFO (coreLoadExecutor-4445-thread-1-processing-n:127.0.0.1:59614_rq_jl) [n:127.0.0.1:59614_rq_jl c:tmp_collection s:shard1 r:core_node2 x:collection1] o.a.s.h.l.XMLLoader xsltCacheLifetimeSeconds=60
[junit4] 2> 1028305 INFO (coreLoadExecutor-4445-thread-1-processing-n:127.0.0.1:59614_rq_jl) [n:127.0.0.1:59614_rq_jl c:tmp_collection s:shard1 r:core_node2 x:collection1] o.a.s.c.RequestHa
[...truncated too long message...]
t4] 2> 8 /solr/collections/tmp_collection/cdcr/state/process
[junit4] 2> 4 /solr/overseer_elect/election/94278920735490074-127.0.0.1:38798_rq_jl-n_0000000005
[junit4] 2> 4 /solr/overseer_elect/election/94278920735490103-127.0.0.1:59614_rq_jl-n_0000000008
[junit4] 2> 2 /solr/collections/target_collection/leader_elect/shard2/election/94278920735490074-core_node4-n_0000000000
[junit4] 2> 2 /solr/collections/source_collection/leader_elect/shard1/election/94278920735490059-core_node2-n_0000000000
[junit4] 2> 2 /solr/overseer_elect/election/94278920735490234-127.0.0.1:47599_rq_jl-n_0000000014
[junit4] 2> 2 /solr/collections/source_collection/leader_elect/shard1/election/94278920735490062-core_node4-n_0000000000
[junit4] 2> 2 /solr/overseer_elect/election/94278920735490053-127.0.0.1:57509_rq_jl-n_0000000000
[junit4] 2> 2 /solr/collections/target_collection/leader_elect/shard2/election/94278920735490074-core_node3-n_0000000000
[junit4] 2> 2 /solr/collections/target_collection/leader_elect/shard1/election/94278920735490080-core_node1-n_0000000000
[junit4] 2> 2 /solr/collections/source_collection/leader_elect/shard1/election/94278920735490579-core_node1-n_0000000000
[junit4] 2> 2 /solr/collections/source_collection/leader_elect/shard2/election/94278920735490059-core_node1-n_0000000000
[junit4] 2>
[junit4] 2> Maximum concurrent children watches above limit:
[junit4] 2>
[junit4] 2> 503 /solr/live_nodes
[junit4] 2> 6 /solr/overseer/queue
[junit4] 2> 6 /solr/overseer/collection-queue-work
[junit4] 2>
[junit4] 2> NOTE: reproduce with: ant test -Dtestcase=CdcrReplicationDistributedZkTest -Dtests.method=doTests -Dtests.seed=EA39C87A9358B705 -Dtests.multiplier=3 -Dtests.slow=true -Dtests.locale=ar_DZ -Dtests.timezone=Africa/Dar_es_Salaam -Dtests.asserts=true -Dtests.file.encoding=US-ASCII
[junit4] ERROR 446s J2 | CdcrReplicationDistributedZkTest.doTests <<<
[junit4] > Throwable #1: org.apache.solr.client.solrj.impl.HttpSolrClient$RemoteSolrException: Error from server at https://127.0.0.1:49092/rq_jl/source_collection_shard1_replica1: ClusterState says we are the leader (https://127.0.0.1:49092/rq_jl/source_collection_shard1_replica1), but locally we don't think so. Request came from null
[junit4] > at __randomizedtesting.SeedInfo.seed([EA39C87A9358B705:E259BD569C569F0E]:0)
[junit4] > at org.apache.solr.client.solrj.impl.HttpSolrClient.executeMethod(HttpSolrClient.java:560)
[junit4] > at org.apache.solr.client.solrj.impl.HttpSolrClient.request(HttpSolrClient.java:234)
[junit4] > at org.apache.solr.client.solrj.impl.HttpSolrClient.request(HttpSolrClient.java:226)
[junit4] > at org.apache.solr.client.solrj.impl.LBHttpSolrClient.doRequest(LBHttpSolrClient.java:376)
[junit4] > at org.apache.solr.client.solrj.impl.LBHttpSolrClient.request(LBHttpSolrClient.java:328)
[junit4] > at org.apache.solr.client.solrj.impl.CloudSolrClient.directUpdate(CloudSolrClient.java:635)
[junit4] > at org.apache.solr.client.solrj.impl.CloudSolrClient.sendRequest(CloudSolrClient.java:967)
[junit4] > at org.apache.solr.client.solrj.impl.CloudSolrClient.requestWithRetryOnStaleState(CloudSolrClient.java:856)
[junit4] > at org.apache.solr.client.solrj.impl.CloudSolrClient.request(CloudSolrClient.java:799)
[junit4] > at org.apache.solr.client.solrj.SolrRequest.process(SolrRequest.java:135)
[junit4] > at org.apache.solr.client.solrj.SolrClient.add(SolrClient.java:107)
[junit4] > at org.apache.solr.client.solrj.SolrClient.add(SolrClient.java:72)
[junit4] > at org.apache.solr.client.solrj.SolrClient.add(SolrClient.java:86)
[junit4] > at org.apache.solr.cloud.BaseCdcrDistributedZkTest.index(BaseCdcrDistributedZkTest.java:184)
[junit4] > at org.apache.solr.cloud.CdcrReplicationDistributedZkTest.doTestOps(CdcrReplicationDistributedZkTest.java:436)
[junit4] > at org.apache.solr.cloud.CdcrReplicationDistributedZkTest.doTests(CdcrReplicationDistributedZkTest.java:52)
[junit4] > at org.apache.solr.BaseDistributedSearchTestCase$ShardsRepeatRule$ShardsFixedStatement.callStatement(BaseDistributedSearchTestCase.java:966)
[junit4] > at org.apache.solr.BaseDistributedSearchTestCase$ShardsRepeatRule$ShardsStatement.evaluate(BaseDistributedSearchTestCase.java:941)
[junit4] > at java.lang.Thread.run(Thread.java:745)
[junit4] 2> 1470187 INFO (SUITE-CdcrReplicationDistributedZkTest-seed#[EA39C87A9358B705]-worker) [n:127.0.0.1:53952_rq_jl c:target_collection s:shard1 r:core_node1 x:target_collection_shard1_replica2] o.a.s.SolrTestCaseJ4 ###deleteCore
[junit4] 2> NOTE: leaving temporary files on disk at: /home/jenkins/workspace/Lucene-Solr-trunk-Linux/solr/build/solr-core/test/J2/temp/solr.cloud.CdcrReplicationDistributedZkTest_EA39C87A9358B705-001
[junit4] 2> Aug 03, 2015 6:16:50 AM com.carrotsearch.randomizedtesting.ThreadLeakControl checkThreadLeaks
[junit4] 2> WARNING: Will linger awaiting termination of 3 leaked thread(s).
[junit4] 2> NOTE: test params are: codec=Asserting(Lucene53): {_version_=PostingsFormat(name=LuceneVarGapFixedInterval), id=FSTOrd50}, docValues:{}, sim=DefaultSimilarity, locale=ar_DZ, timezone=Africa/Dar_es_Salaam
[junit4] 2> NOTE: Linux 3.16.0-44-generic amd64/Oracle Corporation 1.8.0_51 (64-bit)/cpus=12,threads=1,free=256788648,total=515899392
[junit4] 2> NOTE: All tests run in this JVM: [TestZkChroot, AliasIntegrationTest, CoreMergeIndexesAdminHandlerTest, CoreAdminRequestStatusTest, TestCryptoKeys, TestHdfsUpdateLog, TestReloadAndDeleteDocs, TestSolrCloudWithKerberosAlt, TestPseudoReturnFields, SolrCoreCheckLockOnStartupTest, QueryParsingTest, OverseerTest, TestRandomMergePolicy, TestConfigOverlay, IgnoreCommitOptimizeUpdateProcessorFactoryTest, TestRawResponseWriter, PathHierarchyTokenizerFactoryTest, TermVectorComponentDistributedTest, PreAnalyzedUpdateProcessorTest, TestGroupingSearch, UnloadDistributedZkTest, SolrInfoMBeanTest, TestSolrDynamicMBean, TestCollationField, TestManagedSchemaDynamicFieldResource, TestTrie, SearchHandlerTest, TestFieldResource, OverriddenZkACLAndCredentialsProvidersTest, SuggesterTest, PrimUtilsTest, PluginInfoTest, SolrIndexSplitterTest, TestCollectionAPI, TestReplicaProperties, TestBinaryResponseWriter, SampleTest, AutoCommitTest, BigEndianAscendingWordDeserializerTest, SoftAutoCommitTest, TestDocSet, SOLR749Test, TestCursorMarkWithoutUniqueKey, HdfsDirectoryFactoryTest, DirectUpdateHandlerOptimizeTest, TestLuceneMatchVersion, TestReload, LeaderInitiatedRecoveryOnCommitTest, TestCustomDocTransformer, TestQueryUtils, CachingDirectoryFactoryTest, TestJettySolrRunner, PolyFieldTest, QueryResultKeyTest, TestSolrConfigHandler, FacetPivotSmallTest, TestQuerySenderNoQuery, TestReRankQParserPlugin, HardAutoCommitTest, TestCollationFieldDocValues, TestSystemIdResolver, CloudMLTQParserTest, TestLeaderElectionZkExpiry, TestAnalyzeInfixSuggestions, TestSchemaVersionResource, TestStressRecovery, DistributedQueryElevationComponentTest, MoreLikeThisHandlerTest, NotRequiredUniqueKeyTest, OverseerCollectionProcessorTest, HLLSerializationTest, ExplicitHLLTest, TestManagedSchemaFieldTypeResource, TestOrdValues, TestDefaultSearchFieldResource, SortByFunctionTest, TestSurroundQueryParser, SpellCheckCollatorTest, SuggestComponentTest, LoggingHandlerTest, TestSolrQueryParser, TestDefaultSimilarityFactory, AddSchemaFieldsUpdateProcessorFactoryTest, DirectUpdateHandlerTest, ChaosMonkeySafeLeaderTest, BasicDistributedZk2Test, OpenCloseCoreStressTest, LeaderElectionIntegrationTest, BasicZkTest, RecoveryZkTest, FullSolrCloudDistribCmdsTest, TestReplicationHandler, LeaderElectionTest, TestDistributedGrouping, TestRecovery, TestHashPartitioner, DistributedSpellCheckComponentTest, ZkControllerTest, TestStressReorder, TestRangeQuery, TestCoreContainer, SimpleFacetsTest, TestSolr4Spatial, StatsComponentTest, ConvertedLegacyTest, TestFiltering, TermsComponentTest, RequiredFieldsTest, TestCSVResponseWriter, TestPartialUpdateDeduplication, PingRequestHandlerTest, UpdateParamsTest, TestSolrIndexConfig, SolrIndexConfigTest, NumericFieldsTest, TestElisionMultitermQuery, TestConfig, TestPostingsSolrHighlighter, DirectSolrConnectionTest, TestPerFieldSimilarity, TestBM25SimilarityFactory, TimeZoneUtilsTest, OpenExchangeRatesOrgProviderTest, DOMUtilTest, RAMDirectoryFactoryTest, TestSolrJ, TestUtils, UUIDFieldTest, TestRTGBase, CursorPagingTest, TestCrossCoreJoin, TestDistributedMissingSort, TestHighlightDedupGrouping, TestSimpleTrackingShardHandler, TestEmbeddedSolrServerConstructors, ActionThrottleTest, AssignTest, CdcrReplicationDistributedZkTest]
[junit4] Completed [423/529] on J2 in 446.57s, 1 test, 1 error <<< FAILURES!
[...truncated 344 lines...]
BUILD FAILED
/home/jenkins/workspace/Lucene-Solr-trunk-Linux/build.xml:716: The following error occurred while executing this line:
/home/jenkins/workspace/Lucene-Solr-trunk-Linux/build.xml:660: The following error occurred while executing this line:
/home/jenkins/workspace/Lucene-Solr-trunk-Linux/build.xml:59: The following error occurred while executing this line:
/home/jenkins/workspace/Lucene-Solr-trunk-Linux/solr/build.xml:230: The following error occurred while executing this line:
/home/jenkins/workspace/Lucene-Solr-trunk-Linux/solr/common-build.xml:514: The following error occurred while executing this line:
/home/jenkins/workspace/Lucene-Solr-trunk-Linux/lucene/common-build.xml:1429: The following error occurred while executing this line:
/home/jenkins/workspace/Lucene-Solr-trunk-Linux/lucene/common-build.xml:984: There were test failures: 529 suites, 2093 tests, 1 error, 65 ignored (30 assumptions)
Total time: 47 minutes 5 seconds
Build step 'Invoke Ant' marked build as failure
Archiving artifacts
Recording test results
Email was triggered for: Failure - Any
Sending email for trigger: Failure - Any