You are viewing a plain text version of this content. The canonical link for it is here.
Posted to dev@royale.apache.org by ap...@gmail.com on 2020/02/08 12:42:22 UTC
Build failed in Jenkins: royale-asjs #691
See <http://apacheroyaleci2.westus2.cloudapp.azure.com:8080/job/royale-asjs/691/display/redirect?page=changes>
Changes:
[carlosrovira] jewel-combobox: make possible item renderers in combobox popup list
------------------------------------------
[...truncated 1.77 MB...]
[java] Picked up JAVA_TOOL_OPTIONS: -Dfile.encoding=UTF-8 -Xms384m -Xmx2g
[java] Java Result: 2
compile-js:
[echo] swc-date is 02/08/20 12:40 +0000
[delete] Deleting: <http://apacheroyaleci2.westus2.cloudapp.azure.com:8080/job/royale-asjs/ws/frameworks/js/projects/SparkRoyaleJS/SparkRoyaleJS.swc.properties>
clean:
[echo] swc-date is 02/08/20 12:40 +0000
[delete] Deleting: <http://apacheroyaleci2.westus2.cloudapp.azure.com:8080/job/royale-asjs/ws/frameworks/js/projects/SparkRoyaleJS/SparkRoyaleJS.swc.properties>
check-for-tests:
clean-tests:
check-compiler-home:
check-transpiler-home:
check-compiler:
compile:
[echo] Cross-compiling SparkRoyaleJS.swc
[echo] ROYALE_COMPILER_HOME: <http://apacheroyaleci2.westus2.cloudapp.azure.com:8080/job/royale-asjs/ws/js>
[mkdir] Created dir: <http://apacheroyaleci2.westus2.cloudapp.azure.com:8080/job/royale-asjs/ws/frameworks/js/projects/SparkRoyaleJS/target/generated-sources/royale>
[java] args:
[java] +royalelib=<http://apacheroyaleci2.westus2.cloudapp.azure.com:8080/job/royale-asjs/ws/frameworks>
[java] -compiler.define+=GOOG::DEBUG,goog.DEBUG
[java] -compiler.strict-xml=true
[java] -compiler.targets=SWF,JSRoyale
[java] -metadata.date=02/08/20 12:40 +0000
[java] -metadata.dateFormat=MM/dd/yy HH:mm Z
[java] -swf-debugfile-alias=/org/apache/royale/0.9.7
[java] -output=<http://apacheroyaleci2.westus2.cloudapp.azure.com:8080/job/royale-asjs/ws/frameworks/js/projects/SparkRoyaleJS/target/SparkRoyaleJS.swc>
[java] -load-config=<http://apacheroyaleci2.westus2.cloudapp.azure.com:8080/job/royale-asjs/ws/frameworks/js-config.xml>
[java] -load-config+=<http://apacheroyaleci2.westus2.cloudapp.azure.com:8080/job/royale-asjs/ws/frameworks/js/projects/SparkRoyaleJS/src/main/config/compile-js-config.xml>
[java] target:SWF
[java] target:JSRoyale
[java] COMPC
[java] Loading configuration: <http://apacheroyaleci2.westus2.cloudapp.azure.com:8080/job/royale-asjs/ws/frameworks/js-config.xml>
[java] Loading configuration: <http://apacheroyaleci2.westus2.cloudapp.azure.com:8080/job/royale-asjs/ws/frameworks/js/projects/SparkRoyaleJS/src/main/config/compile-js-config.xml>
[java]
[java] <http://apacheroyaleci2.westus2.cloudapp.azure.com:8080/job/royale-asjs/ws/frameworks/projects/SparkRoyale/src/main/royale/spark/skins/spark/FormItemSkin.mxml(169)>: col: 30 Warning: Data binding will not be able to detect assignments to 'x'.
[java]
[java] <s:Group x="{contentGroup.x + contentGroup.contentWidth + 4}" y="{contentGroup.y}"
[java] ^
[java]
[java] <http://apacheroyaleci2.westus2.cloudapp.azure.com:8080/job/royale-asjs/ws/frameworks/projects/SparkRoyale/src/main/royale/spark/skins/spark/FormItemSkin.mxml(169)>: col: 83 Warning: Data binding will not be able to detect assignments to 'y'.
[java]
[java] <s:Group x="{contentGroup.x + contentGroup.contentWidth + 4}" y="{contentGroup.y}"
[java] ^
[java]
[java] 419925 bytes written to C:\jenkins\workspace\royale-asjs\frameworks\js\projects\SparkRoyaleJS\target\SparkRoyaleJS.swc in 17.623 seconds
[java] COMPCJSCRoyale
[java] <http://apacheroyaleci2.westus2.cloudapp.azure.com:8080/job/royale-asjs/ws/frameworks/projects/SparkRoyale/src/main/royale/spark/skins/spark/FormItemSkin.mxml(169)>: col: 30 Data binding will not be able to detect assignments to 'x'.
[java]
[java] <s:Group x="{contentGroup.x + contentGroup.contentWidth + 4}" y="{contentGroup.y}"
[java] ^
[java]
[java] <http://apacheroyaleci2.westus2.cloudapp.azure.com:8080/job/royale-asjs/ws/frameworks/projects/SparkRoyale/src/main/royale/spark/skins/spark/FormItemSkin.mxml(169)>: col: 83 Data binding will not be able to detect assignments to 'y'.
[java]
[java] <s:Group x="{contentGroup.x + contentGroup.contentWidth + 4}" y="{contentGroup.y}"
[java] ^
[java]
[java] Picked up JAVA_TOOL_OPTIONS: -Dfile.encoding=UTF-8 -Xms384m -Xmx2g
[java] 47.4731762 seconds
[java] Java Result: 2
[copy] Copying 1 file to <http://apacheroyaleci2.westus2.cloudapp.azure.com:8080/job/royale-asjs/ws/frameworks/js/libs>
main:
copy-swc:
[copy] Copying 1 file to <http://apacheroyaleci2.westus2.cloudapp.azure.com:8080/job/royale-asjs/ws/frameworks/libs>
check-for-tests:
test:
main:
Crux:
[echo] swc-date is 02/08/20 12:41 +0000
clean:
[echo] swc-date is 02/08/20 12:41 +0000
check-for-tests:
clean-tests:
check-compiler-home:
check-transpiler-home:
check-compiler:
compile:
[echo] swc-date is 02/08/20 12:41 +0000
compile-swf:
[echo] Compiling libs/Crux.swc
[echo] ROYALE_HOME: <http://apacheroyaleci2.westus2.cloudapp.azure.com:8080/job/royale-asjs/ws/>
[echo] ROYALE_SWF_COMPILER_HOME: <http://apacheroyaleci2.westus2.cloudapp.azure.com:8080/job/royale-asjs/ws/>
[echo] ROYALE_COMPILER_HOME: <http://apacheroyaleci2.westus2.cloudapp.azure.com:8080/job/royale-asjs/ws/js>
[java] args:
[java] +royalelib=<http://apacheroyaleci2.westus2.cloudapp.azure.com:8080/job/royale-asjs/ws/frameworks>
[java] +playerglobal.version=11.7
[java] +env.AIR_HOME=C:\adobe\air\4.0\AdobeAIRSDK
[java] -compiler.strict-xml=true
[java] -compiler.targets=SWF,JSRoyale
[java] -metadata.date=02/08/20 12:41 +0000
[java] -metadata.dateFormat=MM/dd/yy HH:mm Z
[java] -swf-debugfile-alias=/org/apache/royale/0.9.7
[java] -output=<http://apacheroyaleci2.westus2.cloudapp.azure.com:8080/job/royale-asjs/ws/frameworks/projects/Crux/target/Crux.swc>
[java] -load-config=<http://apacheroyaleci2.westus2.cloudapp.azure.com:8080/job/royale-asjs/ws/frameworks/projects/Crux/src/main/config/compile-swf-config.xml>
[java] -js-load-config=<http://apacheroyaleci2.westus2.cloudapp.azure.com:8080/job/royale-asjs/ws/frameworks/js-config.xml>
[java] -js-load-config+=<http://apacheroyaleci2.westus2.cloudapp.azure.com:8080/job/royale-asjs/ws/frameworks/projects/Crux/../../js/projects/CruxJS/src/main/config/compile-js-config.xml>
[java] target:SWF
[java] target:JSRoyale
[java] COMPC
[java] Loading configuration: <http://apacheroyaleci2.westus2.cloudapp.azure.com:8080/job/royale-asjs/ws/frameworks/projects/Crux/src/main/config/compile-swf-config.xml>
[java]
[java] 131974 bytes written to C:\jenkins\workspace\royale-asjs\frameworks\projects\Crux\target\Crux.swc in 9.157 seconds
[java] COMPCJSCRoyale
[java] 16.4480089 seconds
[java] Picked up JAVA_TOOL_OPTIONS: -Dfile.encoding=UTF-8 -Xms384m -Xmx2g
compile-js:
[echo] swc-date is 02/08/20 12:41 +0000
[delete] Deleting: <http://apacheroyaleci2.westus2.cloudapp.azure.com:8080/job/royale-asjs/ws/frameworks/js/projects/CruxJS/CruxJS.swc.properties>
clean:
[echo] swc-date is 02/08/20 12:41 +0000
[delete] Deleting: <http://apacheroyaleci2.westus2.cloudapp.azure.com:8080/job/royale-asjs/ws/frameworks/js/projects/CruxJS/CruxJS.swc.properties>
check-for-tests:
clean-tests:
check-compiler-home:
check-transpiler-home:
check-compiler:
compile:
[echo] Cross-compiling CruxJS.swc
[echo] ROYALE_COMPILER_HOME: <http://apacheroyaleci2.westus2.cloudapp.azure.com:8080/job/royale-asjs/ws/js>
[mkdir] Created dir: <http://apacheroyaleci2.westus2.cloudapp.azure.com:8080/job/royale-asjs/ws/frameworks/js/projects/CruxJS/target/generated-sources/royale>
[java] args:
[java] +royalelib=<http://apacheroyaleci2.westus2.cloudapp.azure.com:8080/job/royale-asjs/ws/frameworks>
[java] -compiler.strict-xml=true
[java] -compiler.targets=SWF,JSRoyale
[java] -metadata.date=02/08/20 12:41 +0000
[java] -metadata.dateFormat=MM/dd/yy HH:mm Z
[java] -swf-debugfile-alias=/org/apache/royale/0.9.7
[java] -output=<http://apacheroyaleci2.westus2.cloudapp.azure.com:8080/job/royale-asjs/ws/frameworks/js/projects/CruxJS/target/CruxJS.swc>
[java] -load-config=<http://apacheroyaleci2.westus2.cloudapp.azure.com:8080/job/royale-asjs/ws/frameworks/js-config.xml>
[java] -load-config+=<http://apacheroyaleci2.westus2.cloudapp.azure.com:8080/job/royale-asjs/ws/frameworks/js/projects/CruxJS/src/main/config/compile-js-config.xml>
[java] target:SWF
[java] target:JSRoyale
[java] COMPC
[java] Loading configuration: <http://apacheroyaleci2.westus2.cloudapp.azure.com:8080/job/royale-asjs/ws/frameworks/js-config.xml>
[java] Loading configuration: <http://apacheroyaleci2.westus2.cloudapp.azure.com:8080/job/royale-asjs/ws/frameworks/js/projects/CruxJS/src/main/config/compile-js-config.xml>
[java]
[java] 134388 bytes written to C:\jenkins\workspace\royale-asjs\frameworks\js\projects\CruxJS\target\CruxJS.swc in 6.460 seconds
[java] COMPCJSCRoyale
[java] 15.1114451 seconds
[java] Picked up JAVA_TOOL_OPTIONS: -Dfile.encoding=UTF-8 -Xms384m -Xmx2g
[copy] Copying 1 file to <http://apacheroyaleci2.westus2.cloudapp.azure.com:8080/job/royale-asjs/ws/frameworks/js/libs>
main:
copy-swc:
[copy] Copying 1 file to <http://apacheroyaleci2.westus2.cloudapp.azure.com:8080/job/royale-asjs/ws/frameworks/libs>
check-for-tests:
test:
main:
Jewel:
[echo] swc-date is 02/08/20 12:42 +0000
clean:
[echo] swc-date is 02/08/20 12:42 +0000
check-for-tests:
clean-tests:
check-compiler-home:
check-transpiler-home:
check-compiler:
compile:
[echo] swc-date is 02/08/20 12:42 +0000
compile-swf:
[echo] Compiling libs/Jewel.swc
[echo] ROYALE_HOME: <http://apacheroyaleci2.westus2.cloudapp.azure.com:8080/job/royale-asjs/ws/>
[echo] ROYALE_SWF_COMPILER_HOME: <http://apacheroyaleci2.westus2.cloudapp.azure.com:8080/job/royale-asjs/ws/>
[echo] ROYALE_COMPILER_HOME: <http://apacheroyaleci2.westus2.cloudapp.azure.com:8080/job/royale-asjs/ws/js>
[java] args:
[java] +royalelib=<http://apacheroyaleci2.westus2.cloudapp.azure.com:8080/job/royale-asjs/ws/frameworks>
[java] +playerglobal.version=11.7
[java] +env.AIR_HOME=C:\adobe\air\4.0\AdobeAIRSDK
[java] -compiler.strict-xml=true
[java] -compiler.targets=SWF,JSRoyale
[java] -metadata.date=02/08/20 12:42 +0000
[java] -metadata.dateFormat=MM/dd/yy HH:mm Z
[java] -swf-debugfile-alias=/org/apache/royale/0.9.7
[java] -output=<http://apacheroyaleci2.westus2.cloudapp.azure.com:8080/job/royale-asjs/ws/frameworks/projects/Jewel/target/Jewel.swc>
[java] -load-config=<http://apacheroyaleci2.westus2.cloudapp.azure.com:8080/job/royale-asjs/ws/frameworks/projects/Jewel/src/main/config/compile-swf-config.xml>
[java] -js-load-config=<http://apacheroyaleci2.westus2.cloudapp.azure.com:8080/job/royale-asjs/ws/frameworks/js-config.xml>
[java] -js-load-config+=<http://apacheroyaleci2.westus2.cloudapp.azure.com:8080/job/royale-asjs/ws/frameworks/projects/Jewel/../../js/projects/JewelJS/src/main/config/compile-js-config.xml>
[java] target:SWF
[java] target:JSRoyale
[java] COMPC
[java] Loading configuration: <http://apacheroyaleci2.westus2.cloudapp.azure.com:8080/job/royale-asjs/ws/frameworks/projects/Jewel/src/main/config/compile-swf-config.xml>
[java]
[java] 19.6695153 seconds
[java] <http://apacheroyaleci2.westus2.cloudapp.azure.com:8080/job/royale-asjs/ws/frameworks/projects/Jewel/src/main/royale/org/apache/royale/jewel/beads/views/ComboBoxPopUpView.as(106)>: col: 49 Error: Type was not found or was not a compile-time constant: Event.
[java]
[java] public function beadsAddedHandler(event:Event):void
[java] ^
[java]
[java] <http://apacheroyaleci2.westus2.cloudapp.azure.com:8080/job/royale-asjs/ws/frameworks/projects/Jewel/src/main/royale/org/apache/royale/jewel/beads/views/ComboBoxPopUpView.as(106)>: col: 49 Type was not found or was not a compile-time constant: Event.
[java]
[java] public function beadsAddedHandler(event:Event):void
[java] ^
[java]
[java] Picked up JAVA_TOOL_OPTIONS: -Dfile.encoding=UTF-8 -Xms384m -Xmx2g
[java] Java Result: 3
BUILD FAILED
<http://apacheroyaleci2.westus2.cloudapp.azure.com:8080/job/royale-asjs/ws/build.xml>:667: The following error occurred while executing this line:
<http://apacheroyaleci2.westus2.cloudapp.azure.com:8080/job/royale-asjs/ws/frameworks/build.xml>:146: The following error occurred while executing this line:
<http://apacheroyaleci2.westus2.cloudapp.azure.com:8080/job/royale-asjs/ws/frameworks/build.xml>:550: The following error occurred while executing this line:
<http://apacheroyaleci2.westus2.cloudapp.azure.com:8080/job/royale-asjs/ws/frameworks/projects/Jewel/build.xml>:92: The following error occurred while executing this line:
<http://apacheroyaleci2.westus2.cloudapp.azure.com:8080/job/royale-asjs/ws/frameworks/projects/Jewel/build.xml>:118: condition satisfied
Total time: 35 minutes 30 seconds
Picked up JAVA_TOOL_OPTIONS: -Dfile.encoding=UTF-8 -Xms384m -Xmx2g
Build step 'Invoke Ant' marked build as failure
Skipped archiving because build is not successful
Jenkins build is back to normal : royale-asjs #694
Posted by ap...@gmail.com.
See <http://apacheroyaleci2.westus2.cloudapp.azure.com:8080/job/royale-asjs/694/display/redirect?page=changes>
Build failed in Jenkins: royale-asjs #693
Posted by ap...@gmail.com.
See <http://apacheroyaleci2.westus2.cloudapp.azure.com:8080/job/royale-asjs/693/display/redirect>
Changes:
------------------------------------------
[...truncated 1.77 MB...]
[java] Picked up JAVA_TOOL_OPTIONS: -Dfile.encoding=UTF-8 -Xms384m -Xmx2g
[java] Java Result: 2
compile-js:
[echo] swc-date is 02/08/20 14:59 +0000
[delete] Deleting: <http://apacheroyaleci2.westus2.cloudapp.azure.com:8080/job/royale-asjs/ws/frameworks/js/projects/SparkRoyaleJS/SparkRoyaleJS.swc.properties>
clean:
[echo] swc-date is 02/08/20 14:59 +0000
[delete] Deleting: <http://apacheroyaleci2.westus2.cloudapp.azure.com:8080/job/royale-asjs/ws/frameworks/js/projects/SparkRoyaleJS/SparkRoyaleJS.swc.properties>
check-for-tests:
clean-tests:
check-compiler-home:
check-transpiler-home:
check-compiler:
compile:
[echo] Cross-compiling SparkRoyaleJS.swc
[echo] ROYALE_COMPILER_HOME: <http://apacheroyaleci2.westus2.cloudapp.azure.com:8080/job/royale-asjs/ws/js>
[mkdir] Created dir: <http://apacheroyaleci2.westus2.cloudapp.azure.com:8080/job/royale-asjs/ws/frameworks/js/projects/SparkRoyaleJS/target/generated-sources/royale>
[java] args:
[java] +royalelib=<http://apacheroyaleci2.westus2.cloudapp.azure.com:8080/job/royale-asjs/ws/frameworks>
[java] -compiler.define+=GOOG::DEBUG,goog.DEBUG
[java] -compiler.strict-xml=true
[java] -compiler.targets=SWF,JSRoyale
[java] -metadata.date=02/08/20 14:59 +0000
[java] -metadata.dateFormat=MM/dd/yy HH:mm Z
[java] -swf-debugfile-alias=/org/apache/royale/0.9.7
[java] -output=<http://apacheroyaleci2.westus2.cloudapp.azure.com:8080/job/royale-asjs/ws/frameworks/js/projects/SparkRoyaleJS/target/SparkRoyaleJS.swc>
[java] -load-config=<http://apacheroyaleci2.westus2.cloudapp.azure.com:8080/job/royale-asjs/ws/frameworks/js-config.xml>
[java] -load-config+=<http://apacheroyaleci2.westus2.cloudapp.azure.com:8080/job/royale-asjs/ws/frameworks/js/projects/SparkRoyaleJS/src/main/config/compile-js-config.xml>
[java] target:SWF
[java] target:JSRoyale
[java] COMPC
[java] Loading configuration: <http://apacheroyaleci2.westus2.cloudapp.azure.com:8080/job/royale-asjs/ws/frameworks/js-config.xml>
[java] Loading configuration: <http://apacheroyaleci2.westus2.cloudapp.azure.com:8080/job/royale-asjs/ws/frameworks/js/projects/SparkRoyaleJS/src/main/config/compile-js-config.xml>
[java]
[java] <http://apacheroyaleci2.westus2.cloudapp.azure.com:8080/job/royale-asjs/ws/frameworks/projects/SparkRoyale/src/main/royale/spark/skins/spark/FormItemSkin.mxml(169)>: col: 30 Warning: Data binding will not be able to detect assignments to 'x'.
[java]
[java] <s:Group x="{contentGroup.x + contentGroup.contentWidth + 4}" y="{contentGroup.y}"
[java] ^
[java]
[java] <http://apacheroyaleci2.westus2.cloudapp.azure.com:8080/job/royale-asjs/ws/frameworks/projects/SparkRoyale/src/main/royale/spark/skins/spark/FormItemSkin.mxml(169)>: col: 83 Warning: Data binding will not be able to detect assignments to 'y'.
[java]
[java] <s:Group x="{contentGroup.x + contentGroup.contentWidth + 4}" y="{contentGroup.y}"
[java] ^
[java]
[java] 419925 bytes written to C:\jenkins\workspace\royale-asjs\frameworks\js\projects\SparkRoyaleJS\target\SparkRoyaleJS.swc in 20.969 seconds
[java] COMPCJSCRoyale
[java] 42.1421864 seconds
[java] <http://apacheroyaleci2.westus2.cloudapp.azure.com:8080/job/royale-asjs/ws/frameworks/projects/SparkRoyale/src/main/royale/spark/skins/spark/FormItemSkin.mxml(169)>: col: 30 Data binding will not be able to detect assignments to 'x'.
[java]
[java] <s:Group x="{contentGroup.x + contentGroup.contentWidth + 4}" y="{contentGroup.y}"
[java] ^
[java]
[java] <http://apacheroyaleci2.westus2.cloudapp.azure.com:8080/job/royale-asjs/ws/frameworks/projects/SparkRoyale/src/main/royale/spark/skins/spark/FormItemSkin.mxml(169)>: col: 83 Data binding will not be able to detect assignments to 'y'.
[java]
[java] <s:Group x="{contentGroup.x + contentGroup.contentWidth + 4}" y="{contentGroup.y}"
[java] ^
[java]
[java] Picked up JAVA_TOOL_OPTIONS: -Dfile.encoding=UTF-8 -Xms384m -Xmx2g
[java] Java Result: 2
[copy] Copying 1 file to <http://apacheroyaleci2.westus2.cloudapp.azure.com:8080/job/royale-asjs/ws/frameworks/js/libs>
main:
copy-swc:
[copy] Copying 1 file to <http://apacheroyaleci2.westus2.cloudapp.azure.com:8080/job/royale-asjs/ws/frameworks/libs>
check-for-tests:
test:
main:
Crux:
[echo] swc-date is 02/08/20 14:59 +0000
clean:
[echo] swc-date is 02/08/20 14:59 +0000
check-for-tests:
clean-tests:
check-compiler-home:
check-transpiler-home:
check-compiler:
compile:
[echo] swc-date is 02/08/20 14:59 +0000
compile-swf:
[echo] Compiling libs/Crux.swc
[echo] ROYALE_HOME: <http://apacheroyaleci2.westus2.cloudapp.azure.com:8080/job/royale-asjs/ws/>
[echo] ROYALE_SWF_COMPILER_HOME: <http://apacheroyaleci2.westus2.cloudapp.azure.com:8080/job/royale-asjs/ws/>
[echo] ROYALE_COMPILER_HOME: <http://apacheroyaleci2.westus2.cloudapp.azure.com:8080/job/royale-asjs/ws/js>
[java] args:
[java] +royalelib=<http://apacheroyaleci2.westus2.cloudapp.azure.com:8080/job/royale-asjs/ws/frameworks>
[java] +playerglobal.version=11.7
[java] +env.AIR_HOME=C:\adobe\air\4.0\AdobeAIRSDK
[java] -compiler.strict-xml=true
[java] -compiler.targets=SWF,JSRoyale
[java] -metadata.date=02/08/20 14:59 +0000
[java] -metadata.dateFormat=MM/dd/yy HH:mm Z
[java] -swf-debugfile-alias=/org/apache/royale/0.9.7
[java] -output=<http://apacheroyaleci2.westus2.cloudapp.azure.com:8080/job/royale-asjs/ws/frameworks/projects/Crux/target/Crux.swc>
[java] -load-config=<http://apacheroyaleci2.westus2.cloudapp.azure.com:8080/job/royale-asjs/ws/frameworks/projects/Crux/src/main/config/compile-swf-config.xml>
[java] -js-load-config=<http://apacheroyaleci2.westus2.cloudapp.azure.com:8080/job/royale-asjs/ws/frameworks/js-config.xml>
[java] -js-load-config+=<http://apacheroyaleci2.westus2.cloudapp.azure.com:8080/job/royale-asjs/ws/frameworks/projects/Crux/../../js/projects/CruxJS/src/main/config/compile-js-config.xml>
[java] target:SWF
[java] target:JSRoyale
[java] COMPC
[java] Loading configuration: <http://apacheroyaleci2.westus2.cloudapp.azure.com:8080/job/royale-asjs/ws/frameworks/projects/Crux/src/main/config/compile-swf-config.xml>
[java]
[java] 131974 bytes written to C:\jenkins\workspace\royale-asjs\frameworks\projects\Crux\target\Crux.swc in 8.476 seconds
[java] COMPCJSCRoyale
[java] 20.2089582 seconds
[java] Picked up JAVA_TOOL_OPTIONS: -Dfile.encoding=UTF-8 -Xms384m -Xmx2g
compile-js:
[echo] swc-date is 02/08/20 15:00 +0000
[delete] Deleting: <http://apacheroyaleci2.westus2.cloudapp.azure.com:8080/job/royale-asjs/ws/frameworks/js/projects/CruxJS/CruxJS.swc.properties>
clean:
[echo] swc-date is 02/08/20 15:00 +0000
[delete] Deleting: <http://apacheroyaleci2.westus2.cloudapp.azure.com:8080/job/royale-asjs/ws/frameworks/js/projects/CruxJS/CruxJS.swc.properties>
check-for-tests:
clean-tests:
check-compiler-home:
check-transpiler-home:
check-compiler:
compile:
[echo] Cross-compiling CruxJS.swc
[echo] ROYALE_COMPILER_HOME: <http://apacheroyaleci2.westus2.cloudapp.azure.com:8080/job/royale-asjs/ws/js>
[mkdir] Created dir: <http://apacheroyaleci2.westus2.cloudapp.azure.com:8080/job/royale-asjs/ws/frameworks/js/projects/CruxJS/target/generated-sources/royale>
[java] args:
[java] +royalelib=<http://apacheroyaleci2.westus2.cloudapp.azure.com:8080/job/royale-asjs/ws/frameworks>
[java] -compiler.strict-xml=true
[java] -compiler.targets=SWF,JSRoyale
[java] -metadata.date=02/08/20 15:00 +0000
[java] -metadata.dateFormat=MM/dd/yy HH:mm Z
[java] -swf-debugfile-alias=/org/apache/royale/0.9.7
[java] -output=<http://apacheroyaleci2.westus2.cloudapp.azure.com:8080/job/royale-asjs/ws/frameworks/js/projects/CruxJS/target/CruxJS.swc>
[java] -load-config=<http://apacheroyaleci2.westus2.cloudapp.azure.com:8080/job/royale-asjs/ws/frameworks/js-config.xml>
[java] -load-config+=<http://apacheroyaleci2.westus2.cloudapp.azure.com:8080/job/royale-asjs/ws/frameworks/js/projects/CruxJS/src/main/config/compile-js-config.xml>
[java] target:SWF
[java] target:JSRoyale
[java] COMPC
[java] Loading configuration: <http://apacheroyaleci2.westus2.cloudapp.azure.com:8080/job/royale-asjs/ws/frameworks/js-config.xml>
[java] Loading configuration: <http://apacheroyaleci2.westus2.cloudapp.azure.com:8080/job/royale-asjs/ws/frameworks/js/projects/CruxJS/src/main/config/compile-js-config.xml>
[java]
[java] 134388 bytes written to C:\jenkins\workspace\royale-asjs\frameworks\js\projects\CruxJS\target\CruxJS.swc in 6.577 seconds
[java] COMPCJSCRoyale
[java] 16.1038367 seconds
[java] Picked up JAVA_TOOL_OPTIONS: -Dfile.encoding=UTF-8 -Xms384m -Xmx2g
[copy] Copying 1 file to <http://apacheroyaleci2.westus2.cloudapp.azure.com:8080/job/royale-asjs/ws/frameworks/js/libs>
main:
copy-swc:
[copy] Copying 1 file to <http://apacheroyaleci2.westus2.cloudapp.azure.com:8080/job/royale-asjs/ws/frameworks/libs>
check-for-tests:
test:
main:
Jewel:
[echo] swc-date is 02/08/20 15:00 +0000
clean:
[echo] swc-date is 02/08/20 15:00 +0000
check-for-tests:
clean-tests:
check-compiler-home:
check-transpiler-home:
check-compiler:
compile:
[echo] swc-date is 02/08/20 15:00 +0000
compile-swf:
[echo] Compiling libs/Jewel.swc
[echo] ROYALE_HOME: <http://apacheroyaleci2.westus2.cloudapp.azure.com:8080/job/royale-asjs/ws/>
[echo] ROYALE_SWF_COMPILER_HOME: <http://apacheroyaleci2.westus2.cloudapp.azure.com:8080/job/royale-asjs/ws/>
[echo] ROYALE_COMPILER_HOME: <http://apacheroyaleci2.westus2.cloudapp.azure.com:8080/job/royale-asjs/ws/js>
[java] args:
[java] +royalelib=<http://apacheroyaleci2.westus2.cloudapp.azure.com:8080/job/royale-asjs/ws/frameworks>
[java] +playerglobal.version=11.7
[java] +env.AIR_HOME=C:\adobe\air\4.0\AdobeAIRSDK
[java] -compiler.strict-xml=true
[java] -compiler.targets=SWF,JSRoyale
[java] -metadata.date=02/08/20 15:00 +0000
[java] -metadata.dateFormat=MM/dd/yy HH:mm Z
[java] -swf-debugfile-alias=/org/apache/royale/0.9.7
[java] -output=<http://apacheroyaleci2.westus2.cloudapp.azure.com:8080/job/royale-asjs/ws/frameworks/projects/Jewel/target/Jewel.swc>
[java] -load-config=<http://apacheroyaleci2.westus2.cloudapp.azure.com:8080/job/royale-asjs/ws/frameworks/projects/Jewel/src/main/config/compile-swf-config.xml>
[java] -js-load-config=<http://apacheroyaleci2.westus2.cloudapp.azure.com:8080/job/royale-asjs/ws/frameworks/js-config.xml>
[java] -js-load-config+=<http://apacheroyaleci2.westus2.cloudapp.azure.com:8080/job/royale-asjs/ws/frameworks/projects/Jewel/../../js/projects/JewelJS/src/main/config/compile-js-config.xml>
[java] target:SWF
[java] target:JSRoyale
[java] COMPC
[java] Loading configuration: <http://apacheroyaleci2.westus2.cloudapp.azure.com:8080/job/royale-asjs/ws/frameworks/projects/Jewel/src/main/config/compile-swf-config.xml>
[java]
[java] 24.2655901 seconds
[java] <http://apacheroyaleci2.westus2.cloudapp.azure.com:8080/job/royale-asjs/ws/frameworks/projects/Jewel/src/main/royale/org/apache/royale/jewel/beads/views/ComboBoxPopUpView.as(106)>: col: 49 Error: Type was not found or was not a compile-time constant: Event.
[java]
[java] public function beadsAddedHandler(event:Event):void
[java] ^
[java]
[java] <http://apacheroyaleci2.westus2.cloudapp.azure.com:8080/job/royale-asjs/ws/frameworks/projects/Jewel/src/main/royale/org/apache/royale/jewel/beads/views/ComboBoxPopUpView.as(106)>: col: 49 Type was not found or was not a compile-time constant: Event.
[java]
[java] public function beadsAddedHandler(event:Event):void
[java] ^
[java]
[java] Picked up JAVA_TOOL_OPTIONS: -Dfile.encoding=UTF-8 -Xms384m -Xmx2g
[java] Java Result: 3
BUILD FAILED
<http://apacheroyaleci2.westus2.cloudapp.azure.com:8080/job/royale-asjs/ws/build.xml>:667: The following error occurred while executing this line:
<http://apacheroyaleci2.westus2.cloudapp.azure.com:8080/job/royale-asjs/ws/frameworks/build.xml>:146: The following error occurred while executing this line:
<http://apacheroyaleci2.westus2.cloudapp.azure.com:8080/job/royale-asjs/ws/frameworks/build.xml>:550: The following error occurred while executing this line:
<http://apacheroyaleci2.westus2.cloudapp.azure.com:8080/job/royale-asjs/ws/frameworks/projects/Jewel/build.xml>:92: The following error occurred while executing this line:
<http://apacheroyaleci2.westus2.cloudapp.azure.com:8080/job/royale-asjs/ws/frameworks/projects/Jewel/build.xml>:118: condition satisfied
Total time: 35 minutes 57 seconds
Picked up JAVA_TOOL_OPTIONS: -Dfile.encoding=UTF-8 -Xms384m -Xmx2g
Build step 'Invoke Ant' marked build as failure
Skipped archiving because build is not successful
Build failed in Jenkins: royale-asjs #692
Posted by ap...@gmail.com.
See <http://apacheroyaleci2.westus2.cloudapp.azure.com:8080/job/royale-asjs/692/display/redirect?page=changes>
Changes:
[carlosrovira] jewel-label: refactor styles to be more flexible
[carlosrovira] tour-de-jewel: add icons to the virtual combobox example
------------------------------------------
[...truncated 1.77 MB...]
[java] Picked up JAVA_TOOL_OPTIONS: -Dfile.encoding=UTF-8 -Xms384m -Xmx2g
[java] Java Result: 2
compile-js:
[echo] swc-date is 02/08/20 13:53 +0000
[delete] Deleting: <http://apacheroyaleci2.westus2.cloudapp.azure.com:8080/job/royale-asjs/ws/frameworks/js/projects/SparkRoyaleJS/SparkRoyaleJS.swc.properties>
clean:
[echo] swc-date is 02/08/20 13:53 +0000
[delete] Deleting: <http://apacheroyaleci2.westus2.cloudapp.azure.com:8080/job/royale-asjs/ws/frameworks/js/projects/SparkRoyaleJS/SparkRoyaleJS.swc.properties>
check-for-tests:
clean-tests:
check-compiler-home:
check-transpiler-home:
check-compiler:
compile:
[echo] Cross-compiling SparkRoyaleJS.swc
[echo] ROYALE_COMPILER_HOME: <http://apacheroyaleci2.westus2.cloudapp.azure.com:8080/job/royale-asjs/ws/js>
[mkdir] Created dir: <http://apacheroyaleci2.westus2.cloudapp.azure.com:8080/job/royale-asjs/ws/frameworks/js/projects/SparkRoyaleJS/target/generated-sources/royale>
[java] args:
[java] +royalelib=<http://apacheroyaleci2.westus2.cloudapp.azure.com:8080/job/royale-asjs/ws/frameworks>
[java] -compiler.define+=GOOG::DEBUG,goog.DEBUG
[java] -compiler.strict-xml=true
[java] -compiler.targets=SWF,JSRoyale
[java] -metadata.date=02/08/20 13:53 +0000
[java] -metadata.dateFormat=MM/dd/yy HH:mm Z
[java] -swf-debugfile-alias=/org/apache/royale/0.9.7
[java] -output=<http://apacheroyaleci2.westus2.cloudapp.azure.com:8080/job/royale-asjs/ws/frameworks/js/projects/SparkRoyaleJS/target/SparkRoyaleJS.swc>
[java] -load-config=<http://apacheroyaleci2.westus2.cloudapp.azure.com:8080/job/royale-asjs/ws/frameworks/js-config.xml>
[java] -load-config+=<http://apacheroyaleci2.westus2.cloudapp.azure.com:8080/job/royale-asjs/ws/frameworks/js/projects/SparkRoyaleJS/src/main/config/compile-js-config.xml>
[java] target:SWF
[java] target:JSRoyale
[java] COMPC
[java] Loading configuration: <http://apacheroyaleci2.westus2.cloudapp.azure.com:8080/job/royale-asjs/ws/frameworks/js-config.xml>
[java] Loading configuration: <http://apacheroyaleci2.westus2.cloudapp.azure.com:8080/job/royale-asjs/ws/frameworks/js/projects/SparkRoyaleJS/src/main/config/compile-js-config.xml>
[java]
[java] <http://apacheroyaleci2.westus2.cloudapp.azure.com:8080/job/royale-asjs/ws/frameworks/projects/SparkRoyale/src/main/royale/spark/skins/spark/FormItemSkin.mxml(169)>: col: 30 Warning: Data binding will not be able to detect assignments to 'x'.
[java]
[java] <s:Group x="{contentGroup.x + contentGroup.contentWidth + 4}" y="{contentGroup.y}"
[java] ^
[java]
[java] <http://apacheroyaleci2.westus2.cloudapp.azure.com:8080/job/royale-asjs/ws/frameworks/projects/SparkRoyale/src/main/royale/spark/skins/spark/FormItemSkin.mxml(169)>: col: 83 Warning: Data binding will not be able to detect assignments to 'y'.
[java]
[java] <s:Group x="{contentGroup.x + contentGroup.contentWidth + 4}" y="{contentGroup.y}"
[java] ^
[java]
[java] 419925 bytes written to C:\jenkins\workspace\royale-asjs\frameworks\js\projects\SparkRoyaleJS\target\SparkRoyaleJS.swc in 21.047 seconds
[java] COMPCJSCRoyale
[java] 44.361586 seconds
[java] <http://apacheroyaleci2.westus2.cloudapp.azure.com:8080/job/royale-asjs/ws/frameworks/projects/SparkRoyale/src/main/royale/spark/skins/spark/FormItemSkin.mxml(169)>: col: 30 Data binding will not be able to detect assignments to 'x'.
[java]
[java] <s:Group x="{contentGroup.x + contentGroup.contentWidth + 4}" y="{contentGroup.y}"
[java] ^
[java]
[java] <http://apacheroyaleci2.westus2.cloudapp.azure.com:8080/job/royale-asjs/ws/frameworks/projects/SparkRoyale/src/main/royale/spark/skins/spark/FormItemSkin.mxml(169)>: col: 83 Data binding will not be able to detect assignments to 'y'.
[java]
[java] <s:Group x="{contentGroup.x + contentGroup.contentWidth + 4}" y="{contentGroup.y}"
[java] ^
[java]
[java] Picked up JAVA_TOOL_OPTIONS: -Dfile.encoding=UTF-8 -Xms384m -Xmx2g
[java] Java Result: 2
[copy] Copying 1 file to <http://apacheroyaleci2.westus2.cloudapp.azure.com:8080/job/royale-asjs/ws/frameworks/js/libs>
main:
copy-swc:
[copy] Copying 1 file to <http://apacheroyaleci2.westus2.cloudapp.azure.com:8080/job/royale-asjs/ws/frameworks/libs>
check-for-tests:
test:
main:
Crux:
[echo] swc-date is 02/08/20 13:53 +0000
clean:
[echo] swc-date is 02/08/20 13:53 +0000
check-for-tests:
clean-tests:
check-compiler-home:
check-transpiler-home:
check-compiler:
compile:
[echo] swc-date is 02/08/20 13:53 +0000
compile-swf:
[echo] Compiling libs/Crux.swc
[echo] ROYALE_HOME: <http://apacheroyaleci2.westus2.cloudapp.azure.com:8080/job/royale-asjs/ws/>
[echo] ROYALE_SWF_COMPILER_HOME: <http://apacheroyaleci2.westus2.cloudapp.azure.com:8080/job/royale-asjs/ws/>
[echo] ROYALE_COMPILER_HOME: <http://apacheroyaleci2.westus2.cloudapp.azure.com:8080/job/royale-asjs/ws/js>
[java] args:
[java] +royalelib=<http://apacheroyaleci2.westus2.cloudapp.azure.com:8080/job/royale-asjs/ws/frameworks>
[java] +playerglobal.version=11.7
[java] +env.AIR_HOME=C:\adobe\air\4.0\AdobeAIRSDK
[java] -compiler.strict-xml=true
[java] -compiler.targets=SWF,JSRoyale
[java] -metadata.date=02/08/20 13:53 +0000
[java] -metadata.dateFormat=MM/dd/yy HH:mm Z
[java] -swf-debugfile-alias=/org/apache/royale/0.9.7
[java] -output=<http://apacheroyaleci2.westus2.cloudapp.azure.com:8080/job/royale-asjs/ws/frameworks/projects/Crux/target/Crux.swc>
[java] -load-config=<http://apacheroyaleci2.westus2.cloudapp.azure.com:8080/job/royale-asjs/ws/frameworks/projects/Crux/src/main/config/compile-swf-config.xml>
[java] -js-load-config=<http://apacheroyaleci2.westus2.cloudapp.azure.com:8080/job/royale-asjs/ws/frameworks/js-config.xml>
[java] -js-load-config+=<http://apacheroyaleci2.westus2.cloudapp.azure.com:8080/job/royale-asjs/ws/frameworks/projects/Crux/../../js/projects/CruxJS/src/main/config/compile-js-config.xml>
[java] target:SWF
[java] target:JSRoyale
[java] COMPC
[java] Loading configuration: <http://apacheroyaleci2.westus2.cloudapp.azure.com:8080/job/royale-asjs/ws/frameworks/projects/Crux/src/main/config/compile-swf-config.xml>
[java]
[java] 131974 bytes written to C:\jenkins\workspace\royale-asjs\frameworks\projects\Crux\target\Crux.swc in 8.662 seconds
[java] COMPCJSCRoyale
[java] 18.7713247 seconds
[java] Picked up JAVA_TOOL_OPTIONS: -Dfile.encoding=UTF-8 -Xms384m -Xmx2g
compile-js:
[echo] swc-date is 02/08/20 13:54 +0000
[delete] Deleting: <http://apacheroyaleci2.westus2.cloudapp.azure.com:8080/job/royale-asjs/ws/frameworks/js/projects/CruxJS/CruxJS.swc.properties>
clean:
[echo] swc-date is 02/08/20 13:54 +0000
[delete] Deleting: <http://apacheroyaleci2.westus2.cloudapp.azure.com:8080/job/royale-asjs/ws/frameworks/js/projects/CruxJS/CruxJS.swc.properties>
check-for-tests:
clean-tests:
check-compiler-home:
check-transpiler-home:
check-compiler:
compile:
[echo] Cross-compiling CruxJS.swc
[echo] ROYALE_COMPILER_HOME: <http://apacheroyaleci2.westus2.cloudapp.azure.com:8080/job/royale-asjs/ws/js>
[mkdir] Created dir: <http://apacheroyaleci2.westus2.cloudapp.azure.com:8080/job/royale-asjs/ws/frameworks/js/projects/CruxJS/target/generated-sources/royale>
[java] args:
[java] +royalelib=<http://apacheroyaleci2.westus2.cloudapp.azure.com:8080/job/royale-asjs/ws/frameworks>
[java] -compiler.strict-xml=true
[java] -compiler.targets=SWF,JSRoyale
[java] -metadata.date=02/08/20 13:54 +0000
[java] -metadata.dateFormat=MM/dd/yy HH:mm Z
[java] -swf-debugfile-alias=/org/apache/royale/0.9.7
[java] -output=<http://apacheroyaleci2.westus2.cloudapp.azure.com:8080/job/royale-asjs/ws/frameworks/js/projects/CruxJS/target/CruxJS.swc>
[java] -load-config=<http://apacheroyaleci2.westus2.cloudapp.azure.com:8080/job/royale-asjs/ws/frameworks/js-config.xml>
[java] -load-config+=<http://apacheroyaleci2.westus2.cloudapp.azure.com:8080/job/royale-asjs/ws/frameworks/js/projects/CruxJS/src/main/config/compile-js-config.xml>
[java] target:SWF
[java] target:JSRoyale
[java] COMPC
[java] Loading configuration: <http://apacheroyaleci2.westus2.cloudapp.azure.com:8080/job/royale-asjs/ws/frameworks/js-config.xml>
[java] Loading configuration: <http://apacheroyaleci2.westus2.cloudapp.azure.com:8080/job/royale-asjs/ws/frameworks/js/projects/CruxJS/src/main/config/compile-js-config.xml>
[java]
[java] 134388 bytes written to C:\jenkins\workspace\royale-asjs\frameworks\js\projects\CruxJS\target\CruxJS.swc in 5.928 seconds
[java] COMPCJSCRoyale
[java] 15.150131 seconds
[java] Picked up JAVA_TOOL_OPTIONS: -Dfile.encoding=UTF-8 -Xms384m -Xmx2g
[copy] Copying 1 file to <http://apacheroyaleci2.westus2.cloudapp.azure.com:8080/job/royale-asjs/ws/frameworks/js/libs>
main:
copy-swc:
[copy] Copying 1 file to <http://apacheroyaleci2.westus2.cloudapp.azure.com:8080/job/royale-asjs/ws/frameworks/libs>
check-for-tests:
test:
main:
Jewel:
[echo] swc-date is 02/08/20 13:54 +0000
clean:
[echo] swc-date is 02/08/20 13:54 +0000
check-for-tests:
clean-tests:
check-compiler-home:
check-transpiler-home:
check-compiler:
compile:
[echo] swc-date is 02/08/20 13:54 +0000
compile-swf:
[echo] Compiling libs/Jewel.swc
[echo] ROYALE_HOME: <http://apacheroyaleci2.westus2.cloudapp.azure.com:8080/job/royale-asjs/ws/>
[echo] ROYALE_SWF_COMPILER_HOME: <http://apacheroyaleci2.westus2.cloudapp.azure.com:8080/job/royale-asjs/ws/>
[echo] ROYALE_COMPILER_HOME: <http://apacheroyaleci2.westus2.cloudapp.azure.com:8080/job/royale-asjs/ws/js>
[java] args:
[java] +royalelib=<http://apacheroyaleci2.westus2.cloudapp.azure.com:8080/job/royale-asjs/ws/frameworks>
[java] +playerglobal.version=11.7
[java] +env.AIR_HOME=C:\adobe\air\4.0\AdobeAIRSDK
[java] -compiler.strict-xml=true
[java] -compiler.targets=SWF,JSRoyale
[java] -metadata.date=02/08/20 13:54 +0000
[java] -metadata.dateFormat=MM/dd/yy HH:mm Z
[java] -swf-debugfile-alias=/org/apache/royale/0.9.7
[java] -output=<http://apacheroyaleci2.westus2.cloudapp.azure.com:8080/job/royale-asjs/ws/frameworks/projects/Jewel/target/Jewel.swc>
[java] -load-config=<http://apacheroyaleci2.westus2.cloudapp.azure.com:8080/job/royale-asjs/ws/frameworks/projects/Jewel/src/main/config/compile-swf-config.xml>
[java] -js-load-config=<http://apacheroyaleci2.westus2.cloudapp.azure.com:8080/job/royale-asjs/ws/frameworks/js-config.xml>
[java] -js-load-config+=<http://apacheroyaleci2.westus2.cloudapp.azure.com:8080/job/royale-asjs/ws/frameworks/projects/Jewel/../../js/projects/JewelJS/src/main/config/compile-js-config.xml>
[java] target:SWF
[java] target:JSRoyale
[java] COMPC
[java] Loading configuration: <http://apacheroyaleci2.westus2.cloudapp.azure.com:8080/job/royale-asjs/ws/frameworks/projects/Jewel/src/main/config/compile-swf-config.xml>
[java]
[java] <http://apacheroyaleci2.westus2.cloudapp.azure.com:8080/job/royale-asjs/ws/frameworks/projects/Jewel/src/main/royale/org/apache/royale/jewel/beads/views/ComboBoxPopUpView.as(106)>: col: 49 Error: Type was not found or was not a compile-time constant: Event.
[java]
[java] public function beadsAddedHandler(event:Event):void
[java] ^
[java]
[java] <http://apacheroyaleci2.westus2.cloudapp.azure.com:8080/job/royale-asjs/ws/frameworks/projects/Jewel/src/main/royale/org/apache/royale/jewel/beads/views/ComboBoxPopUpView.as(106)>: col: 49 Type was not found or was not a compile-time constant: Event.
[java]
[java] public function beadsAddedHandler(event:Event):void
[java] ^
[java]
[java] 19.6490398 seconds
[java] Picked up JAVA_TOOL_OPTIONS: -Dfile.encoding=UTF-8 -Xms384m -Xmx2g
[java] Java Result: 3
BUILD FAILED
<http://apacheroyaleci2.westus2.cloudapp.azure.com:8080/job/royale-asjs/ws/build.xml>:667: The following error occurred while executing this line:
<http://apacheroyaleci2.westus2.cloudapp.azure.com:8080/job/royale-asjs/ws/frameworks/build.xml>:146: The following error occurred while executing this line:
<http://apacheroyaleci2.westus2.cloudapp.azure.com:8080/job/royale-asjs/ws/frameworks/build.xml>:550: The following error occurred while executing this line:
<http://apacheroyaleci2.westus2.cloudapp.azure.com:8080/job/royale-asjs/ws/frameworks/projects/Jewel/build.xml>:92: The following error occurred while executing this line:
<http://apacheroyaleci2.westus2.cloudapp.azure.com:8080/job/royale-asjs/ws/frameworks/projects/Jewel/build.xml>:118: condition satisfied
Total time: 35 minutes 29 seconds
Picked up JAVA_TOOL_OPTIONS: -Dfile.encoding=UTF-8 -Xms384m -Xmx2g
Build step 'Invoke Ant' marked build as failure
Skipped archiving because build is not successful