You are viewing a plain text version of this content. The canonical link for it is here.
Posted to notifications@maven.apache.org by Apache Jenkins Server <je...@builds.apache.org> on 2018/08/08 10:16:19 UTC
Build failed in Jenkins: Maven TLP » maven-scm » SCM-797 #10
See https://builds.apache.org/job/maven-box/job/maven-scm/job/SCM-797/10/
No changes.
62 tests failed.
FAILED: org.apache.maven.scm.plugin.BranchMojoTest.testBranch
Error Message:
Command failed.The svn command failed.
Stack Trace:
org.apache.maven.plugin.MojoExecutionException: Command failed.The svn command failed.
at org.apache.maven.scm.plugin.BranchMojoTest.setUp(BranchMojoTest.java:74)
FAILED: org.apache.maven.scm.plugin.BranchMojoTest.testBranch
Error Message:
Command failed.The svn command failed.
Stack Trace:
org.apache.maven.plugin.MojoExecutionException: Command failed.The svn command failed.
at org.apache.maven.scm.plugin.BranchMojoTest.setUp(BranchMojoTest.java:74)
FAILED: org.apache.maven.scm.plugin.ChangeLogMojoTest.testChangeLogWithParameters
Error Message:
Command failed.The svn command failed.
Stack Trace:
org.apache.maven.plugin.MojoExecutionException: Command failed.The svn command failed.
at org.apache.maven.scm.plugin.ChangeLogMojoTest.testChangeLogWithParameters(ChangeLogMojoTest.java:102)
FAILED: org.apache.maven.scm.plugin.ChangeLogMojoTest.testChangeLog
Error Message:
Command failed.The svn command failed.
Stack Trace:
org.apache.maven.plugin.MojoExecutionException: Command failed.The svn command failed.
at org.apache.maven.scm.plugin.ChangeLogMojoTest.testChangeLog(ChangeLogMojoTest.java:79)
FAILED: org.apache.maven.scm.plugin.ChangeLogMojoTest.testChangeLogWithParameters
Error Message:
Command failed.The svn command failed.
Stack Trace:
org.apache.maven.plugin.MojoExecutionException: Command failed.The svn command failed.
at org.apache.maven.scm.plugin.ChangeLogMojoTest.testChangeLogWithParameters(ChangeLogMojoTest.java:102)
FAILED: org.apache.maven.scm.plugin.ChangeLogMojoTest.testChangeLog
Error Message:
Command failed.The svn command failed.
Stack Trace:
org.apache.maven.plugin.MojoExecutionException: Command failed.The svn command failed.
at org.apache.maven.scm.plugin.ChangeLogMojoTest.testChangeLog(ChangeLogMojoTest.java:79)
FAILED: org.apache.maven.scm.plugin.CheckoutMojoTest.testExcludeInclude
Error Message:
Command failed.The svn command failed.
Stack Trace:
org.apache.maven.plugin.MojoExecutionException: Command failed.The svn command failed.
at org.apache.maven.scm.plugin.CheckoutMojoTest.testExcludeInclude(CheckoutMojoTest.java:153)
FAILED: org.apache.maven.scm.plugin.CheckoutMojoTest.testUseExport
Error Message:
Command failed.The svn command failed.
Stack Trace:
org.apache.maven.plugin.MojoExecutionException: Command failed.The svn command failed.
at org.apache.maven.scm.plugin.CheckoutMojoTest.testUseExport(CheckoutMojoTest.java:132)
FAILED: org.apache.maven.scm.plugin.CheckoutMojoTest.testSkipCheckoutWithConnectionUrl
Error Message:
Command failed.The svn command failed.
Stack Trace:
org.apache.maven.plugin.MojoExecutionException: Command failed.The svn command failed.
at org.apache.maven.scm.plugin.CheckoutMojoTest.testSkipCheckoutWithConnectionUrl(CheckoutMojoTest.java:96)
FAILED: org.apache.maven.scm.plugin.CheckoutMojoTest.testExcludeInclude
Error Message:
Command failed.The svn command failed.
Stack Trace:
org.apache.maven.plugin.MojoExecutionException: Command failed.The svn command failed.
at org.apache.maven.scm.plugin.CheckoutMojoTest.testExcludeInclude(CheckoutMojoTest.java:153)
FAILED: org.apache.maven.scm.plugin.CheckoutMojoTest.testUseExport
Error Message:
Command failed.The svn command failed.
Stack Trace:
org.apache.maven.plugin.MojoExecutionException: Command failed.The svn command failed.
at org.apache.maven.scm.plugin.CheckoutMojoTest.testUseExport(CheckoutMojoTest.java:132)
FAILED: org.apache.maven.scm.plugin.CheckoutMojoTest.testSkipCheckoutWithConnectionUrl
Error Message:
Command failed.The svn command failed.
Stack Trace:
org.apache.maven.plugin.MojoExecutionException: Command failed.The svn command failed.
at org.apache.maven.scm.plugin.CheckoutMojoTest.testSkipCheckoutWithConnectionUrl(CheckoutMojoTest.java:96)
FAILED: org.apache.maven.scm.plugin.ExportMojoTest.testExcludeInclude
Error Message:
Command failed.The svn command failed.
Stack Trace:
org.apache.maven.plugin.MojoExecutionException: Command failed.The svn command failed.
at org.apache.maven.scm.plugin.ExportMojoTest.testExcludeInclude(ExportMojoTest.java:90)
FAILED: org.apache.maven.scm.plugin.ExportMojoTest.testExport
Error Message:
Command failed.The svn command failed.
Stack Trace:
org.apache.maven.plugin.MojoExecutionException: Command failed.The svn command failed.
at org.apache.maven.scm.plugin.ExportMojoTest.testExport(ExportMojoTest.java:55)
FAILED: org.apache.maven.scm.plugin.ExportMojoTest.testExcludeInclude
Error Message:
Command failed.The svn command failed.
Stack Trace:
org.apache.maven.plugin.MojoExecutionException: Command failed.The svn command failed.
at org.apache.maven.scm.plugin.ExportMojoTest.testExcludeInclude(ExportMojoTest.java:90)
FAILED: org.apache.maven.scm.plugin.ExportMojoTest.testExport
Error Message:
Command failed.The svn command failed.
Stack Trace:
org.apache.maven.plugin.MojoExecutionException: Command failed.The svn command failed.
at org.apache.maven.scm.plugin.ExportMojoTest.testExport(ExportMojoTest.java:55)
FAILED: org.apache.maven.scm.plugin.TagMojoTest.testTag
Error Message:
Command failed.The svn command failed.
Stack Trace:
org.apache.maven.plugin.MojoExecutionException: Command failed.The svn command failed.
at org.apache.maven.scm.plugin.TagMojoTest.setUp(TagMojoTest.java:74)
FAILED: org.apache.maven.scm.plugin.TagMojoTest.testTagWithTimestamp
Error Message:
Command failed.The svn command failed.
Stack Trace:
org.apache.maven.plugin.MojoExecutionException: Command failed.The svn command failed.
at org.apache.maven.scm.plugin.TagMojoTest.setUp(TagMojoTest.java:74)
FAILED: org.apache.maven.scm.plugin.TagMojoTest.testTag
Error Message:
Command failed.The svn command failed.
Stack Trace:
org.apache.maven.plugin.MojoExecutionException: Command failed.The svn command failed.
at org.apache.maven.scm.plugin.TagMojoTest.setUp(TagMojoTest.java:74)
FAILED: org.apache.maven.scm.plugin.TagMojoTest.testTagWithTimestamp
Error Message:
Command failed.The svn command failed.
Stack Trace:
org.apache.maven.plugin.MojoExecutionException: Command failed.The svn command failed.
at org.apache.maven.scm.plugin.TagMojoTest.setUp(TagMojoTest.java:74)
FAILED: org.apache.maven.scm.plugin.UpdateMojoTest.testSkipCheckoutWithConnectionUrl
Error Message:
Command failed.The svn command failed.
Stack Trace:
org.apache.maven.plugin.MojoExecutionException: Command failed.The svn command failed.
at org.apache.maven.scm.plugin.UpdateMojoTest.testSkipCheckoutWithConnectionUrl(UpdateMojoTest.java:73)
FAILED: org.apache.maven.scm.plugin.UpdateMojoTest.testSkipCheckoutWithConnectionUrl
Error Message:
Command failed.The svn command failed.
Stack Trace:
org.apache.maven.plugin.MojoExecutionException: Command failed.The svn command failed.
at org.apache.maven.scm.plugin.UpdateMojoTest.testSkipCheckoutWithConnectionUrl(UpdateMojoTest.java:73)
FAILED: org.apache.maven.scm.provider.git.gitexe.command.checkout.GitExeCheckOutCommandNoBranchTest.testCheckoutNoBranch
Error Message:
The check out result success flag was false.
Stack Trace:
junit.framework.AssertionFailedError: The check out result success flag was false.
at org.apache.maven.scm.provider.git.gitexe.command.checkout.GitExeCheckOutCommandNoBranchTest.checkoutRepo(GitExeCheckOutCommandNoBranchTest.java:89)
at org.apache.maven.scm.provider.git.gitexe.command.checkout.GitExeCheckOutCommandNoBranchTest.testCheckoutNoBranch(GitExeCheckOutCommandNoBranchTest.java:65)
FAILED: org.apache.maven.scm.provider.git.gitexe.command.checkout.GitExeCheckOutCommandNoBranchTest.testDoubleCheckoutNoBranch
Error Message:
The check out result success flag was false.
Stack Trace:
junit.framework.AssertionFailedError: The check out result success flag was false.
at org.apache.maven.scm.provider.git.gitexe.command.checkout.GitExeCheckOutCommandNoBranchTest.checkoutRepo(GitExeCheckOutCommandNoBranchTest.java:89)
at org.apache.maven.scm.provider.git.gitexe.command.checkout.GitExeCheckOutCommandNoBranchTest.testDoubleCheckoutNoBranch(GitExeCheckOutCommandNoBranchTest.java:77)
FAILED: org.apache.maven.scm.provider.git.gitexe.command.checkout.GitExeCheckOutCommandNoBranchTest.testCheckoutNoBranch
Error Message:
The check out result success flag was false.
Stack Trace:
junit.framework.AssertionFailedError: The check out result success flag was false.
at org.apache.maven.scm.provider.git.gitexe.command.checkout.GitExeCheckOutCommandNoBranchTest.checkoutRepo(GitExeCheckOutCommandNoBranchTest.java:89)
at org.apache.maven.scm.provider.git.gitexe.command.checkout.GitExeCheckOutCommandNoBranchTest.testCheckoutNoBranch(GitExeCheckOutCommandNoBranchTest.java:65)
FAILED: org.apache.maven.scm.provider.git.gitexe.command.checkout.GitExeCheckOutCommandNoBranchTest.testDoubleCheckoutNoBranch
Error Message:
The check out result success flag was false.
Stack Trace:
junit.framework.AssertionFailedError: The check out result success flag was false.
at org.apache.maven.scm.provider.git.gitexe.command.checkout.GitExeCheckOutCommandNoBranchTest.checkoutRepo(GitExeCheckOutCommandNoBranchTest.java:89)
at org.apache.maven.scm.provider.git.gitexe.command.checkout.GitExeCheckOutCommandNoBranchTest.testDoubleCheckoutNoBranch(GitExeCheckOutCommandNoBranchTest.java:77)
FAILED: org.apache.maven.scm.provider.git.jgit.command.branch.JGitBranchCommandTckTest.testBranchCommandTest
Error Message:
Exception while executing SCM command.
Stack Trace:
org.apache.maven.scm.ScmException: Exception while executing SCM command.
Caused by: org.apache.maven.scm.ScmException: JGit checkout failure!
Caused by: org.eclipse.jgit.api.errors.JGitInternalException: Exception caught during execution of fetch command
Caused by: org.eclipse.jgit.errors.NotSupportedException: URI not supported: file://2/m/maven-scm-providers/maven-scm-providers-git/maven-scm-provider-jgit/target/scm-test/repository
FAILED: org.apache.maven.scm.provider.git.jgit.command.branch.JGitBranchCommandTckTest.testBranchCommandTest
Error Message:
Exception while executing SCM command.
Stack Trace:
org.apache.maven.scm.ScmException: Exception while executing SCM command.
Caused by: org.apache.maven.scm.ScmException: JGit checkout failure!
Caused by: org.eclipse.jgit.api.errors.JGitInternalException: Exception caught during execution of fetch command
Caused by: org.eclipse.jgit.errors.NotSupportedException: URI not supported: file://2/m/maven-scm-providers/maven-scm-providers-git/maven-scm-provider-jgit/target/scm-test/repository
FAILED: org.apache.maven.scm.provider.git.jgit.command.changelog.JGitChangeLogCommandTckTest.testChangeLogCommand
Error Message:
Exception while executing SCM command.
Stack Trace:
org.apache.maven.scm.ScmException: Exception while executing SCM command.
Caused by: org.apache.maven.scm.ScmException: JGit checkout failure!
Caused by: org.eclipse.jgit.api.errors.JGitInternalException: Exception caught during execution of fetch command
Caused by: org.eclipse.jgit.errors.NotSupportedException: URI not supported: file://2/m/maven-scm-providers/maven-scm-providers-git/maven-scm-provider-jgit/target/scm-test/repository
FAILED: org.apache.maven.scm.provider.git.jgit.command.changelog.JGitChangeLogCommandTckTest.testChangeLogCommand
Error Message:
Exception while executing SCM command.
Stack Trace:
org.apache.maven.scm.ScmException: Exception while executing SCM command.
Caused by: org.apache.maven.scm.ScmException: JGit checkout failure!
Caused by: org.eclipse.jgit.api.errors.JGitInternalException: Exception caught during execution of fetch command
Caused by: org.eclipse.jgit.errors.NotSupportedException: URI not supported: file://2/m/maven-scm-providers/maven-scm-providers-git/maven-scm-provider-jgit/target/scm-test/repository
FAILED: org.apache.maven.scm.provider.git.jgit.command.checkin.JGitCheckInCommandCommitterAuthorTckTest.testCheckInCommandTest
Error Message:
Exception while executing SCM command.
Stack Trace:
org.apache.maven.scm.ScmException: Exception while executing SCM command.
at org.apache.maven.scm.provider.git.jgit.command.checkin.JGitCheckInCommandCommitterAuthorTckTest.setUp(JGitCheckInCommandCommitterAuthorTckTest.java:60)
Caused by: org.apache.maven.scm.ScmException: JGit checkout failure!
at org.apache.maven.scm.provider.git.jgit.command.checkin.JGitCheckInCommandCommitterAuthorTckTest.setUp(JGitCheckInCommandCommitterAuthorTckTest.java:60)
Caused by: org.eclipse.jgit.api.errors.JGitInternalException: Exception caught during execution of fetch command
at org.apache.maven.scm.provider.git.jgit.command.checkin.JGitCheckInCommandCommitterAuthorTckTest.setUp(JGitCheckInCommandCommitterAuthorTckTest.java:60)
Caused by: org.eclipse.jgit.errors.NotSupportedException: URI not supported: file://2/m/maven-scm-providers/maven-scm-providers-git/maven-scm-provider-jgit/target/scm-test/repository
at org.apache.maven.scm.provider.git.jgit.command.checkin.JGitCheckInCommandCommitterAuthorTckTest.setUp(JGitCheckInCommandCommitterAuthorTckTest.java:60)
FAILED: org.apache.maven.scm.provider.git.jgit.command.checkin.JGitCheckInCommandCommitterAuthorTckTest.testCheckInCommandPartialFileset
Error Message:
Exception while executing SCM command.
Stack Trace:
org.apache.maven.scm.ScmException: Exception while executing SCM command.
at org.apache.maven.scm.provider.git.jgit.command.checkin.JGitCheckInCommandCommitterAuthorTckTest.setUp(JGitCheckInCommandCommitterAuthorTckTest.java:60)
Caused by: org.apache.maven.scm.ScmException: JGit checkout failure!
at org.apache.maven.scm.provider.git.jgit.command.checkin.JGitCheckInCommandCommitterAuthorTckTest.setUp(JGitCheckInCommandCommitterAuthorTckTest.java:60)
Caused by: org.eclipse.jgit.api.errors.JGitInternalException: Exception caught during execution of fetch command
at org.apache.maven.scm.provider.git.jgit.command.checkin.JGitCheckInCommandCommitterAuthorTckTest.setUp(JGitCheckInCommandCommitterAuthorTckTest.java:60)
Caused by: org.eclipse.jgit.errors.NotSupportedException: URI not supported: file://2/m/maven-scm-providers/maven-scm-providers-git/maven-scm-provider-jgit/target/scm-test/repository
at org.apache.maven.scm.provider.git.jgit.command.checkin.JGitCheckInCommandCommitterAuthorTckTest.setUp(JGitCheckInCommandCommitterAuthorTckTest.java:60)
FAILED: org.apache.maven.scm.provider.git.jgit.command.checkin.JGitCheckInCommandCommitterAuthorTckTest.testCheckInCommandTest
Error Message:
Exception while executing SCM command.
Stack Trace:
org.apache.maven.scm.ScmException: Exception while executing SCM command.
at org.apache.maven.scm.provider.git.jgit.command.checkin.JGitCheckInCommandCommitterAuthorTckTest.setUp(JGitCheckInCommandCommitterAuthorTckTest.java:60)
Caused by: org.apache.maven.scm.ScmException: JGit checkout failure!
at org.apache.maven.scm.provider.git.jgit.command.checkin.JGitCheckInCommandCommitterAuthorTckTest.setUp(JGitCheckInCommandCommitterAuthorTckTest.java:60)
Caused by: org.eclipse.jgit.api.errors.JGitInternalException: Exception caught during execution of fetch command
at org.apache.maven.scm.provider.git.jgit.command.checkin.JGitCheckInCommandCommitterAuthorTckTest.setUp(JGitCheckInCommandCommitterAuthorTckTest.java:60)
Caused by: org.eclipse.jgit.errors.NotSupportedException: URI not supported: file://2/m/maven-scm-providers/maven-scm-providers-git/maven-scm-provider-jgit/target/scm-test/repository
at org.apache.maven.scm.provider.git.jgit.command.checkin.JGitCheckInCommandCommitterAuthorTckTest.setUp(JGitCheckInCommandCommitterAuthorTckTest.java:60)
FAILED: org.apache.maven.scm.provider.git.jgit.command.checkin.JGitCheckInCommandCommitterAuthorTckTest.testCheckInCommandPartialFileset
Error Message:
Exception while executing SCM command.
Stack Trace:
org.apache.maven.scm.ScmException: Exception while executing SCM command.
at org.apache.maven.scm.provider.git.jgit.command.checkin.JGitCheckInCommandCommitterAuthorTckTest.setUp(JGitCheckInCommandCommitterAuthorTckTest.java:60)
Caused by: org.apache.maven.scm.ScmException: JGit checkout failure!
at org.apache.maven.scm.provider.git.jgit.command.checkin.JGitCheckInCommandCommitterAuthorTckTest.setUp(JGitCheckInCommandCommitterAuthorTckTest.java:60)
Caused by: org.eclipse.jgit.api.errors.JGitInternalException: Exception caught during execution of fetch command
at org.apache.maven.scm.provider.git.jgit.command.checkin.JGitCheckInCommandCommitterAuthorTckTest.setUp(JGitCheckInCommandCommitterAuthorTckTest.java:60)
Caused by: org.eclipse.jgit.errors.NotSupportedException: URI not supported: file://2/m/maven-scm-providers/maven-scm-providers-git/maven-scm-provider-jgit/target/scm-test/repository
at org.apache.maven.scm.provider.git.jgit.command.checkin.JGitCheckInCommandCommitterAuthorTckTest.setUp(JGitCheckInCommandCommitterAuthorTckTest.java:60)
FAILED: org.apache.maven.scm.provider.git.jgit.command.checkin.JGitCheckInCommandTckTest.testCheckInCommandTest
Error Message:
Exception while executing SCM command.
Stack Trace:
org.apache.maven.scm.ScmException: Exception while executing SCM command.
Caused by: org.apache.maven.scm.ScmException: JGit checkout failure!
Caused by: org.eclipse.jgit.api.errors.JGitInternalException: Exception caught during execution of fetch command
Caused by: org.eclipse.jgit.errors.NotSupportedException: URI not supported: file://2/m/maven-scm-providers/maven-scm-providers-git/maven-scm-provider-jgit/target/scm-test/repository
FAILED: org.apache.maven.scm.provider.git.jgit.command.checkin.JGitCheckInCommandTckTest.testCheckInCommandPartialFileset
Error Message:
Exception while executing SCM command.
Stack Trace:
org.apache.maven.scm.ScmException: Exception while executing SCM command.
Caused by: org.apache.maven.scm.ScmException: JGit checkout failure!
Caused by: org.eclipse.jgit.api.errors.JGitInternalException: Exception caught during execution of fetch command
Caused by: org.eclipse.jgit.errors.NotSupportedException: URI not supported: file://2/m/maven-scm-providers/maven-scm-providers-git/maven-scm-provider-jgit/target/scm-test/repository
FAILED: org.apache.maven.scm.provider.git.jgit.command.checkin.JGitCheckInCommandTckTest.testCheckInCommandTest
Error Message:
Exception while executing SCM command.
Stack Trace:
org.apache.maven.scm.ScmException: Exception while executing SCM command.
Caused by: org.apache.maven.scm.ScmException: JGit checkout failure!
Caused by: org.eclipse.jgit.api.errors.JGitInternalException: Exception caught during execution of fetch command
Caused by: org.eclipse.jgit.errors.NotSupportedException: URI not supported: file://2/m/maven-scm-providers/maven-scm-providers-git/maven-scm-provider-jgit/target/scm-test/repository
FAILED: org.apache.maven.scm.provider.git.jgit.command.checkin.JGitCheckInCommandTckTest.testCheckInCommandPartialFileset
Error Message:
Exception while executing SCM command.
Stack Trace:
org.apache.maven.scm.ScmException: Exception while executing SCM command.
Caused by: org.apache.maven.scm.ScmException: JGit checkout failure!
Caused by: org.eclipse.jgit.api.errors.JGitInternalException: Exception caught during execution of fetch command
Caused by: org.eclipse.jgit.errors.NotSupportedException: URI not supported: file://2/m/maven-scm-providers/maven-scm-providers-git/maven-scm-provider-jgit/target/scm-test/repository
FAILED: org.apache.maven.scm.provider.git.jgit.command.checkout.JGitCheckOutCommandTckTest.testCheckOutCommandTest
Error Message:
Exception while executing SCM command.
Stack Trace:
org.apache.maven.scm.ScmException: Exception while executing SCM command.
Caused by: org.apache.maven.scm.ScmException: JGit checkout failure!
Caused by: org.eclipse.jgit.api.errors.JGitInternalException: Exception caught during execution of fetch command
Caused by: org.eclipse.jgit.errors.NotSupportedException: URI not supported: file://2/m/maven-scm-providers/maven-scm-providers-git/maven-scm-provider-jgit/target/scm-test/repository
FAILED: org.apache.maven.scm.provider.git.jgit.command.checkout.JGitCheckOutCommandTckTest.testCheckOutCommandTest
Error Message:
Exception while executing SCM command.
Stack Trace:
org.apache.maven.scm.ScmException: Exception while executing SCM command.
Caused by: org.apache.maven.scm.ScmException: JGit checkout failure!
Caused by: org.eclipse.jgit.api.errors.JGitInternalException: Exception caught during execution of fetch command
Caused by: org.eclipse.jgit.errors.NotSupportedException: URI not supported: file://2/m/maven-scm-providers/maven-scm-providers-git/maven-scm-provider-jgit/target/scm-test/repository
FAILED: org.apache.maven.scm.provider.git.jgit.command.diff.JGitDiffCommandTckTest.testDiffCommand
Error Message:
Exception while executing SCM command.
Stack Trace:
org.apache.maven.scm.ScmException: Exception while executing SCM command.
Caused by: org.apache.maven.scm.ScmException: JGit checkout failure!
Caused by: org.eclipse.jgit.api.errors.JGitInternalException: Exception caught during execution of fetch command
Caused by: org.eclipse.jgit.errors.NotSupportedException: URI not supported: file://2/m/maven-scm-providers/maven-scm-providers-git/maven-scm-provider-jgit/target/scm-test/repository
FAILED: org.apache.maven.scm.provider.git.jgit.command.diff.JGitDiffCommandTckTest.testDiffCommand
Error Message:
Exception while executing SCM command.
Stack Trace:
org.apache.maven.scm.ScmException: Exception while executing SCM command.
Caused by: org.apache.maven.scm.ScmException: JGit checkout failure!
Caused by: org.eclipse.jgit.api.errors.JGitInternalException: Exception caught during execution of fetch command
Caused by: org.eclipse.jgit.errors.NotSupportedException: URI not supported: file://2/m/maven-scm-providers/maven-scm-providers-git/maven-scm-provider-jgit/target/scm-test/repository
FAILED: org.apache.maven.scm.provider.git.jgit.command.remoteinfo.JGitRemoteInfoCommandTckTest.testRemoteInfoCommand
Error Message:
Exception while executing SCM command.
Stack Trace:
org.apache.maven.scm.ScmException: Exception while executing SCM command.
Caused by: org.apache.maven.scm.ScmException: JGit checkout failure!
Caused by: org.eclipse.jgit.api.errors.JGitInternalException: Exception caught during execution of fetch command
Caused by: org.eclipse.jgit.errors.NotSupportedException: URI not supported: file://2/m/maven-scm-providers/maven-scm-providers-git/maven-scm-provider-jgit/target/scm-test/repository
FAILED: org.apache.maven.scm.provider.git.jgit.command.remoteinfo.JGitRemoteInfoCommandTckTest.testRemoteInfoCommand
Error Message:
Exception while executing SCM command.
Stack Trace:
org.apache.maven.scm.ScmException: Exception while executing SCM command.
Caused by: org.apache.maven.scm.ScmException: JGit checkout failure!
Caused by: org.eclipse.jgit.api.errors.JGitInternalException: Exception caught during execution of fetch command
Caused by: org.eclipse.jgit.errors.NotSupportedException: URI not supported: file://2/m/maven-scm-providers/maven-scm-providers-git/maven-scm-provider-jgit/target/scm-test/repository
FAILED: org.apache.maven.scm.provider.git.jgit.command.status.JGitStatusCommandTckTest.testStatusCommand
Error Message:
Exception while executing SCM command.
Stack Trace:
org.apache.maven.scm.ScmException: Exception while executing SCM command.
Caused by: org.apache.maven.scm.ScmException: JGit checkout failure!
Caused by: org.eclipse.jgit.api.errors.JGitInternalException: Exception caught during execution of fetch command
Caused by: org.eclipse.jgit.errors.NotSupportedException: URI not supported: file://2/m/maven-scm-providers/maven-scm-providers-git/maven-scm-provider-jgit/target/scm-test/repository
FAILED: org.apache.maven.scm.provider.git.jgit.command.status.JGitStatusCommandTckTest.testStatusCommand
Error Message:
Exception while executing SCM command.
Stack Trace:
org.apache.maven.scm.ScmException: Exception while executing SCM command.
Caused by: org.apache.maven.scm.ScmException: JGit checkout failure!
Caused by: org.eclipse.jgit.api.errors.JGitInternalException: Exception caught during execution of fetch command
Caused by: org.eclipse.jgit.errors.NotSupportedException: URI not supported: file://2/m/maven-scm-providers/maven-scm-providers-git/maven-scm-provider-jgit/target/scm-test/repository
FAILED: org.apache.maven.scm.provider.git.jgit.command.tag.JGitTagCommandTckTest.testTagCommandTest
Error Message:
Exception while executing SCM command.
Stack Trace:
org.apache.maven.scm.ScmException: Exception while executing SCM command.
Caused by: org.apache.maven.scm.ScmException: JGit checkout failure!
Caused by: org.eclipse.jgit.api.errors.JGitInternalException: Exception caught during execution of fetch command
Caused by: org.eclipse.jgit.errors.NotSupportedException: URI not supported: file://2/m/maven-scm-providers/maven-scm-providers-git/maven-scm-provider-jgit/target/scm-test/repository
FAILED: org.apache.maven.scm.provider.git.jgit.command.tag.JGitTagCommandTckTest.testTagCommandTest
Error Message:
Exception while executing SCM command.
Stack Trace:
org.apache.maven.scm.ScmException: Exception while executing SCM command.
Caused by: org.apache.maven.scm.ScmException: JGit checkout failure!
Caused by: org.eclipse.jgit.api.errors.JGitInternalException: Exception caught during execution of fetch command
Caused by: org.eclipse.jgit.errors.NotSupportedException: URI not supported: file://2/m/maven-scm-providers/maven-scm-providers-git/maven-scm-provider-jgit/target/scm-test/repository
FAILED: org.apache.maven.scm.provider.git.gitexe.command.checkin.GitCheckInCommandNoBranchTest.testCheckinNoBranch
Error Message:
The check out result success flag was false.
Stack Trace:
junit.framework.AssertionFailedError: The check out result success flag was false.
at org.apache.maven.scm.provider.git.gitexe.command.checkin.GitCheckInCommandNoBranchTest.testCheckinNoBranch(GitCheckInCommandNoBranchTest.java:75)
FAILED: org.apache.maven.scm.provider.git.gitexe.command.checkin.GitCheckInCommandNoBranchTest.testCheckinNoBranch
Error Message:
The check out result success flag was false.
Stack Trace:
junit.framework.AssertionFailedError: The check out result success flag was false.
at org.apache.maven.scm.provider.git.gitexe.command.checkin.GitCheckInCommandNoBranchTest.testCheckinNoBranch(GitCheckInCommandNoBranchTest.java:75)
FAILED: org.apache.maven.scm.provider.git.gitexe.command.checkin.GitCheckInCommandNoBranchTest.testCheckinNoBranch
Error Message:
The check out result success flag was false.
Stack Trace:
junit.framework.AssertionFailedError: The check out result success flag was false.
at org.apache.maven.scm.provider.git.gitexe.command.checkin.GitCheckInCommandNoBranchTest.checkoutRepo(GitCheckInCommandNoBranchTest.java:93)
at org.apache.maven.scm.provider.git.gitexe.command.checkin.GitCheckInCommandNoBranchTest.testCheckinNoBranch(GitCheckInCommandNoBranchTest.java:64)
FAILED: org.apache.maven.scm.provider.git.gitexe.command.checkin.GitCheckInCommandNoBranchTest.testCheckinNoBranch
Error Message:
The check out result success flag was false.
Stack Trace:
junit.framework.AssertionFailedError: The check out result success flag was false.
at org.apache.maven.scm.provider.git.gitexe.command.checkin.GitCheckInCommandNoBranchTest.checkoutRepo(GitCheckInCommandNoBranchTest.java:93)
at org.apache.maven.scm.provider.git.gitexe.command.checkin.GitCheckInCommandNoBranchTest.testCheckinNoBranch(GitCheckInCommandNoBranchTest.java:79)
FAILED: org.apache.maven.scm.provider.git.gitexe.command.checkin.GitCheckInCommandNoBranchTest.testCheckinNoBranch
Error Message:
The check out result success flag was false.
Stack Trace:
junit.framework.AssertionFailedError: The check out result success flag was false.
at org.apache.maven.scm.provider.git.gitexe.command.checkin.GitCheckInCommandNoBranchTest.checkoutRepo(GitCheckInCommandNoBranchTest.java:93)
at org.apache.maven.scm.provider.git.gitexe.command.checkin.GitCheckInCommandNoBranchTest.testCheckinNoBranch(GitCheckInCommandNoBranchTest.java:64)
FAILED: org.apache.maven.scm.provider.git.gitexe.command.checkin.GitCheckInCommandNoBranchTest.testCheckinNoBranch
Error Message:
The check out result success flag was false.
Stack Trace:
junit.framework.AssertionFailedError: The check out result success flag was false.
at org.apache.maven.scm.provider.git.gitexe.command.checkin.GitCheckInCommandNoBranchTest.checkoutRepo(GitCheckInCommandNoBranchTest.java:93)
at org.apache.maven.scm.provider.git.gitexe.command.checkin.GitCheckInCommandNoBranchTest.testCheckinNoBranch(GitCheckInCommandNoBranchTest.java:79)
FAILED: org.apache.maven.scm.provider.git.gitexe.command.checkin.GitCheckInCommandNoBranchTest.testCheckinNoBranch
Error Message:
The check out result success flag was false.
Stack Trace:
junit.framework.AssertionFailedError: The check out result success flag was false.
at org.apache.maven.scm.provider.git.gitexe.command.checkin.GitCheckInCommandNoBranchTest.checkoutRepo(GitCheckInCommandNoBranchTest.java:93)
at org.apache.maven.scm.provider.git.gitexe.command.checkin.GitCheckInCommandNoBranchTest.testCheckinNoBranch(GitCheckInCommandNoBranchTest.java:79)
FAILED: org.apache.maven.scm.provider.git.gitexe.command.checkin.GitCheckInCommandTest.testCheckinAfterRename
Error Message:
The check out result success flag was false.
Stack Trace:
junit.framework.AssertionFailedError: The check out result success flag was false.
at org.apache.maven.scm.provider.git.gitexe.command.checkin.GitCheckInCommandTest.testCheckinAfterRename(GitCheckInCommandTest.java:113)
FAILED: org.apache.maven.scm.provider.git.gitexe.command.checkin.GitCheckInCommandTest.testCheckinAfterRename
Error Message:
The check out result success flag was false.
Stack Trace:
junit.framework.AssertionFailedError: The check out result success flag was false.
at org.apache.maven.scm.provider.git.gitexe.command.checkin.GitCheckInCommandTest.testCheckinAfterRename(GitCheckInCommandTest.java:113)
FAILED: org.apache.maven.scm.provider.git.gitexe.command.checkin.GitCheckInCommandTest.testCheckinAfterRename
Error Message:
The check out result success flag was false.
Stack Trace:
junit.framework.AssertionFailedError: The check out result success flag was false.
at org.apache.maven.scm.provider.git.gitexe.command.checkin.GitCheckInCommandTest.checkoutRepoInto(GitCheckInCommandTest.java:143)
at org.apache.maven.scm.provider.git.gitexe.command.checkin.GitCheckInCommandTest.testCheckinAfterRename(GitCheckInCommandTest.java:99)
FAILED: org.apache.maven.scm.provider.git.gitexe.command.checkin.GitCheckInCommandTest.testCheckinAfterRename
Error Message:
The check out result success flag was false.
Stack Trace:
junit.framework.AssertionFailedError: The check out result success flag was false.
at org.apache.maven.scm.provider.git.gitexe.command.checkin.GitCheckInCommandTest.checkoutRepoInto(GitCheckInCommandTest.java:143)
at org.apache.maven.scm.provider.git.gitexe.command.checkin.GitCheckInCommandTest.testCheckinAfterRename(GitCheckInCommandTest.java:99)
FAILED: org.apache.maven.scm.provider.git.gitexe.command.checkin.GitCheckInCommandTest.testCheckinAfterRename
Error Message:
The check out result success flag was false.
Stack Trace:
junit.framework.AssertionFailedError: The check out result success flag was false.
at org.apache.maven.scm.provider.git.gitexe.command.checkin.GitCheckInCommandTest.checkoutRepoInto(GitCheckInCommandTest.java:143)
at org.apache.maven.scm.provider.git.gitexe.command.checkin.GitCheckInCommandTest.testCheckinAfterRename(GitCheckInCommandTest.java:99)
FAILED: org.apache.maven.scm.provider.git.gitexe.command.checkin.GitCheckInCommandTest.testCheckinAfterRename
Error Message:
The check out result success flag was false.
Stack Trace:
junit.framework.AssertionFailedError: The check out result success flag was false.
at org.apache.maven.scm.provider.git.gitexe.command.checkin.GitCheckInCommandTest.checkoutRepoInto(GitCheckInCommandTest.java:143)
at org.apache.maven.scm.provider.git.gitexe.command.checkin.GitCheckInCommandTest.testCheckinAfterRename(GitCheckInCommandTest.java:99)
FAILED: org.apache.maven.scm.provider.git.gitexe.command.checkin.GitCheckInCommandTest.testCheckinAfterRename
Error Message:
The check out result success flag was false.
Stack Trace:
junit.framework.AssertionFailedError: The check out result success flag was false.
at org.apache.maven.scm.provider.git.gitexe.command.checkin.GitCheckInCommandTest.checkoutRepoInto(GitCheckInCommandTest.java:143)
at org.apache.maven.scm.provider.git.gitexe.command.checkin.GitCheckInCommandTest.testCheckinAfterRename(GitCheckInCommandTest.java:99)
Build log:
[...truncated 7.27 MB...]
[windows-jdk10] [INFO] Downloaded: https://repo.maven.apache.org/maven2/org/codehaus/plexus/plexus-interpolation/1.22/plexus-interpolation-1.22.jar (77 kB at 1.0 MB/s)
[windows-jdk10] [INFO] Downloading: https://repo.maven.apache.org/maven2/org/codehaus/plexus/plexus-io/2.6/plexus-io-2.6.jar
[windows-jdk10] [INFO] Downloaded: https://repo.maven.apache.org/maven2/org/apache/maven/wagon/wagon-provider-api/1.0-alpha-6/wagon-provider-api-1.0-alpha-6.jar (43 kB at 521 kB/s)
[windows-jdk10] [INFO] Downloading: https://repo.maven.apache.org/maven2/org/codehaus/plexus/plexus-utils/3.0.21/plexus-utils-3.0.21.jar
[windows-jdk10] [INFO] Downloaded: https://repo.maven.apache.org/maven2/org/iq80/snappy/snappy/0.3/snappy-0.3.jar (49 kB at 567 kB/s)
[windows-jdk10] [INFO] Downloading: https://repo.maven.apache.org/maven2/org/apache/maven/shared/maven-repository-builder/1.0/maven-repository-builder-1.0.jar
[windows-jdk10] [INFO] Downloaded: https://repo.maven.apache.org/maven2/org/apache/maven/shared/maven-filtering/1.3/maven-filtering-1.3.jar (51 kB at 582 kB/s)
[windows-jdk10] [INFO] Downloaded: https://repo.maven.apache.org/maven2/org/codehaus/plexus/plexus-io/2.6/plexus-io-2.6.jar (84 kB at 817 kB/s)
[windows-jdk10] [INFO] Downloaded: https://repo.maven.apache.org/maven2/org/codehaus/plexus/plexus-utils/3.0.21/plexus-utils-3.0.21.jar (245 kB at 2.3 MB/s)
[windows-jdk10] [INFO] Downloaded: https://repo.maven.apache.org/maven2/org/codehaus/plexus/plexus-archiver/3.0.1/plexus-archiver-3.0.1.jar (381 kB at 3.5 MB/s)
[windows-jdk10] [INFO] Downloaded: https://repo.maven.apache.org/maven2/org/apache/maven/shared/maven-repository-builder/1.0/maven-repository-builder-1.0.jar (22 kB at 183 kB/s)
[windows-jdk10] [WARNING] Error injecting: org.codehaus.plexus.archiver.jar.JarArchiver
[windows-jdk10] java.lang.ExceptionInInitializerError
[windows-jdk10] at java.base/jdk.internal.reflect.NativeConstructorAccessorImpl.newInstance0(Native Method)
[windows-jdk10] at java.base/jdk.internal.reflect.NativeConstructorAccessorImpl.newInstance(NativeConstructorAccessorImpl.java:62)
[windows-jdk10] at java.base/jdk.internal.reflect.DelegatingConstructorAccessorImpl.newInstance(DelegatingConstructorAccessorImpl.java:45)
[windows-jdk10] at java.base/java.lang.reflect.Constructor.newInstance(Constructor.java:488)
[windows-jdk10] at com.google.inject.internal.DefaultConstructionProxyFactory$1.newInstance(DefaultConstructionProxyFactory.java:86)
[windows-jdk10] at com.google.inject.internal.ConstructorInjector.provision(ConstructorInjector.java:105)
[windows-jdk10] at com.google.inject.internal.ConstructorInjector.access$000(ConstructorInjector.java:32)
[windows-jdk10] at com.google.inject.internal.ConstructorInjector$1.call(ConstructorInjector.java:89)
[windows-jdk10] at com.google.inject.internal.ProvisionListenerStackCallback$Provision.provision(ProvisionListenerStackCallback.java:115)
[windows-jdk10] at com.google.inject.internal.ProvisionListenerStackCallback$Provision.provision(ProvisionListenerStackCallback.java:133)
[windows-jdk10] at com.google.inject.internal.ProvisionListenerStackCallback.provision(ProvisionListenerStackCallback.java:68)
[windows-jdk10] at com.google.inject.internal.ConstructorInjector.construct(ConstructorInjector.java:87)
[windows-jdk10] at com.google.inject.internal.ConstructorBindingImpl$Factory.get(ConstructorBindingImpl.java:267)
[windows-jdk10] at com.google.inject.internal.InjectorImpl$2$1.call(InjectorImpl.java:1016)
[windows-jdk10] at com.google.inject.internal.InjectorImpl.callInContext(InjectorImpl.java:1103)
[windows-jdk10] at com.google.inject.internal.InjectorImpl$2.get(InjectorImpl.java:1012)
[windows-jdk10] at com.google.inject.internal.InjectorImpl.getInstance(InjectorImpl.java:1051)
[windows-jdk10] at org.eclipse.sisu.space.AbstractDeferredClass.get(AbstractDeferredClass.java:48)
[windows-jdk10] at com.google.inject.internal.ProviderInternalFactory.provision(ProviderInternalFactory.java:81)
[windows-jdk10] at com.google.inject.internal.InternalFactoryToInitializableAdapter.provision(InternalFactoryToInitializableAdapter.java:53)
[windows-jdk10] at com.google.inject.internal.ProviderInternalFactory$1.call(ProviderInternalFactory.java:65)
[windows-jdk10] at com.google.inject.internal.ProvisionListenerStackCallback$Provision.provision(ProvisionListenerStackCallback.java:115)
[windows-jdk10] at com.google.inject.internal.ProvisionListenerStackCallback$Provision.provision(ProvisionListenerStackCallback.java:133)
[windows-jdk10] at com.google.inject.internal.ProvisionListenerStackCallback.provision(ProvisionListenerStackCallback.java:68)
[windows-jdk10] at com.google.inject.internal.ProviderInternalFactory.circularGet(ProviderInternalFactory.java:63)
[windows-jdk10] at com.google.inject.internal.InternalFactoryToInitializableAdapter.get(InternalFactoryToInitializableAdapter.java:45)
[windows-jdk10] at com.google.inject.internal.InjectorImpl$2$1.call(InjectorImpl.java:1016)
[windows-jdk10] at com.google.inject.internal.InjectorImpl.callInContext(InjectorImpl.java:1092)
[windows-jdk10] at com.google.inject.internal.InjectorImpl$2.get(InjectorImpl.java:1012)
[windows-jdk10] at org.eclipse.sisu.inject.Guice4$1.get(Guice4.java:162)
[windows-jdk10] at org.eclipse.sisu.inject.LazyBeanEntry.getValue(LazyBeanEntry.java:81)
[windows-jdk10] at org.eclipse.sisu.plexus.LazyPlexusBean.getValue(LazyPlexusBean.java:51)
[windows-jdk10] at org.codehaus.plexus.DefaultPlexusContainer.lookup(DefaultPlexusContainer.java:263)
[windows-jdk10] at org.codehaus.plexus.DefaultPlexusContainer.lookup(DefaultPlexusContainer.java:243)
[windows-jdk10] at org.codehaus.plexus.archiver.manager.DefaultArchiverManager.getArchiver(DefaultArchiverManager.java:63)
[windows-jdk10] at org.apache.maven.plugin.assembly.archive.DefaultAssemblyArchiver.createArchiver(DefaultAssemblyArchiver.java:302)
[windows-jdk10] at org.apache.maven.plugin.assembly.archive.DefaultAssemblyArchiver.createArchive(DefaultAssemblyArchiver.java:170)
[windows-jdk10] at org.apache.maven.plugin.assembly.mojos.AbstractAssemblyMojo.execute(AbstractAssemblyMojo.java:484)
[windows-jdk10] at org.apache.maven.plugin.DefaultBuildPluginManager.executeMojo(DefaultBuildPluginManager.java:134)
[windows-jdk10] at org.apache.maven.lifecycle.internal.MojoExecutor.execute(MojoExecutor.java:208)
[windows-jdk10] at org.apache.maven.lifecycle.internal.MojoExecutor.execute(MojoExecutor.java:154)
[windows-jdk10] at org.apache.maven.lifecycle.internal.MojoExecutor.execute(MojoExecutor.java:146)
[windows-jdk10] at org.apache.maven.lifecycle.internal.LifecycleModuleBuilder.buildProject(LifecycleModuleBuilder.java:117)
[windows-jdk10] at org.apache.maven.lifecycle.internal.LifecycleModuleBuilder.buildProject(LifecycleModuleBuilder.java:81)
[windows-jdk10] at org.apache.maven.lifecycle.internal.builder.singlethreaded.SingleThreadedBuilder.build(SingleThreadedBuilder.java:51)
[windows-jdk10] at org.apache.maven.lifecycle.internal.LifecycleStarter.execute(LifecycleStarter.java:128)
[windows-jdk10] at org.apache.maven.DefaultMaven.doExecute(DefaultMaven.java:309)
[windows-jdk10] at org.apache.maven.DefaultMaven.doExecute(DefaultMaven.java:194)
[windows-jdk10] at org.apache.maven.DefaultMaven.execute(DefaultMaven.java:107)
[windows-jdk10] at org.apache.maven.cli.MavenCli.execute(MavenCli.java:993)
[windows-jdk10] at org.apache.maven.cli.MavenCli.doMain(MavenCli.java:345)
[windows-jdk10] at org.apache.maven.cli.MavenCli.main(MavenCli.java:191)
[windows-jdk10] at java.base/jdk.internal.reflect.NativeMethodAccessorImpl.invoke0(Native Method)
[windows-jdk10] at java.base/jdk.internal.reflect.NativeMethodAccessorImpl.invoke(NativeMethodAccessorImpl.java:62)
[windows-jdk10] at java.base/jdk.internal.reflect.DelegatingMethodAccessorImpl.invoke(DelegatingMethodAccessorImpl.java:43)
[windows-jdk10] at java.base/java.lang.reflect.Method.invoke(Method.java:564)
[windows-jdk10] at org.codehaus.plexus.classworlds.launcher.Launcher.launchEnhanced(Launcher.java:289)
[windows-jdk10] at org.codehaus.plexus.classworlds.launcher.Launcher.launch(Launcher.java:229)
[windows-jdk10] at org.codehaus.plexus.classworlds.launcher.Launcher.mainWithExitCode(Launcher.java:415)
[windows-jdk10] at org.codehaus.plexus.classworlds.launcher.Launcher.main(Launcher.java:356)
[windows-jdk10] Caused by: java.lang.ArrayIndexOutOfBoundsException: 1
[windows-jdk10] at org.codehaus.plexus.archiver.zip.AbstractZipArchiver.<clinit>(AbstractZipArchiver.java:123)
[windows-jdk10] ... 60 more
[windows-jdk10] [INFO] ------------------------------------------------------------------------
[windows-jdk10] [INFO] Reactor Summary:
[windows-jdk10] [INFO]
[windows-jdk10] [INFO] Maven SCM .......................................... SUCCESS [ 14.919 s]
[windows-jdk10] [INFO] Maven SCM API ...................................... SUCCESS [ 9.316 s]
[windows-jdk10] [INFO] Maven SCM Managers ................................. SUCCESS [ 0.857 s]
[windows-jdk10] [INFO] Maven SCM Manager for Plexus ....................... SUCCESS [ 2.031 s]
[windows-jdk10] [INFO] Maven SCM Test ..................................... SUCCESS [ 4.051 s]
[windows-jdk10] [INFO] Maven SCM Providers ................................ SUCCESS [ 1.314 s]
[windows-jdk10] [INFO] Maven SCM AccuRev Provider ......................... SUCCESS [ 7.899 s]
[windows-jdk10] [INFO] Maven SCM Bazaar Provider .......................... SUCCESS [ 3.359 s]
[windows-jdk10] [INFO] Maven SCM Clearcase Provider ....................... SUCCESS [ 5.713 s]
[windows-jdk10] [INFO] Maven SCM CVS Provider - Parent .................... SUCCESS [ 0.880 s]
[windows-jdk10] [INFO] Maven SCM CVS Provider TCK tests ................... SUCCESS [ 2.089 s]
[windows-jdk10] [INFO] Maven SCM CVS Provider - Common library ............ SUCCESS [ 3.688 s]
[windows-jdk10] [INFO] Maven SCM CVS Provider - CVS Executable Impl. ...... SUCCESS [ 2.576 s]
[windows-jdk10] [INFO] Maven SCM CVS Provider - CVS Java Impl. ............ SUCCESS [ 3.359 s]
[windows-jdk10] [INFO] Maven SCM Mercurial (Hg) Provider .................. SUCCESS [ 2.746 s]
[windows-jdk10] [INFO] Maven SCM Git Provider - Parent .................... SUCCESS [ 0.897 s]
[windows-jdk10] [INFO] Maven SCM Git Provider - Common library ............ SUCCESS [ 3.146 s]
[windows-jdk10] [INFO] Maven SCM Git Provider TCK Tests ................... SUCCESS [ 1.513 s]
[windows-jdk10] [INFO] Maven SCM Git Provider - Git Executable Impl. ...... SUCCESS [ 6.649 s]
[windows-jdk10] [INFO] Maven SCM Git Provider - JGit Impl. ................ SUCCESS [ 31.618 s]
[windows-jdk10] [INFO] Maven SCM Local Provider ........................... SUCCESS [ 2.642 s]
[windows-jdk10] [INFO] Maven SCM Perforce Provider ........................ SUCCESS [ 3.300 s]
[windows-jdk10] [INFO] Maven SCM Starteam Provider ........................ SUCCESS [ 4.738 s]
[windows-jdk10] [INFO] Maven SCM Subversion Provider - Parent ............. SUCCESS [ 0.647 s]
[windows-jdk10] [INFO] Maven SCM Subversion Provider - Common library ..... SUCCESS [ 2.697 s]
[windows-jdk10] [INFO] Maven SCM Subversion Provider TCK Tests ............ SUCCESS [ 1.119 s]
[windows-jdk10] [INFO] Maven SCM Subversion Provider - SVN Executable Impl. SUCCESS [ 6.436 s]
[windows-jdk10] [INFO] Maven SCM Synergy Provider ......................... SUCCESS [ 3.347 s]
[windows-jdk10] [INFO] Maven SCM Visual Source Safe Provider .............. SUCCESS [ 3.609 s]
[windows-jdk10] [INFO] Maven SCM TFS Provider ............................. SUCCESS [ 3.048 s]
[windows-jdk10] [INFO] Maven SCM MKS Integrity Provider ................... SUCCESS [ 3.477 s]
[windows-jdk10] [INFO] Maven SCM Jazz/Rational Team Concert Provider ...... SUCCESS [ 3.674 s]
[windows-jdk10] [INFO] Maven SCM Standard Providers ....................... SUCCESS [ 2.150 s]
[windows-jdk10] [INFO] Maven SCM Client ................................... FAILURE [ 2.767 s]
[windows-jdk10] [INFO] Maven SCM Plugin ................................... SKIPPED
[windows-jdk10] [INFO] ------------------------------------------------------------------------
[windows-jdk10] [INFO] BUILD FAILURE
[windows-jdk10] [INFO] ------------------------------------------------------------------------
[windows-jdk10] [INFO] Total time: 02:33 min
[windows-jdk10] [INFO] Finished at: 2018-08-08T10:15:59Z
[windows-jdk10] [INFO] Final Memory: 50M/180M
[windows-jdk10] [INFO] ------------------------------------------------------------------------
[windows-jdk10] [WARNING] The requested profile "run-its" could not be activated because it does not exist.
[windows-jdk10] [INFO] [jenkins-event-spy] Generated F:\jenkins\jenkins-slave\workspace\maven-box_maven-scm_SCM-797-TSNF7ZXLGM4LUVYJCJU2O25GA4EZKSADD3776FMZEGJH3QG3LZLQ@tmp\withMaven666233c8\maven-spy-20180808-101325-6263878842201837757521.log
[windows-jdk10] [ERROR] Failed to execute goal org.apache.maven.plugins:maven-assembly-plugin:2.6:single (default) on project maven-scm-client: Execution default of goal org.apache.maven.plugins:maven-assembly-plugin:2.6:single failed: An API incompatibility was encountered while executing org.apache.maven.plugins:maven-assembly-plugin:2.6:single: java.lang.ExceptionInInitializerError: null
[windows-jdk10] [ERROR] -----------------------------------------------------
[windows-jdk10] [ERROR] realm = plugin>org.apache.maven.plugins:maven-assembly-plugin:2.6
[windows-jdk10] [ERROR] strategy = org.codehaus.plexus.classworlds.strategy.SelfFirstStrategy
[windows-jdk10] [ERROR] urls[0] = file:/f:/jenkins/jenkins-slave/workspace/maven-box_maven-scm_SCM-797-TSNF7ZXLGM4LUVYJCJU2O25GA4EZKSADD3776FMZEGJH3QG3LZLQ/.repository/org/apache/maven/plugins/maven-assembly-plugin/2.6/maven-assembly-plugin-2.6.jar
[windows-jdk10] [ERROR] urls[1] = file:/f:/jenkins/jenkins-slave/workspace/maven-box_maven-scm_SCM-797-TSNF7ZXLGM4LUVYJCJU2O25GA4EZKSADD3776FMZEGJH3QG3LZLQ/.repository/org/slf4j/slf4j-jdk14/1.5.6/slf4j-jdk14-1.5.6.jar
[windows-jdk10] [ERROR] urls[2] = file:/f:/jenkins/jenkins-slave/workspace/maven-box_maven-scm_SCM-797-TSNF7ZXLGM4LUVYJCJU2O25GA4EZKSADD3776FMZEGJH3QG3LZLQ/.repository/org/slf4j/jcl-over-slf4j/1.5.6/jcl-over-slf4j-1.5.6.jar
[windows-jdk10] [ERROR] urls[3] = file:/f:/jenkins/jenkins-slave/workspace/maven-box_maven-scm_SCM-797-TSNF7ZXLGM4LUVYJCJU2O25GA4EZKSADD3776FMZEGJH3QG3LZLQ/.repository/org/apache/maven/reporting/maven-reporting-api/2.2.1/maven-reporting-api-2.2.1.jar
[windows-jdk10] [ERROR] urls[4] = file:/f:/jenkins/jenkins-slave/workspace/maven-box_maven-scm_SCM-797-TSNF7ZXLGM4LUVYJCJU2O25GA4EZKSADD3776FMZEGJH3QG3LZLQ/.repository/org/apache/maven/doxia/doxia-sink-api/1.1/doxia-sink-api-1.1.jar
[windows-jdk10] [ERROR] urls[5] = file:/f:/jenkins/jenkins-slave/workspace/maven-box_maven-scm_SCM-797-TSNF7ZXLGM4LUVYJCJU2O25GA4EZKSADD3776FMZEGJH3QG3LZLQ/.repository/org/apache/maven/doxia/doxia-logging-api/1.1/doxia-logging-api-1.1.jar
[windows-jdk10] [ERROR] urls[6] = file:/f:/jenkins/jenkins-slave/workspace/maven-box_maven-scm_SCM-797-TSNF7ZXLGM4LUVYJCJU2O25GA4EZKSADD3776FMZEGJH3QG3LZLQ/.repository/junit/junit/3.8.1/junit-3.8.1.jar
[windows-jdk10] [ERROR] urls[7] = file:/f:/jenkins/jenkins-slave/workspace/maven-box_maven-scm_SCM-797-TSNF7ZXLGM4LUVYJCJU2O25GA4EZKSADD3776FMZEGJH3QG3LZLQ/.repository/commons-cli/commons-cli/1.2/commons-cli-1.2.jar
[windows-jdk10] [ERROR] urls[8] = file:/f:/jenkins/jenkins-slave/workspace/maven-box_maven-scm_SCM-797-TSNF7ZXLGM4LUVYJCJU2O25GA4EZKSADD3776FMZEGJH3QG3LZLQ/.repository/org/codehaus/plexus/plexus-interactivity-api/1.0-alpha-4/plexus-interactivity-api-1.0-alpha-4.jar
[windows-jdk10] [ERROR] urls[9] = file:/f:/jenkins/jenkins-slave/workspace/maven-box_maven-scm_SCM-797-TSNF7ZXLGM4LUVYJCJU2O25GA4EZKSADD3776FMZEGJH3QG3LZLQ/.repository/backport-util-concurrent/backport-util-concurrent/3.1/backport-util-concurrent-3.1.jar
[windows-jdk10] [ERROR] urls[10] = file:/f:/jenkins/jenkins-slave/workspace/maven-box_maven-scm_SCM-797-TSNF7ZXLGM4LUVYJCJU2O25GA4EZKSADD3776FMZEGJH3QG3LZLQ/.repository/org/sonatype/plexus/plexus-sec-dispatcher/1.3/plexus-sec-dispatcher-1.3.jar
[windows-jdk10] [ERROR] urls[11] = file:/f:/jenkins/jenkins-slave/workspace/maven-box_maven-scm_SCM-797-TSNF7ZXLGM4LUVYJCJU2O25GA4EZKSADD3776FMZEGJH3QG3LZLQ/.repository/org/sonatype/plexus/plexus-cipher/1.4/plexus-cipher-1.4.jar
[windows-jdk10] [ERROR] urls[12] = file:/f:/jenkins/jenkins-slave/workspace/maven-box_maven-scm_SCM-797-TSNF7ZXLGM4LUVYJCJU2O25GA4EZKSADD3776FMZEGJH3QG3LZLQ/.repository/org/apache/maven/shared/maven-common-artifact-filters/1.4/maven-common-artifact-filters-1.4.jar
[windows-jdk10] [ERROR] urls[13] = file:/f:/jenkins/jenkins-slave/workspace/maven-box_maven-scm_SCM-797-TSNF7ZXLGM4LUVYJCJU2O25GA4EZKSADD3776FMZEGJH3QG3LZLQ/.repository/org/codehaus/plexus/plexus-interpolation/1.22/plexus-interpolation-1.22.jar
[windows-jdk10] [ERROR] urls[14] = file:/f:/jenkins/jenkins-slave/workspace/maven-box_maven-scm_SCM-797-TSNF7ZXLGM4LUVYJCJU2O25GA4EZKSADD3776FMZEGJH3QG3LZLQ/.repository/org/codehaus/plexus/plexus-archiver/3.0.1/plexus-archiver-3.0.1.jar
[windows-jdk10] [ERROR] urls[15] = file:/f:/jenkins/jenkins-slave/workspace/maven-box_maven-scm_SCM-797-TSNF7ZXLGM4LUVYJCJU2O25GA4EZKSADD3776FMZEGJH3QG3LZLQ/.repository/org/iq80/snappy/snappy/0.3/snappy-0.3.jar
[windows-jdk10] [ERROR] urls[16] = file:/f:/jenkins/jenkins-slave/workspace/maven-box_maven-scm_SCM-797-TSNF7ZXLGM4LUVYJCJU2O25GA4EZKSADD3776FMZEGJH3QG3LZLQ/.repository/org/apache/maven/shared/file-management/1.1/file-management-1.1.jar
[windows-jdk10] [ERROR] urls[17] = file:/f:/jenkins/jenkins-slave/workspace/maven-box_maven-scm_SCM-797-TSNF7ZXLGM4LUVYJCJU2O25GA4EZKSADD3776FMZEGJH3QG3LZLQ/.repository/org/apache/maven/shared/maven-shared-io/1.1/maven-shared-io-1.1.jar
[windows-jdk10] [ERROR] urls[18] = file:/f:/jenkins/jenkins-slave/workspace/maven-box_maven-scm_SCM-797-TSNF7ZXLGM4LUVYJCJU2O25GA4EZKSADD3776FMZEGJH3QG3LZLQ/.repository/commons-io/commons-io/2.2/commons-io-2.2.jar
[windows-jdk10] [ERROR] urls[19] = file:/f:/jenkins/jenkins-slave/workspace/maven-box_maven-scm_SCM-797-TSNF7ZXLGM4LUVYJCJU2O25GA4EZKSADD3776FMZEGJH3QG3LZLQ/.repository/org/apache/maven/shared/maven-filtering/1.3/maven-filtering-1.3.jar
[windows-jdk10] [ERROR] urls[20] = file:/f:/jenkins/jenkins-slave/workspace/maven-box_maven-scm_SCM-797-TSNF7ZXLGM4LUVYJCJU2O25GA4EZKSADD3776FMZEGJH3QG3LZLQ/.repository/org/apache/maven/shared/maven-shared-utils/0.6/maven-shared-utils-0.6.jar
[windows-jdk10] [ERROR] urls[21] = file:/f:/jenkins/jenkins-slave/workspace/maven-box_maven-scm_SCM-797-TSNF7ZXLGM4LUVYJCJU2O25GA4EZKSADD3776FMZEGJH3QG3LZLQ/.repository/com/google/code/findbugs/jsr305/2.0.1/jsr305-2.0.1.jar
[windows-jdk10] [ERROR] urls[22] = file:/f:/jenkins/jenkins-slave/workspace/maven-box_maven-scm_SCM-797-TSNF7ZXLGM4LUVYJCJU2O25GA4EZKSADD3776FMZEGJH3QG3LZLQ/.repository/org/sonatype/plexus/plexus-build-api/0.0.4/plexus-build-api-0.0.4.jar
[windows-jdk10] [ERROR] urls[23] = file:/f:/jenkins/jenkins-slave/workspace/maven-box_maven-scm_SCM-797-TSNF7ZXLGM4LUVYJCJU2O25GA4EZKSADD3776FMZEGJH3QG3LZLQ/.repository/org/codehaus/plexus/plexus-io/2.6/plexus-io-2.6.jar
[windows-jdk10] [ERROR] urls[24] = file:/f:/jenkins/jenkins-slave/workspace/maven-box_maven-scm_SCM-797-TSNF7ZXLGM4LUVYJCJU2O25GA4EZKSADD3776FMZEGJH3QG3LZLQ/.repository/org/apache/maven/maven-archiver/2.5/maven-archiver-2.5.jar
[windows-jdk10] [ERROR] urls[25] = file:/f:/jenkins/jenkins-slave/workspace/maven-box_maven-scm_SCM-797-TSNF7ZXLGM4LUVYJCJU2O25GA4EZKSADD3776FMZEGJH3QG3LZLQ/.repository/org/codehaus/plexus/plexus-utils/3.0.21/plexus-utils-3.0.21.jar
[windows-jdk10] [ERROR] urls[26] = file:/f:/jenkins/jenkins-slave/workspace/maven-box_maven-scm_SCM-797-TSNF7ZXLGM4LUVYJCJU2O25GA4EZKSADD3776FMZEGJH3QG3LZLQ/.repository/org/apache/maven/shared/maven-repository-builder/1.0/maven-repository-builder-1.0.jar
[windows-jdk10] [ERROR] urls[27] = file:/f:/jenkins/jenkins-slave/workspace/maven-box_maven-scm_SCM-797-TSNF7ZXLGM4LUVYJCJU2O25GA4EZKSADD3776FMZEGJH3QG3LZLQ/.repository/commons-codec/commons-codec/1.6/commons-codec-1.6.jar
[windows-jdk10] [ERROR] Number of foreign imports: 1
[windows-jdk10] [ERROR] import: Entry[import from realm ClassRealm[maven.api, parent: null]]
[windows-jdk10] [ERROR]
[windows-jdk10] [ERROR] -----------------------------------------------------
[windows-jdk10] [ERROR] -> [Help 1]
[windows-jdk10] [ERROR]
[windows-jdk10] [ERROR] To see the full stack trace of the errors, re-run Maven with the -e switch.
[windows-jdk10] [ERROR] Re-run Maven using the -X switch to enable full debug logging.
[windows-jdk10] [ERROR]
[windows-jdk10] [ERROR] For more information about the errors and possible solutions, please read the following articles:
[windows-jdk10] [ERROR] [Help 1] http://cwiki.apache.org/confluence/display/MAVEN/PluginContainerException
[windows-jdk10] [ERROR]
[windows-jdk10] [ERROR] After correcting the problems, you can resume the build with the command
[windows-jdk10] [ERROR] mvn <goals> -rf :maven-scm-client
[Pipeline] [windows-jdk10] }
[Pipeline] [windows-jdk10] // dir
[Pipeline] [windows-jdk10] }
[windows-jdk10] [withMaven] junitPublisher - Archive test results for Maven artifact org.apache.maven.scm:maven-scm-api:1.9.6-SNAPSHOT generated by maven-surefire-plugin:test (default-test): m\maven-scm-api\target\surefire-reports\*.xml
[windows-jdk10] Recording test results
[windows-jdk10] [withMaven] junitPublisher - Archive test results for Maven artifact org.apache.maven.scm:maven-scm-manager-plexus:1.9.6-SNAPSHOT generated by maven-surefire-plugin:test (default-test): m\maven-scm-managers\maven-scm-manager-plexus\target\surefire-reports\*.xml
[windows-jdk10] Recording test results
[windows-jdk10] None of the test reports contained any result
[windows-jdk10] [withMaven] junitPublisher - Archive test results for Maven artifact org.apache.maven.scm:maven-scm-test:1.9.6-SNAPSHOT generated by maven-surefire-plugin:test (default-test): m\maven-scm-test\target\surefire-reports\*.xml
[windows-jdk10] Recording test results
[windows-jdk10] [withMaven] junitPublisher - Archive test results for Maven artifact org.apache.maven.scm:maven-scm-provider-accurev:1.9.6-SNAPSHOT generated by maven-surefire-plugin:test (default-test): m\maven-scm-providers\maven-scm-provider-accurev\target\surefire-reports\*.xml
[windows-jdk10] Recording test results
[windows-jdk10] [withMaven] junitPublisher - Archive test results for Maven artifact org.apache.maven.scm:maven-scm-provider-bazaar:1.9.6-SNAPSHOT generated by maven-surefire-plugin:test (default-test): m\maven-scm-providers\maven-scm-provider-bazaar\target\surefire-reports\*.xml
[windows-jdk10] Recording test results
[windows-jdk10] [withMaven] junitPublisher - Archive test results for Maven artifact org.apache.maven.scm:maven-scm-provider-clearcase:1.9.6-SNAPSHOT generated by maven-surefire-plugin:test (default-test): m\maven-scm-providers\maven-scm-provider-clearcase\target\surefire-reports\*.xml
[windows-jdk10] Recording test results
[windows-jdk10] [withMaven] junitPublisher - Archive test results for Maven artifact org.apache.maven.scm:maven-scm-provider-cvstest:1.9.6-SNAPSHOT generated by maven-surefire-plugin:test (default-test): m\maven-scm-providers\maven-scm-providers-cvs\maven-scm-provider-cvstest\target\surefire-reports\*.xml
[windows-jdk10] Recording test results
[windows-jdk10] None of the test reports contained any result
[windows-jdk10] [withMaven] junitPublisher - Archive test results for Maven artifact org.apache.maven.scm:maven-scm-provider-cvs-commons:1.9.6-SNAPSHOT generated by maven-surefire-plugin:test (default-test): m\maven-scm-providers\maven-scm-providers-cvs\maven-scm-provider-cvs-commons\target\surefire-reports\*.xml
[windows-jdk10] Recording test results
[windows-jdk10] [withMaven] junitPublisher - Archive test results for Maven artifact org.apache.maven.scm:maven-scm-provider-cvsexe:1.9.6-SNAPSHOT generated by maven-surefire-plugin:test (default-test): m\maven-scm-providers\maven-scm-providers-cvs\maven-scm-provider-cvsexe\target\surefire-reports\*.xml
[windows-jdk10] Recording test results
[windows-jdk10] [withMaven] junitPublisher - Archive test results for Maven artifact org.apache.maven.scm:maven-scm-provider-cvsjava:1.9.6-SNAPSHOT generated by maven-surefire-plugin:test (default-test): m\maven-scm-providers\maven-scm-providers-cvs\maven-scm-provider-cvsjava\target\surefire-reports\*.xml
[windows-jdk10] Recording test results
[windows-jdk10] [withMaven] junitPublisher - Archive test results for Maven artifact org.apache.maven.scm:maven-scm-provider-hg:1.9.6-SNAPSHOT generated by maven-surefire-plugin:test (default-test): m\maven-scm-providers\maven-scm-provider-hg\target\surefire-reports\*.xml
[windows-jdk10] Recording test results
[windows-jdk10] [withMaven] junitPublisher - Archive test results for Maven artifact org.apache.maven.scm:maven-scm-provider-git-commons:1.9.6-SNAPSHOT generated by maven-surefire-plugin:test (default-test): m\maven-scm-providers\maven-scm-providers-git\maven-scm-provider-git-commons\target\surefire-reports\*.xml
[windows-jdk10] Recording test results
[windows-jdk10] [withMaven] junitPublisher - Archive test results for Maven artifact org.apache.maven.scm:maven-scm-provider-gittest:1.9.6-SNAPSHOT generated by maven-surefire-plugin:test (default-test): m\maven-scm-providers\maven-scm-providers-git\maven-scm-provider-gittest\target\surefire-reports\*.xml
[windows-jdk10] Recording test results
[windows-jdk10] None of the test reports contained any result
[windows-jdk10] [withMaven] junitPublisher - Archive test results for Maven artifact org.apache.maven.scm:maven-scm-provider-gitexe:1.9.6-SNAPSHOT generated by maven-surefire-plugin:test (default-test): m\maven-scm-providers\maven-scm-providers-git\maven-scm-provider-gitexe\target\surefire-reports\*.xml
[windows-jdk10] Recording test results
[windows-jdk10] [withMaven] junitPublisher - Archive test results for Maven artifact org.apache.maven.scm:maven-scm-provider-jgit:1.9.6-SNAPSHOT generated by maven-surefire-plugin:test (default-test): m\maven-scm-providers\maven-scm-providers-git\maven-scm-provider-jgit\target\surefire-reports\*.xml
[windows-jdk10] Recording test results
[windows-jdk10] [withMaven] junitPublisher - Archive test results for Maven artifact org.apache.maven.scm:maven-scm-provider-local:1.9.6-SNAPSHOT generated by maven-surefire-plugin:test (default-test): m\maven-scm-providers\maven-scm-provider-local\target\surefire-reports\*.xml
[windows-jdk10] Recording test results
[windows-jdk10] [withMaven] junitPublisher - Archive test results for Maven artifact org.apache.maven.scm:maven-scm-provider-perforce:1.9.6-SNAPSHOT generated by maven-surefire-plugin:test (default-test): m\maven-scm-providers\maven-scm-provider-perforce\target\surefire-reports\*.xml
[windows-jdk10] Recording test results
[windows-jdk10] [withMaven] junitPublisher - Archive test results for Maven artifact org.apache.maven.scm:maven-scm-provider-starteam:1.9.6-SNAPSHOT generated by maven-surefire-plugin:test (default-test): m\maven-scm-providers\maven-scm-provider-starteam\target\surefire-reports\*.xml
[windows-jdk10] Recording test results
[windows-jdk10] [withMaven] junitPublisher - Archive test results for Maven artifact org.apache.maven.scm:maven-scm-provider-svn-commons:1.9.6-SNAPSHOT generated by maven-surefire-plugin:test (default-test): m\maven-scm-providers\maven-scm-providers-svn\maven-scm-provider-svn-commons\target\surefire-reports\*.xml
[windows-jdk10] Recording test results
[windows-jdk10] [withMaven] junitPublisher - Archive test results for Maven artifact org.apache.maven.scm:maven-scm-provider-svntest:1.9.6-SNAPSHOT generated by maven-surefire-plugin:test (default-test): m\maven-scm-providers\maven-scm-providers-svn\maven-scm-provider-svntest\target\surefire-reports\*.xml
[windows-jdk10] Recording test results
[windows-jdk10] None of the test reports contained any result
[windows-jdk10] [withMaven] junitPublisher - Archive test results for Maven artifact org.apache.maven.scm:maven-scm-provider-svnexe:1.9.6-SNAPSHOT generated by maven-surefire-plugin:test (default-test): m\maven-scm-providers\maven-scm-providers-svn\maven-scm-provider-svnexe\target\surefire-reports\*.xml
[windows-jdk10] Recording test results
[windows-jdk10] [withMaven] junitPublisher - Archive test results for Maven artifact org.apache.maven.scm:maven-scm-provider-synergy:1.9.6-SNAPSHOT generated by maven-surefire-plugin:test (default-test): m\maven-scm-providers\maven-scm-provider-synergy\target\surefire-reports\*.xml
[windows-jdk10] Recording test results
[windows-jdk10] [withMaven] junitPublisher - Archive test results for Maven artifact org.apache.maven.scm:maven-scm-provider-vss:1.9.6-SNAPSHOT generated by maven-surefire-plugin:test (default-test): m\maven-scm-providers\maven-scm-provider-vss\target\surefire-reports\*.xml
[windows-jdk10] Recording test results
[windows-jdk10] [withMaven] junitPublisher - Archive test results for Maven artifact org.apache.maven.scm:maven-scm-provider-tfs:1.9.6-SNAPSHOT generated by maven-surefire-plugin:test (default-test): m\maven-scm-providers\maven-scm-provider-tfs\target\surefire-reports\*.xml
[windows-jdk10] Recording test results
[windows-jdk10] [withMaven] junitPublisher - Archive test results for Maven artifact org.apache.maven.scm:maven-scm-provider-integrity:1.9.6-SNAPSHOT generated by maven-surefire-plugin:test (default-test): m\maven-scm-providers\maven-scm-provider-integrity\target\surefire-reports\*.xml
[windows-jdk10] Recording test results
[windows-jdk10] [withMaven] junitPublisher - Archive test results for Maven artifact org.apache.maven.scm:maven-scm-provider-jazz:1.9.6-SNAPSHOT generated by maven-surefire-plugin:test (default-test): m\maven-scm-providers\maven-scm-provider-jazz\target\surefire-reports\*.xml
[windows-jdk10] Recording test results
[windows-jdk10] [withMaven] junitPublisher - Archive test results for Maven artifact org.apache.maven.scm:maven-scm-client:1.9.6-SNAPSHOT generated by maven-surefire-plugin:test (default-test): m\maven-scm-client\target\surefire-reports\*.xml
[windows-jdk10] Recording test results
[windows-jdk10] None of the test reports contained any result
[Pipeline] [windows-jdk10] // withMaven
[Pipeline] [windows-jdk10] cleanWs
[windows-jdk10] [WS-CLEANUP] Deleting project workspace...[WS-CLEANUP] done
[Pipeline] [windows-jdk10] cleanWs
[windows-jdk10] [WS-CLEANUP] Deleting project workspace...[WS-CLEANUP] done
[Pipeline] [windows-jdk10] }
[Pipeline] [windows-jdk10] // stage
[Pipeline] [windows-jdk10] }
[Pipeline] [windows-jdk10] // node
[Pipeline] [windows-jdk10] }
[windows-jdk10] Failed in branch windows-jdk10
[Pipeline] // parallel
[Pipeline] stage
[Pipeline] { (Notifications)
[Pipeline] echo
Build result: FAILURE
[Pipeline] jiraIssueSelector
[Pipeline] emailext
Build failed in Jenkins: Maven TLP » maven-scm » SCM-797 #12
Posted by Apache Jenkins Server <je...@builds.apache.org>.
See https://builds.apache.org/job/maven-box/job/maven-scm/job/SCM-797/12/
No changes.
23 tests failed.
FAILED: org.apache.maven.scm.provider.git.gitexe.command.checkin.GitCheckInCommandNoBranchTest.testCheckinNoBranch
Error Message:
The check out result success flag was false.
Stack Trace:
junit.framework.AssertionFailedError: The check out result success flag was false.
at org.apache.maven.scm.provider.git.gitexe.command.checkin.GitCheckInCommandNoBranchTest.testCheckinNoBranch(GitCheckInCommandNoBranchTest.java:75)
FAILED: org.apache.maven.scm.provider.git.gitexe.command.checkin.GitCheckInCommandNoBranchTest.testCheckinNoBranch
Error Message:
The check out result success flag was false.
Stack Trace:
junit.framework.AssertionFailedError: The check out result success flag was false.
at org.apache.maven.scm.provider.git.gitexe.command.checkin.GitCheckInCommandNoBranchTest.testCheckinNoBranch(GitCheckInCommandNoBranchTest.java:75)
FAILED: org.apache.maven.scm.provider.git.gitexe.command.checkin.GitCheckInCommandNoBranchTest.testCheckinNoBranch
Error Message:
The check out result success flag was false.
Stack Trace:
junit.framework.AssertionFailedError: The check out result success flag was false.
at org.apache.maven.scm.provider.git.gitexe.command.checkin.GitCheckInCommandNoBranchTest.testCheckinNoBranch(GitCheckInCommandNoBranchTest.java:75)
FAILED: org.apache.maven.scm.provider.git.gitexe.command.checkin.GitCheckInCommandNoBranchTest.testCheckinNoBranch
Error Message:
The check out result success flag was false.
Stack Trace:
junit.framework.AssertionFailedError: The check out result success flag was false.
at org.apache.maven.scm.provider.git.gitexe.command.checkin.GitCheckInCommandNoBranchTest.testCheckinNoBranch(GitCheckInCommandNoBranchTest.java:75)
FAILED: org.apache.maven.scm.provider.git.jgit.command.branch.JGitBranchCommandTckTest.testBranchCommandTest
Error Message:
Exception while executing SCM command.
Stack Trace:
org.apache.maven.scm.ScmException: Exception while executing SCM command.
Caused by: org.apache.maven.scm.ScmException: JGit checkout failure!
Caused by: org.eclipse.jgit.api.errors.JGitInternalException: Exception caught during execution of fetch command
Caused by: org.eclipse.jgit.errors.NotSupportedException: URI not supported: file://2/m/maven-scm-providers/maven-scm-providers-git/maven-scm-provider-jgit/target/scm-test/repository
FAILED: org.apache.maven.scm.provider.git.jgit.command.changelog.JGitChangeLogCommandTckTest.testChangeLogCommand
Error Message:
Exception while executing SCM command.
Stack Trace:
org.apache.maven.scm.ScmException: Exception while executing SCM command.
Caused by: org.apache.maven.scm.ScmException: JGit checkout failure!
Caused by: org.eclipse.jgit.api.errors.JGitInternalException: Exception caught during execution of fetch command
Caused by: org.eclipse.jgit.errors.NotSupportedException: URI not supported: file://2/m/maven-scm-providers/maven-scm-providers-git/maven-scm-provider-jgit/target/scm-test/repository
FAILED: org.apache.maven.scm.provider.git.jgit.command.checkin.JGitCheckInCommandCommitterAuthorTckTest.testCheckInCommandTest
Error Message:
Exception while executing SCM command.
Stack Trace:
org.apache.maven.scm.ScmException: Exception while executing SCM command.
at org.apache.maven.scm.provider.git.jgit.command.checkin.JGitCheckInCommandCommitterAuthorTckTest.setUp(JGitCheckInCommandCommitterAuthorTckTest.java:60)
Caused by: org.apache.maven.scm.ScmException: JGit checkout failure!
at org.apache.maven.scm.provider.git.jgit.command.checkin.JGitCheckInCommandCommitterAuthorTckTest.setUp(JGitCheckInCommandCommitterAuthorTckTest.java:60)
Caused by: org.eclipse.jgit.api.errors.JGitInternalException: Exception caught during execution of fetch command
at org.apache.maven.scm.provider.git.jgit.command.checkin.JGitCheckInCommandCommitterAuthorTckTest.setUp(JGitCheckInCommandCommitterAuthorTckTest.java:60)
Caused by: org.eclipse.jgit.errors.NotSupportedException: URI not supported: file://2/m/maven-scm-providers/maven-scm-providers-git/maven-scm-provider-jgit/target/scm-test/repository
at org.apache.maven.scm.provider.git.jgit.command.checkin.JGitCheckInCommandCommitterAuthorTckTest.setUp(JGitCheckInCommandCommitterAuthorTckTest.java:60)
FAILED: org.apache.maven.scm.provider.git.jgit.command.checkin.JGitCheckInCommandCommitterAuthorTckTest.testCheckInCommandPartialFileset
Error Message:
Exception while executing SCM command.
Stack Trace:
org.apache.maven.scm.ScmException: Exception while executing SCM command.
at org.apache.maven.scm.provider.git.jgit.command.checkin.JGitCheckInCommandCommitterAuthorTckTest.setUp(JGitCheckInCommandCommitterAuthorTckTest.java:60)
Caused by: org.apache.maven.scm.ScmException: JGit checkout failure!
at org.apache.maven.scm.provider.git.jgit.command.checkin.JGitCheckInCommandCommitterAuthorTckTest.setUp(JGitCheckInCommandCommitterAuthorTckTest.java:60)
Caused by: org.eclipse.jgit.api.errors.JGitInternalException: Exception caught during execution of fetch command
at org.apache.maven.scm.provider.git.jgit.command.checkin.JGitCheckInCommandCommitterAuthorTckTest.setUp(JGitCheckInCommandCommitterAuthorTckTest.java:60)
Caused by: org.eclipse.jgit.errors.NotSupportedException: URI not supported: file://2/m/maven-scm-providers/maven-scm-providers-git/maven-scm-provider-jgit/target/scm-test/repository
at org.apache.maven.scm.provider.git.jgit.command.checkin.JGitCheckInCommandCommitterAuthorTckTest.setUp(JGitCheckInCommandCommitterAuthorTckTest.java:60)
FAILED: org.apache.maven.scm.provider.git.jgit.command.checkin.JGitCheckInCommandTckTest.testCheckInCommandTest
Error Message:
Exception while executing SCM command.
Stack Trace:
org.apache.maven.scm.ScmException: Exception while executing SCM command.
Caused by: org.apache.maven.scm.ScmException: JGit checkout failure!
Caused by: org.eclipse.jgit.api.errors.JGitInternalException: Exception caught during execution of fetch command
Caused by: org.eclipse.jgit.errors.NotSupportedException: URI not supported: file://2/m/maven-scm-providers/maven-scm-providers-git/maven-scm-provider-jgit/target/scm-test/repository
FAILED: org.apache.maven.scm.provider.git.jgit.command.checkin.JGitCheckInCommandTckTest.testCheckInCommandPartialFileset
Error Message:
Exception while executing SCM command.
Stack Trace:
org.apache.maven.scm.ScmException: Exception while executing SCM command.
Caused by: org.apache.maven.scm.ScmException: JGit checkout failure!
Caused by: org.eclipse.jgit.api.errors.JGitInternalException: Exception caught during execution of fetch command
Caused by: org.eclipse.jgit.errors.NotSupportedException: URI not supported: file://2/m/maven-scm-providers/maven-scm-providers-git/maven-scm-provider-jgit/target/scm-test/repository
FAILED: org.apache.maven.scm.provider.git.jgit.command.checkout.JGitCheckOutCommandTckTest.testCheckOutCommandTest
Error Message:
Exception while executing SCM command.
Stack Trace:
org.apache.maven.scm.ScmException: Exception while executing SCM command.
Caused by: org.apache.maven.scm.ScmException: JGit checkout failure!
Caused by: org.eclipse.jgit.api.errors.JGitInternalException: Exception caught during execution of fetch command
Caused by: org.eclipse.jgit.errors.NotSupportedException: URI not supported: file://2/m/maven-scm-providers/maven-scm-providers-git/maven-scm-provider-jgit/target/scm-test/repository
FAILED: org.apache.maven.scm.provider.git.jgit.command.diff.JGitDiffCommandTckTest.testDiffCommand
Error Message:
Exception while executing SCM command.
Stack Trace:
org.apache.maven.scm.ScmException: Exception while executing SCM command.
Caused by: org.apache.maven.scm.ScmException: JGit checkout failure!
Caused by: org.eclipse.jgit.api.errors.JGitInternalException: Exception caught during execution of fetch command
Caused by: org.eclipse.jgit.errors.NotSupportedException: URI not supported: file://2/m/maven-scm-providers/maven-scm-providers-git/maven-scm-provider-jgit/target/scm-test/repository
FAILED: org.apache.maven.scm.provider.git.jgit.command.remoteinfo.JGitRemoteInfoCommandTckTest.testRemoteInfoCommand
Error Message:
Exception while executing SCM command.
Stack Trace:
org.apache.maven.scm.ScmException: Exception while executing SCM command.
Caused by: org.apache.maven.scm.ScmException: JGit checkout failure!
Caused by: org.eclipse.jgit.api.errors.JGitInternalException: Exception caught during execution of fetch command
Caused by: org.eclipse.jgit.errors.NotSupportedException: URI not supported: file://2/m/maven-scm-providers/maven-scm-providers-git/maven-scm-provider-jgit/target/scm-test/repository
FAILED: org.apache.maven.scm.provider.git.jgit.command.status.JGitStatusCommandTckTest.testStatusCommand
Error Message:
Exception while executing SCM command.
Stack Trace:
org.apache.maven.scm.ScmException: Exception while executing SCM command.
Caused by: org.apache.maven.scm.ScmException: JGit checkout failure!
Caused by: org.eclipse.jgit.api.errors.JGitInternalException: Exception caught during execution of fetch command
Caused by: org.eclipse.jgit.errors.NotSupportedException: URI not supported: file://2/m/maven-scm-providers/maven-scm-providers-git/maven-scm-provider-jgit/target/scm-test/repository
FAILED: org.apache.maven.scm.provider.git.jgit.command.tag.JGitTagCommandTckTest.testTagCommandTest
Error Message:
Exception while executing SCM command.
Stack Trace:
org.apache.maven.scm.ScmException: Exception while executing SCM command.
Caused by: org.apache.maven.scm.ScmException: JGit checkout failure!
Caused by: org.eclipse.jgit.api.errors.JGitInternalException: Exception caught during execution of fetch command
Caused by: org.eclipse.jgit.errors.NotSupportedException: URI not supported: file://2/m/maven-scm-providers/maven-scm-providers-git/maven-scm-provider-jgit/target/scm-test/repository
FAILED: org.apache.maven.scm.provider.git.gitexe.command.checkin.GitCheckInCommandTest.testCheckinAfterRename
Error Message:
The check out result success flag was false.
Stack Trace:
junit.framework.AssertionFailedError: The check out result success flag was false.
at org.apache.maven.scm.provider.git.gitexe.command.checkin.GitCheckInCommandTest.testCheckinAfterRename(GitCheckInCommandTest.java:113)
FAILED: org.apache.maven.scm.provider.git.gitexe.command.checkin.GitCheckInCommandTest.testCheckinAfterRename
Error Message:
The check out result success flag was false.
Stack Trace:
junit.framework.AssertionFailedError: The check out result success flag was false.
at org.apache.maven.scm.provider.git.gitexe.command.checkin.GitCheckInCommandTest.testCheckinAfterRename(GitCheckInCommandTest.java:113)
FAILED: org.apache.maven.scm.provider.git.gitexe.command.checkin.GitCheckInCommandTest.testCheckinAfterRename
Error Message:
The check out result success flag was false.
Stack Trace:
junit.framework.AssertionFailedError: The check out result success flag was false.
at org.apache.maven.scm.provider.git.gitexe.command.checkin.GitCheckInCommandTest.testCheckinAfterRename(GitCheckInCommandTest.java:113)
FAILED: org.apache.maven.scm.provider.git.gitexe.command.checkin.GitCheckInCommandTest.testCheckinAfterRename
Error Message:
The check out result success flag was false.
Stack Trace:
junit.framework.AssertionFailedError: The check out result success flag was false.
at org.apache.maven.scm.provider.git.gitexe.command.checkin.GitCheckInCommandTest.testCheckinAfterRename(GitCheckInCommandTest.java:113)
FAILED: org.apache.maven.scm.provider.git.gitexe.command.checkin.GitCheckInCommandTest.testCheckinAfterRename
Error Message:
Exception while executing SCM command.
Stack Trace:
org.apache.maven.scm.ScmException: Exception while executing SCM command.
at org.apache.maven.scm.provider.git.gitexe.command.checkin.GitCheckInCommandTest.checkoutRepoInto(GitCheckInCommandTest.java:140)
at org.apache.maven.scm.provider.git.gitexe.command.checkin.GitCheckInCommandTest.testCheckinAfterRename(GitCheckInCommandTest.java:99)
Caused by: org.apache.maven.scm.ScmException: Error while executing command.
at org.apache.maven.scm.provider.git.gitexe.command.checkin.GitCheckInCommandTest.checkoutRepoInto(GitCheckInCommandTest.java:140)
at org.apache.maven.scm.provider.git.gitexe.command.checkin.GitCheckInCommandTest.testCheckinAfterRename(GitCheckInCommandTest.java:99)
Caused by: org.codehaus.plexus.util.cli.CommandLineException: Error while executing process.
at org.apache.maven.scm.provider.git.gitexe.command.checkin.GitCheckInCommandTest.checkoutRepoInto(GitCheckInCommandTest.java:140)
at org.apache.maven.scm.provider.git.gitexe.command.checkin.GitCheckInCommandTest.testCheckinAfterRename(GitCheckInCommandTest.java:99)
Caused by: java.io.IOException: Cannot run program "git" (in directory "F:\jenkins\jenkins-slave\workspace\maven-box_maven-scm_SCM-797-TSNF7ZXLGM4LUVYJCJU2O25GA4EZKSADD3776FMZEGJH3QG3LZLQ\m\maven-scm-providers\maven-scm-providers-git\maven-scm-provider-gitexe\target\scm-test"): CreateProcess error=2, The system cannot find the file specified
at org.apache.maven.scm.provider.git.gitexe.command.checkin.GitCheckInCommandTest.checkoutRepoInto(GitCheckInCommandTest.java:140)
at org.apache.maven.scm.provider.git.gitexe.command.checkin.GitCheckInCommandTest.testCheckinAfterRename(GitCheckInCommandTest.java:99)
Caused by: java.io.IOException: CreateProcess error=2, The system cannot find the file specified
at org.apache.maven.scm.provider.git.gitexe.command.checkin.GitCheckInCommandTest.checkoutRepoInto(GitCheckInCommandTest.java:140)
at org.apache.maven.scm.provider.git.gitexe.command.checkin.GitCheckInCommandTest.testCheckinAfterRename(GitCheckInCommandTest.java:99)
FAILED: org.apache.maven.scm.provider.git.gitexe.command.checkin.GitCheckInCommandTest.testCheckinAfterRename
Error Message:
Exception while executing SCM command.
Stack Trace:
org.apache.maven.scm.ScmException: Exception while executing SCM command.
at org.apache.maven.scm.provider.git.gitexe.command.checkin.GitCheckInCommandTest.checkoutRepoInto(GitCheckInCommandTest.java:141)
at org.apache.maven.scm.provider.git.gitexe.command.checkin.GitCheckInCommandTest.testCheckinAfterRename(GitCheckInCommandTest.java:99)
Caused by: org.apache.maven.scm.ScmException: Error while executing command.
at org.apache.maven.scm.provider.git.gitexe.command.checkin.GitCheckInCommandTest.checkoutRepoInto(GitCheckInCommandTest.java:141)
at org.apache.maven.scm.provider.git.gitexe.command.checkin.GitCheckInCommandTest.testCheckinAfterRename(GitCheckInCommandTest.java:99)
Caused by: org.codehaus.plexus.util.cli.CommandLineException: Error while executing process.
at org.apache.maven.scm.provider.git.gitexe.command.checkin.GitCheckInCommandTest.checkoutRepoInto(GitCheckInCommandTest.java:141)
at org.apache.maven.scm.provider.git.gitexe.command.checkin.GitCheckInCommandTest.testCheckinAfterRename(GitCheckInCommandTest.java:99)
Caused by: java.io.IOException: Cannot run program "git" (in directory "F:\jenkins\jenkins-slave\workspace\maven-box_maven-scm_SCM-797-TSNF7ZXLGM4LUVYJCJU2O25GA4EZKSADD3776FMZEGJH3QG3LZLQ\m\maven-scm-providers\maven-scm-providers-git\maven-scm-provider-gitexe\target\scm-test"): CreateProcess error=2, The system cannot find the file specified
at org.apache.maven.scm.provider.git.gitexe.command.checkin.GitCheckInCommandTest.checkoutRepoInto(GitCheckInCommandTest.java:141)
at org.apache.maven.scm.provider.git.gitexe.command.checkin.GitCheckInCommandTest.testCheckinAfterRename(GitCheckInCommandTest.java:99)
Caused by: java.io.IOException: CreateProcess error=2, The system cannot find the file specified
at org.apache.maven.scm.provider.git.gitexe.command.checkin.GitCheckInCommandTest.checkoutRepoInto(GitCheckInCommandTest.java:141)
at org.apache.maven.scm.provider.git.gitexe.command.checkin.GitCheckInCommandTest.testCheckinAfterRename(GitCheckInCommandTest.java:99)
FAILED: org.apache.maven.scm.provider.git.gitexe.command.checkin.GitCheckInCommandTest.testCheckinAfterRename
Error Message:
Exception while executing SCM command.
Stack Trace:
org.apache.maven.scm.ScmException: Exception while executing SCM command.
at org.apache.maven.scm.provider.git.gitexe.command.checkin.GitCheckInCommandTest.checkoutRepoInto(GitCheckInCommandTest.java:141)
at org.apache.maven.scm.provider.git.gitexe.command.checkin.GitCheckInCommandTest.testCheckinAfterRename(GitCheckInCommandTest.java:99)
Caused by: org.apache.maven.scm.ScmException: Error while executing command.
at org.apache.maven.scm.provider.git.gitexe.command.checkin.GitCheckInCommandTest.checkoutRepoInto(GitCheckInCommandTest.java:141)
at org.apache.maven.scm.provider.git.gitexe.command.checkin.GitCheckInCommandTest.testCheckinAfterRename(GitCheckInCommandTest.java:99)
Caused by: org.codehaus.plexus.util.cli.CommandLineException: Error while executing process.
at org.apache.maven.scm.provider.git.gitexe.command.checkin.GitCheckInCommandTest.checkoutRepoInto(GitCheckInCommandTest.java:141)
at org.apache.maven.scm.provider.git.gitexe.command.checkin.GitCheckInCommandTest.testCheckinAfterRename(GitCheckInCommandTest.java:99)
Caused by: java.io.IOException: Cannot run program "git" (in directory "F:\jenkins\jenkins-slave\workspace\maven-box_maven-scm_SCM-797-TSNF7ZXLGM4LUVYJCJU2O25GA4EZKSADD3776FMZEGJH3QG3LZLQ@2\m\maven-scm-providers\maven-scm-providers-git\maven-scm-provider-gitexe\target\scm-test"): CreateProcess error=2, The system cannot find the file specified
at org.apache.maven.scm.provider.git.gitexe.command.checkin.GitCheckInCommandTest.checkoutRepoInto(GitCheckInCommandTest.java:141)
at org.apache.maven.scm.provider.git.gitexe.command.checkin.GitCheckInCommandTest.testCheckinAfterRename(GitCheckInCommandTest.java:99)
Caused by: java.io.IOException: CreateProcess error=2, The system cannot find the file specified
at org.apache.maven.scm.provider.git.gitexe.command.checkin.GitCheckInCommandTest.checkoutRepoInto(GitCheckInCommandTest.java:141)
at org.apache.maven.scm.provider.git.gitexe.command.checkin.GitCheckInCommandTest.testCheckinAfterRename(GitCheckInCommandTest.java:99)
FAILED: org.apache.maven.scm.provider.git.gitexe.command.checkin.GitCheckInCommandTest.testCheckinAfterRename
Error Message:
Exception while executing SCM command.
Stack Trace:
org.apache.maven.scm.ScmException: Exception while executing SCM command.
at org.apache.maven.scm.provider.git.gitexe.command.checkin.GitCheckInCommandTest.checkoutRepoInto(GitCheckInCommandTest.java:141)
at org.apache.maven.scm.provider.git.gitexe.command.checkin.GitCheckInCommandTest.testCheckinAfterRename(GitCheckInCommandTest.java:99)
Caused by: org.apache.maven.scm.ScmException: Error while executing command.
at org.apache.maven.scm.provider.git.gitexe.command.checkin.GitCheckInCommandTest.checkoutRepoInto(GitCheckInCommandTest.java:141)
at org.apache.maven.scm.provider.git.gitexe.command.checkin.GitCheckInCommandTest.testCheckinAfterRename(GitCheckInCommandTest.java:99)
Caused by: org.codehaus.plexus.util.cli.CommandLineException: Error while executing process.
at org.apache.maven.scm.provider.git.gitexe.command.checkin.GitCheckInCommandTest.checkoutRepoInto(GitCheckInCommandTest.java:141)
at org.apache.maven.scm.provider.git.gitexe.command.checkin.GitCheckInCommandTest.testCheckinAfterRename(GitCheckInCommandTest.java:99)
Caused by: java.io.IOException: Cannot run program "git" (in directory "F:\jenkins\jenkins-slave\workspace\maven-box_maven-scm_SCM-797-TSNF7ZXLGM4LUVYJCJU2O25GA4EZKSADD3776FMZEGJH3QG3LZLQ\m\maven-scm-providers\maven-scm-providers-git\maven-scm-provider-gitexe\target\scm-test"): CreateProcess error=2, The system cannot find the file specified
at org.apache.maven.scm.provider.git.gitexe.command.checkin.GitCheckInCommandTest.checkoutRepoInto(GitCheckInCommandTest.java:141)
at org.apache.maven.scm.provider.git.gitexe.command.checkin.GitCheckInCommandTest.testCheckinAfterRename(GitCheckInCommandTest.java:99)
Caused by: java.io.IOException: CreateProcess error=2, The system cannot find the file specified
at org.apache.maven.scm.provider.git.gitexe.command.checkin.GitCheckInCommandTest.checkoutRepoInto(GitCheckInCommandTest.java:141)
at org.apache.maven.scm.provider.git.gitexe.command.checkin.GitCheckInCommandTest.testCheckinAfterRename(GitCheckInCommandTest.java:99)
Build log:
[...truncated 7.38 MB...]
[windows-jdk9] [INFO] Downloading from central: https://repo.maven.apache.org/maven2/org/apache/maven/doxia/doxia-module-fml/1.1.4/doxia-module-fml-1.1.4.pom
[windows-jdk9] [INFO] Downloaded from central: https://repo.maven.apache.org/maven2/org/apache/maven/doxia/doxia-module-fml/1.1.4/doxia-module-fml-1.1.4.pom (5.5 kB at 228 kB/s)
[windows-jdk9] [INFO] Downloading from central: https://repo.maven.apache.org/maven2/org/codehaus/groovy/groovy-all/2.0.1/groovy-all-2.0.1.pom
[windows-jdk9] [INFO] Downloaded from central: https://repo.maven.apache.org/maven2/org/codehaus/groovy/groovy-all/2.0.1/groovy-all-2.0.1.pom (18 kB at 342 kB/s)
[windows-jdk9] [INFO] Downloading from central: https://repo.maven.apache.org/maven2/org/codehaus/groovy/groovy/2.0.1/groovy-2.0.1.jar
[windows-jdk9] [INFO] Downloading from central: https://repo.maven.apache.org/maven2/org/apache/maven/shared/maven-invoker/2.2/maven-invoker-2.2.jar
[windows-jdk9] [INFO] Downloading from central: https://repo.maven.apache.org/maven2/org/apache/maven/shared/maven-script-interpreter/1.1/maven-script-interpreter-1.1.jar
[windows-jdk9] [INFO] Downloading from central: https://repo.maven.apache.org/maven2/org/apache/maven/reporting/maven-reporting-impl/2.2/maven-reporting-impl-2.2.jar
[windows-jdk9] [INFO] Downloading from central: https://repo.maven.apache.org/maven2/org/ow2/asm/asm-tree/4.0/asm-tree-4.0.jar
[windows-jdk9] [INFO] Downloaded from central: https://repo.maven.apache.org/maven2/org/apache/maven/reporting/maven-reporting-impl/2.2/maven-reporting-impl-2.2.jar (17 kB at 62 kB/s)
[windows-jdk9] [INFO] Downloaded from central: https://repo.maven.apache.org/maven2/org/codehaus/groovy/groovy/2.0.1/groovy-2.0.1.jar (3.3 MB at 12 MB/s)
[windows-jdk9] [INFO] Downloading from central: https://repo.maven.apache.org/maven2/org/ow2/asm/asm-commons/4.0/asm-commons-4.0.jar
[windows-jdk9] [INFO] Downloading from central: https://repo.maven.apache.org/maven2/org/ow2/asm/asm/4.0/asm-4.0.jar
[windows-jdk9] [INFO] Downloaded from central: https://repo.maven.apache.org/maven2/org/apache/maven/shared/maven-script-interpreter/1.1/maven-script-interpreter-1.1.jar (21 kB at 77 kB/s)
[windows-jdk9] [INFO] Downloading from central: https://repo.maven.apache.org/maven2/org/ow2/asm/asm-util/4.0/asm-util-4.0.jar
[windows-jdk9] [INFO] Downloaded from central: https://repo.maven.apache.org/maven2/org/ow2/asm/asm-tree/4.0/asm-tree-4.0.jar (22 kB at 58 kB/s)
[windows-jdk9] [INFO] Downloading from central: https://repo.maven.apache.org/maven2/org/ow2/asm/asm-analysis/4.0/asm-analysis-4.0.jar
[windows-jdk9] [INFO] Downloaded from central: https://repo.maven.apache.org/maven2/org/apache/maven/shared/maven-invoker/2.2/maven-invoker-2.2.jar (30 kB at 78 kB/s)
[windows-jdk9] [INFO] Downloading from central: https://repo.maven.apache.org/maven2/org/apache/maven/doxia/doxia-site-renderer/1.1.4/doxia-site-renderer-1.1.4.jar
[windows-jdk9] [INFO] Downloaded from central: https://repo.maven.apache.org/maven2/org/ow2/asm/asm-commons/4.0/asm-commons-4.0.jar (38 kB at 84 kB/s)
[windows-jdk9] [INFO] Downloading from central: https://repo.maven.apache.org/maven2/org/apache/maven/doxia/doxia-decoration-model/1.1.4/doxia-decoration-model-1.1.4.jar
[windows-jdk9] [INFO] Downloaded from central: https://repo.maven.apache.org/maven2/org/apache/maven/doxia/doxia-site-renderer/1.1.4/doxia-site-renderer-1.1.4.jar (51 kB at 108 kB/s)
[windows-jdk9] [INFO] Downloading from central: https://repo.maven.apache.org/maven2/org/apache/maven/doxia/doxia-module-xhtml/1.1.4/doxia-module-xhtml-1.1.4.jar
[windows-jdk9] [INFO] Downloaded from central: https://repo.maven.apache.org/maven2/org/apache/maven/doxia/doxia-decoration-model/1.1.4/doxia-decoration-model-1.1.4.jar (52 kB at 106 kB/s)
[windows-jdk9] [INFO] Downloading from central: https://repo.maven.apache.org/maven2/org/apache/maven/doxia/doxia-module-fml/1.1.4/doxia-module-fml-1.1.4.jar
[windows-jdk9] [INFO] Downloaded from central: https://repo.maven.apache.org/maven2/org/ow2/asm/asm-util/4.0/asm-util-4.0.jar (37 kB at 69 kB/s)
[windows-jdk9] [INFO] Downloading from central: https://repo.maven.apache.org/maven2/commons-collections/commons-collections/3.2/commons-collections-3.2.jar
[windows-jdk9] [INFO] Downloaded from central: https://repo.maven.apache.org/maven2/org/ow2/asm/asm/4.0/asm-4.0.jar (46 kB at 85 kB/s)
[windows-jdk9] [INFO] Downloading from central: https://repo.maven.apache.org/maven2/org/codehaus/groovy/groovy-all/2.0.1/groovy-all-2.0.1.jar
[windows-jdk9] [INFO] Downloaded from central: https://repo.maven.apache.org/maven2/org/ow2/asm/asm-analysis/4.0/asm-analysis-4.0.jar (20 kB at 33 kB/s)
[windows-jdk9] [INFO] Downloading from central: https://repo.maven.apache.org/maven2/org/apache/ant/ant/1.8.1/ant-1.8.1.jar
[windows-jdk9] [INFO] Downloaded from central: https://repo.maven.apache.org/maven2/commons-collections/commons-collections/3.2/commons-collections-3.2.jar (571 kB at 883 kB/s)
[windows-jdk9] [INFO] Downloaded from central: https://repo.maven.apache.org/maven2/org/apache/maven/doxia/doxia-module-xhtml/1.1.4/doxia-module-xhtml-1.1.4.jar (15 kB at 23 kB/s)
[windows-jdk9] [INFO] Downloaded from central: https://repo.maven.apache.org/maven2/org/apache/ant/ant/1.8.1/ant-1.8.1.jar (1.5 MB at 2.2 MB/s)
[windows-jdk9] [INFO] Downloaded from central: https://repo.maven.apache.org/maven2/org/apache/maven/doxia/doxia-module-fml/1.1.4/doxia-module-fml-1.1.4.jar (37 kB at 53 kB/s)
[windows-jdk9] [INFO] Downloaded from central: https://repo.maven.apache.org/maven2/org/codehaus/groovy/groovy-all/2.0.1/groovy-all-2.0.1.jar (6.2 MB at 8.0 MB/s)
[windows-jdk9] [INFO] Installing f:\jenkins\jenkins-slave\workspace\maven-box_maven-scm_SCM-797-TSNF7ZXLGM4LUVYJCJU2O25GA4EZKSADD3776FMZEGJH3QG3LZLQ\m\pom.xml to F:\jenkins\jenkins-slave\workspace\maven-box_maven-scm_SCM-797-TSNF7ZXLGM4LUVYJCJU2O25GA4EZKSADD3776FMZEGJH3QG3LZLQ\m\maven-scm-plugin\target\local-repo\org\apache\maven\scm\maven-scm\1.9.6-SNAPSHOT\maven-scm-1.9.6-SNAPSHOT.pom
[windows-jdk9] [INFO] Installing f:\jenkins\jenkins-slave\workspace\maven-box_maven-scm_SCM-797-TSNF7ZXLGM4LUVYJCJU2O25GA4EZKSADD3776FMZEGJH3QG3LZLQ\m\target\maven-scm-1.9.6-SNAPSHOT-site.xml to F:\jenkins\jenkins-slave\workspace\maven-box_maven-scm_SCM-797-TSNF7ZXLGM4LUVYJCJU2O25GA4EZKSADD3776FMZEGJH3QG3LZLQ\m\maven-scm-plugin\target\local-repo\org\apache\maven\scm\maven-scm\1.9.6-SNAPSHOT\maven-scm-1.9.6-SNAPSHOT-site.xml
[windows-jdk9] [INFO] Installing F:\jenkins\jenkins-slave\workspace\maven-box_maven-scm_SCM-797-TSNF7ZXLGM4LUVYJCJU2O25GA4EZKSADD3776FMZEGJH3QG3LZLQ\m\maven-scm-api\pom.xml to F:\jenkins\jenkins-slave\workspace\maven-box_maven-scm_SCM-797-TSNF7ZXLGM4LUVYJCJU2O25GA4EZKSADD3776FMZEGJH3QG3LZLQ\m\maven-scm-plugin\target\local-repo\org\apache\maven\scm\maven-scm-api\1.9.6-SNAPSHOT\maven-scm-api-1.9.6-SNAPSHOT.pom
[windows-jdk9] [INFO] Installing F:\jenkins\jenkins-slave\workspace\maven-box_maven-scm_SCM-797-TSNF7ZXLGM4LUVYJCJU2O25GA4EZKSADD3776FMZEGJH3QG3LZLQ\m\maven-scm-api\target\maven-scm-api-1.9.6-SNAPSHOT.jar to F:\jenkins\jenkins-slave\workspace\maven-box_maven-scm_SCM-797-TSNF7ZXLGM4LUVYJCJU2O25GA4EZKSADD3776FMZEGJH3QG3LZLQ\m\maven-scm-plugin\target\local-repo\org\apache\maven\scm\maven-scm-api\1.9.6-SNAPSHOT\maven-scm-api-1.9.6-SNAPSHOT.jar
[windows-jdk9] [INFO] Installing F:\jenkins\jenkins-slave\workspace\maven-box_maven-scm_SCM-797-TSNF7ZXLGM4LUVYJCJU2O25GA4EZKSADD3776FMZEGJH3QG3LZLQ\m\maven-scm-managers\pom.xml to F:\jenkins\jenkins-slave\workspace\maven-box_maven-scm_SCM-797-TSNF7ZXLGM4LUVYJCJU2O25GA4EZKSADD3776FMZEGJH3QG3LZLQ\m\maven-scm-plugin\target\local-repo\org\apache\maven\scm\maven-scm-managers\1.9.6-SNAPSHOT\maven-scm-managers-1.9.6-SNAPSHOT.pom
[windows-jdk9] [INFO] Installing F:\jenkins\jenkins-slave\workspace\maven-box_maven-scm_SCM-797-TSNF7ZXLGM4LUVYJCJU2O25GA4EZKSADD3776FMZEGJH3QG3LZLQ\m\maven-scm-managers\target\maven-scm-managers-1.9.6-SNAPSHOT-site.xml to F:\jenkins\jenkins-slave\workspace\maven-box_maven-scm_SCM-797-TSNF7ZXLGM4LUVYJCJU2O25GA4EZKSADD3776FMZEGJH3QG3LZLQ\m\maven-scm-plugin\target\local-repo\org\apache\maven\scm\maven-scm-managers\1.9.6-SNAPSHOT\maven-scm-managers-1.9.6-SNAPSHOT-site.xml
[windows-jdk9] [INFO] Installing F:\jenkins\jenkins-slave\workspace\maven-box_maven-scm_SCM-797-TSNF7ZXLGM4LUVYJCJU2O25GA4EZKSADD3776FMZEGJH3QG3LZLQ\m\maven-scm-managers\maven-scm-manager-plexus\pom.xml to F:\jenkins\jenkins-slave\workspace\maven-box_maven-scm_SCM-797-TSNF7ZXLGM4LUVYJCJU2O25GA4EZKSADD3776FMZEGJH3QG3LZLQ\m\maven-scm-plugin\target\local-repo\org\apache\maven\scm\maven-scm-manager-plexus\1.9.6-SNAPSHOT\maven-scm-manager-plexus-1.9.6-SNAPSHOT.pom
[windows-jdk9] [INFO] Installing F:\jenkins\jenkins-slave\workspace\maven-box_maven-scm_SCM-797-TSNF7ZXLGM4LUVYJCJU2O25GA4EZKSADD3776FMZEGJH3QG3LZLQ\m\maven-scm-managers\maven-scm-manager-plexus\target\maven-scm-manager-plexus-1.9.6-SNAPSHOT.jar to F:\jenkins\jenkins-slave\workspace\maven-box_maven-scm_SCM-797-TSNF7ZXLGM4LUVYJCJU2O25GA4EZKSADD3776FMZEGJH3QG3LZLQ\m\maven-scm-plugin\target\local-repo\org\apache\maven\scm\maven-scm-manager-plexus\1.9.6-SNAPSHOT\maven-scm-manager-plexus-1.9.6-SNAPSHOT.jar
[windows-jdk9] [INFO] Installing F:\jenkins\jenkins-slave\workspace\maven-box_maven-scm_SCM-797-TSNF7ZXLGM4LUVYJCJU2O25GA4EZKSADD3776FMZEGJH3QG3LZLQ\m\maven-scm-test\pom.xml to F:\jenkins\jenkins-slave\workspace\maven-box_maven-scm_SCM-797-TSNF7ZXLGM4LUVYJCJU2O25GA4EZKSADD3776FMZEGJH3QG3LZLQ\m\maven-scm-plugin\target\local-repo\org\apache\maven\scm\maven-scm-test\1.9.6-SNAPSHOT\maven-scm-test-1.9.6-SNAPSHOT.pom
[windows-jdk9] [INFO] Installing F:\jenkins\jenkins-slave\workspace\maven-box_maven-scm_SCM-797-TSNF7ZXLGM4LUVYJCJU2O25GA4EZKSADD3776FMZEGJH3QG3LZLQ\m\maven-scm-test\target\maven-scm-test-1.9.6-SNAPSHOT.jar to F:\jenkins\jenkins-slave\workspace\maven-box_maven-scm_SCM-797-TSNF7ZXLGM4LUVYJCJU2O25GA4EZKSADD3776FMZEGJH3QG3LZLQ\m\maven-scm-plugin\target\local-repo\org\apache\maven\scm\maven-scm-test\1.9.6-SNAPSHOT\maven-scm-test-1.9.6-SNAPSHOT.jar
[windows-jdk9] [INFO] Installing F:\jenkins\jenkins-slave\workspace\maven-box_maven-scm_SCM-797-TSNF7ZXLGM4LUVYJCJU2O25GA4EZKSADD3776FMZEGJH3QG3LZLQ\m\maven-scm-providers\pom.xml to F:\jenkins\jenkins-slave\workspace\maven-box_maven-scm_SCM-797-TSNF7ZXLGM4LUVYJCJU2O25GA4EZKSADD3776FMZEGJH3QG3LZLQ\m\maven-scm-plugin\target\local-repo\org\apache\maven\scm\maven-scm-providers\1.9.6-SNAPSHOT\maven-scm-providers-1.9.6-SNAPSHOT.pom
[windows-jdk9] [INFO] Installing F:\jenkins\jenkins-slave\workspace\maven-box_maven-scm_SCM-797-TSNF7ZXLGM4LUVYJCJU2O25GA4EZKSADD3776FMZEGJH3QG3LZLQ\m\maven-scm-providers\target\maven-scm-providers-1.9.6-SNAPSHOT-site.xml to F:\jenkins\jenkins-slave\workspace\maven-box_maven-scm_SCM-797-TSNF7ZXLGM4LUVYJCJU2O25GA4EZKSADD3776FMZEGJH3QG3LZLQ\m\maven-scm-plugin\target\local-repo\org\apache\maven\scm\maven-scm-providers\1.9.6-SNAPSHOT\maven-scm-providers-1.9.6-SNAPSHOT-site.xml
[windows-jdk9] [INFO] Installing F:\jenkins\jenkins-slave\workspace\maven-box_maven-scm_SCM-797-TSNF7ZXLGM4LUVYJCJU2O25GA4EZKSADD3776FMZEGJH3QG3LZLQ\m\maven-scm-providers\maven-scm-provider-accurev\pom.xml to F:\jenkins\jenkins-slave\workspace\maven-box_maven-scm_SCM-797-TSNF7ZXLGM4LUVYJCJU2O25GA4EZKSADD3776FMZEGJH3QG3LZLQ\m\maven-scm-plugin\target\local-repo\org\apache\maven\scm\maven-scm-provider-accurev\1.9.6-SNAPSHOT\maven-scm-provider-accurev-1.9.6-SNAPSHOT.pom
[windows-jdk9] [INFO] Installing F:\jenkins\jenkins-slave\workspace\maven-box_maven-scm_SCM-797-TSNF7ZXLGM4LUVYJCJU2O25GA4EZKSADD3776FMZEGJH3QG3LZLQ\m\maven-scm-providers\maven-scm-provider-accurev\target\maven-scm-provider-accurev-1.9.6-SNAPSHOT.jar to F:\jenkins\jenkins-slave\workspace\maven-box_maven-scm_SCM-797-TSNF7ZXLGM4LUVYJCJU2O25GA4EZKSADD3776FMZEGJH3QG3LZLQ\m\maven-scm-plugin\target\local-repo\org\apache\maven\scm\maven-scm-provider-accurev\1.9.6-SNAPSHOT\maven-scm-provider-accurev-1.9.6-SNAPSHOT.jar
[windows-jdk9] [INFO] Installing F:\jenkins\jenkins-slave\workspace\maven-box_maven-scm_SCM-797-TSNF7ZXLGM4LUVYJCJU2O25GA4EZKSADD3776FMZEGJH3QG3LZLQ\m\maven-scm-providers\maven-scm-provider-bazaar\pom.xml to F:\jenkins\jenkins-slave\workspace\maven-box_maven-scm_SCM-797-TSNF7ZXLGM4LUVYJCJU2O25GA4EZKSADD3776FMZEGJH3QG3LZLQ\m\maven-scm-plugin\target\local-repo\org\apache\maven\scm\maven-scm-provider-bazaar\1.9.6-SNAPSHOT\maven-scm-provider-bazaar-1.9.6-SNAPSHOT.pom
[windows-jdk9] [INFO] Installing F:\jenkins\jenkins-slave\workspace\maven-box_maven-scm_SCM-797-TSNF7ZXLGM4LUVYJCJU2O25GA4EZKSADD3776FMZEGJH3QG3LZLQ\m\maven-scm-providers\maven-scm-provider-bazaar\target\maven-scm-provider-bazaar-1.9.6-SNAPSHOT.jar to F:\jenkins\jenkins-slave\workspace\maven-box_maven-scm_SCM-797-TSNF7ZXLGM4LUVYJCJU2O25GA4EZKSADD3776FMZEGJH3QG3LZLQ\m\maven-scm-plugin\target\local-repo\org\apache\maven\scm\maven-scm-provider-bazaar\1.9.6-SNAPSHOT\maven-scm-provider-bazaar-1.9.6-SNAPSHOT.jar
[windows-jdk9] [INFO] Installing F:\jenkins\jenkins-slave\workspace\maven-box_maven-scm_SCM-797-TSNF7ZXLGM4LUVYJCJU2O25GA4EZKSADD3776FMZEGJH3QG3LZLQ\m\maven-scm-providers\maven-scm-provider-clearcase\pom.xml to F:\jenkins\jenkins-slave\workspace\maven-box_maven-scm_SCM-797-TSNF7ZXLGM4LUVYJCJU2O25GA4EZKSADD3776FMZEGJH3QG3LZLQ\m\maven-scm-plugin\target\local-repo\org\apache\maven\scm\maven-scm-provider-clearcase\1.9.6-SNAPSHOT\maven-scm-provider-clearcase-1.9.6-SNAPSHOT.pom
[windows-jdk9] [INFO] Installing F:\jenkins\jenkins-slave\workspace\maven-box_maven-scm_SCM-797-TSNF7ZXLGM4LUVYJCJU2O25GA4EZKSADD3776FMZEGJH3QG3LZLQ\m\maven-scm-providers\maven-scm-provider-clearcase\target\maven-scm-provider-clearcase-1.9.6-SNAPSHOT.jar to F:\jenkins\jenkins-slave\workspace\maven-box_maven-scm_SCM-797-TSNF7ZXLGM4LUVYJCJU2O25GA4EZKSADD3776FMZEGJH3QG3LZLQ\m\maven-scm-plugin\target\local-repo\org\apache\maven\scm\maven-scm-provider-clearcase\1.9.6-SNAPSHOT\maven-scm-provider-clearcase-1.9.6-SNAPSHOT.jar
[windows-jdk9] [INFO] Installing F:\jenkins\jenkins-slave\workspace\maven-box_maven-scm_SCM-797-TSNF7ZXLGM4LUVYJCJU2O25GA4EZKSADD3776FMZEGJH3QG3LZLQ\m\maven-scm-providers\maven-scm-providers-cvs\pom.xml to F:\jenkins\jenkins-slave\workspace\maven-box_maven-scm_SCM-797-TSNF7ZXLGM4LUVYJCJU2O25GA4EZKSADD3776FMZEGJH3QG3LZLQ\m\maven-scm-plugin\target\local-repo\org\apache\maven\scm\maven-scm-providers-cvs\1.9.6-SNAPSHOT\maven-scm-providers-cvs-1.9.6-SNAPSHOT.pom
[windows-jdk9] [INFO] Installing F:\jenkins\jenkins-slave\workspace\maven-box_maven-scm_SCM-797-TSNF7ZXLGM4LUVYJCJU2O25GA4EZKSADD3776FMZEGJH3QG3LZLQ\m\maven-scm-providers\maven-scm-providers-cvs\target\maven-scm-providers-cvs-1.9.6-SNAPSHOT-site.xml to F:\jenkins\jenkins-slave\workspace\maven-box_maven-scm_SCM-797-TSNF7ZXLGM4LUVYJCJU2O25GA4EZKSADD3776FMZEGJH3QG3LZLQ\m\maven-scm-plugin\target\local-repo\org\apache\maven\scm\maven-scm-providers-cvs\1.9.6-SNAPSHOT\maven-scm-providers-cvs-1.9.6-SNAPSHOT-site.xml
[windows-jdk9] [INFO] Installing F:\jenkins\jenkins-slave\workspace\maven-box_maven-scm_SCM-797-TSNF7ZXLGM4LUVYJCJU2O25GA4EZKSADD3776FMZEGJH3QG3LZLQ\m\maven-scm-providers\maven-scm-providers-cvs\maven-scm-provider-cvstest\pom.xml to F:\jenkins\jenkins-slave\workspace\maven-box_maven-scm_SCM-797-TSNF7ZXLGM4LUVYJCJU2O25GA4EZKSADD3776FMZEGJH3QG3LZLQ\m\maven-scm-plugin\target\local-repo\org\apache\maven\scm\maven-scm-provider-cvstest\1.9.6-SNAPSHOT\maven-scm-provider-cvstest-1.9.6-SNAPSHOT.pom
[windows-jdk9] [INFO] Installing F:\jenkins\jenkins-slave\workspace\maven-box_maven-scm_SCM-797-TSNF7ZXLGM4LUVYJCJU2O25GA4EZKSADD3776FMZEGJH3QG3LZLQ\m\maven-scm-providers\maven-scm-providers-cvs\maven-scm-provider-cvstest\target\maven-scm-provider-cvstest-1.9.6-SNAPSHOT.jar to F:\jenkins\jenkins-slave\workspace\maven-box_maven-scm_SCM-797-TSNF7ZXLGM4LUVYJCJU2O25GA4EZKSADD3776FMZEGJH3QG3LZLQ\m\maven-scm-plugin\target\local-repo\org\apache\maven\scm\maven-scm-provider-cvstest\1.9.6-SNAPSHOT\maven-scm-provider-cvstest-1.9.6-SNAPSHOT.jar
[windows-jdk9] [INFO] Installing F:\jenkins\jenkins-slave\workspace\maven-box_maven-scm_SCM-797-TSNF7ZXLGM4LUVYJCJU2O25GA4EZKSADD3776FMZEGJH3QG3LZLQ\m\maven-scm-providers\maven-scm-providers-cvs\maven-scm-provider-cvs-commons\pom.xml to F:\jenkins\jenkins-slave\workspace\maven-box_maven-scm_SCM-797-TSNF7ZXLGM4LUVYJCJU2O25GA4EZKSADD3776FMZEGJH3QG3LZLQ\m\maven-scm-plugin\target\local-repo\org\apache\maven\scm\maven-scm-provider-cvs-commons\1.9.6-SNAPSHOT\maven-scm-provider-cvs-commons-1.9.6-SNAPSHOT.pom
[windows-jdk9] [INFO] Installing F:\jenkins\jenkins-slave\workspace\maven-box_maven-scm_SCM-797-TSNF7ZXLGM4LUVYJCJU2O25GA4EZKSADD3776FMZEGJH3QG3LZLQ\m\maven-scm-providers\maven-scm-providers-cvs\maven-scm-provider-cvs-commons\target\maven-scm-provider-cvs-commons-1.9.6-SNAPSHOT.jar to F:\jenkins\jenkins-slave\workspace\maven-box_maven-scm_SCM-797-TSNF7ZXLGM4LUVYJCJU2O25GA4EZKSADD3776FMZEGJH3QG3LZLQ\m\maven-scm-plugin\target\local-repo\org\apache\maven\scm\maven-scm-provider-cvs-commons\1.9.6-SNAPSHOT\maven-scm-provider-cvs-commons-1.9.6-SNAPSHOT.jar
[windows-jdk9] [INFO] Installing F:\jenkins\jenkins-slave\workspace\maven-box_maven-scm_SCM-797-TSNF7ZXLGM4LUVYJCJU2O25GA4EZKSADD3776FMZEGJH3QG3LZLQ\m\maven-scm-providers\maven-scm-providers-cvs\maven-scm-provider-cvsexe\pom.xml to F:\jenkins\jenkins-slave\workspace\maven-box_maven-scm_SCM-797-TSNF7ZXLGM4LUVYJCJU2O25GA4EZKSADD3776FMZEGJH3QG3LZLQ\m\maven-scm-plugin\target\local-repo\org\apache\maven\scm\maven-scm-provider-cvsexe\1.9.6-SNAPSHOT\maven-scm-provider-cvsexe-1.9.6-SNAPSHOT.pom
[windows-jdk9] [INFO] Installing F:\jenkins\jenkins-slave\workspace\maven-box_maven-scm_SCM-797-TSNF7ZXLGM4LUVYJCJU2O25GA4EZKSADD3776FMZEGJH3QG3LZLQ\m\maven-scm-providers\maven-scm-providers-cvs\maven-scm-provider-cvsexe\target\maven-scm-provider-cvsexe-1.9.6-SNAPSHOT.jar to F:\jenkins\jenkins-slave\workspace\maven-box_maven-scm_SCM-797-TSNF7ZXLGM4LUVYJCJU2O25GA4EZKSADD3776FMZEGJH3QG3LZLQ\m\maven-scm-plugin\target\local-repo\org\apache\maven\scm\maven-scm-provider-cvsexe\1.9.6-SNAPSHOT\maven-scm-provider-cvsexe-1.9.6-SNAPSHOT.jar
[windows-jdk9] [INFO] Installing F:\jenkins\jenkins-slave\workspace\maven-box_maven-scm_SCM-797-TSNF7ZXLGM4LUVYJCJU2O25GA4EZKSADD3776FMZEGJH3QG3LZLQ\m\maven-scm-providers\maven-scm-providers-cvs\maven-scm-provider-cvsjava\pom.xml to F:\jenkins\jenkins-slave\workspace\maven-box_maven-scm_SCM-797-TSNF7ZXLGM4LUVYJCJU2O25GA4EZKSADD3776FMZEGJH3QG3LZLQ\m\maven-scm-plugin\target\local-repo\org\apache\maven\scm\maven-scm-provider-cvsjava\1.9.6-SNAPSHOT\maven-scm-provider-cvsjava-1.9.6-SNAPSHOT.pom
[windows-jdk9] [INFO] Installing F:\jenkins\jenkins-slave\workspace\maven-box_maven-scm_SCM-797-TSNF7ZXLGM4LUVYJCJU2O25GA4EZKSADD3776FMZEGJH3QG3LZLQ\m\maven-scm-providers\maven-scm-providers-cvs\maven-scm-provider-cvsjava\target\maven-scm-provider-cvsjava-1.9.6-SNAPSHOT.jar to F:\jenkins\jenkins-slave\workspace\maven-box_maven-scm_SCM-797-TSNF7ZXLGM4LUVYJCJU2O25GA4EZKSADD3776FMZEGJH3QG3LZLQ\m\maven-scm-plugin\target\local-repo\org\apache\maven\scm\maven-scm-provider-cvsjava\1.9.6-SNAPSHOT\maven-scm-provider-cvsjava-1.9.6-SNAPSHOT.jar
[windows-jdk9] [INFO] Installing F:\jenkins\jenkins-slave\workspace\maven-box_maven-scm_SCM-797-TSNF7ZXLGM4LUVYJCJU2O25GA4EZKSADD3776FMZEGJH3QG3LZLQ\m\maven-scm-providers\maven-scm-provider-hg\pom.xml to F:\jenkins\jenkins-slave\workspace\maven-box_maven-scm_SCM-797-TSNF7ZXLGM4LUVYJCJU2O25GA4EZKSADD3776FMZEGJH3QG3LZLQ\m\maven-scm-plugin\target\local-repo\org\apache\maven\scm\maven-scm-provider-hg\1.9.6-SNAPSHOT\maven-scm-provider-hg-1.9.6-SNAPSHOT.pom
[windows-jdk9] [INFO] Installing F:\jenkins\jenkins-slave\workspace\maven-box_maven-scm_SCM-797-TSNF7ZXLGM4LUVYJCJU2O25GA4EZKSADD3776FMZEGJH3QG3LZLQ\m\maven-scm-providers\maven-scm-provider-hg\target\maven-scm-provider-hg-1.9.6-SNAPSHOT.jar to F:\jenkins\jenkins-slave\workspace\maven-box_maven-scm_SCM-797-TSNF7ZXLGM4LUVYJCJU2O25GA4EZKSADD3776FMZEGJH3QG3LZLQ\m\maven-scm-plugin\target\local-repo\org\apache\maven\scm\maven-scm-provider-hg\1.9.6-SNAPSHOT\maven-scm-provider-hg-1.9.6-SNAPSHOT.jar
[windows-jdk9] [INFO] Installing F:\jenkins\jenkins-slave\workspace\maven-box_maven-scm_SCM-797-TSNF7ZXLGM4LUVYJCJU2O25GA4EZKSADD3776FMZEGJH3QG3LZLQ\m\maven-scm-providers\maven-scm-providers-git\pom.xml to F:\jenkins\jenkins-slave\workspace\maven-box_maven-scm_SCM-797-TSNF7ZXLGM4LUVYJCJU2O25GA4EZKSADD3776FMZEGJH3QG3LZLQ\m\maven-scm-plugin\target\local-repo\org\apache\maven\scm\maven-scm-providers-git\1.9.6-SNAPSHOT\maven-scm-providers-git-1.9.6-SNAPSHOT.pom
[windows-jdk9] [INFO] Installing F:\jenkins\jenkins-slave\workspace\maven-box_maven-scm_SCM-797-TSNF7ZXLGM4LUVYJCJU2O25GA4EZKSADD3776FMZEGJH3QG3LZLQ\m\maven-scm-providers\maven-scm-providers-git\target\maven-scm-providers-git-1.9.6-SNAPSHOT-site.xml to F:\jenkins\jenkins-slave\workspace\maven-box_maven-scm_SCM-797-TSNF7ZXLGM4LUVYJCJU2O25GA4EZKSADD3776FMZEGJH3QG3LZLQ\m\maven-scm-plugin\target\local-repo\org\apache\maven\scm\maven-scm-providers-git\1.9.6-SNAPSHOT\maven-scm-providers-git-1.9.6-SNAPSHOT-site.xml
[windows-jdk9] [INFO] Installing F:\jenkins\jenkins-slave\workspace\maven-box_maven-scm_SCM-797-TSNF7ZXLGM4LUVYJCJU2O25GA4EZKSADD3776FMZEGJH3QG3LZLQ\m\maven-scm-providers\maven-scm-providers-git\maven-scm-provider-git-commons\pom.xml to F:\jenkins\jenkins-slave\workspace\maven-box_maven-scm_SCM-797-TSNF7ZXLGM4LUVYJCJU2O25GA4EZKSADD3776FMZEGJH3QG3LZLQ\m\maven-scm-plugin\target\local-repo\org\apache\maven\scm\maven-scm-provider-git-commons\1.9.6-SNAPSHOT\maven-scm-provider-git-commons-1.9.6-SNAPSHOT.pom
[windows-jdk9] [INFO] Installing F:\jenkins\jenkins-slave\workspace\maven-box_maven-scm_SCM-797-TSNF7ZXLGM4LUVYJCJU2O25GA4EZKSADD3776FMZEGJH3QG3LZLQ\m\maven-scm-providers\maven-scm-providers-git\maven-scm-provider-git-commons\target\maven-scm-provider-git-commons-1.9.6-SNAPSHOT.jar to F:\jenkins\jenkins-slave\workspace\maven-box_maven-scm_SCM-797-TSNF7ZXLGM4LUVYJCJU2O25GA4EZKSADD3776FMZEGJH3QG3LZLQ\m\maven-scm-plugin\target\local-repo\org\apache\maven\scm\maven-scm-provider-git-commons\1.9.6-SNAPSHOT\maven-scm-provider-git-commons-1.9.6-SNAPSHOT.jar
[windows-jdk9] [INFO] Installing F:\jenkins\jenkins-slave\workspace\maven-box_maven-scm_SCM-797-TSNF7ZXLGM4LUVYJCJU2O25GA4EZKSADD3776FMZEGJH3QG3LZLQ\m\maven-scm-providers\maven-scm-providers-git\maven-scm-provider-gittest\pom.xml to F:\jenkins\jenkins-slave\workspace\maven-box_maven-scm_SCM-797-TSNF7ZXLGM4LUVYJCJU2O25GA4EZKSADD3776FMZEGJH3QG3LZLQ\m\maven-scm-plugin\target\local-repo\org\apache\maven\scm\maven-scm-provider-gittest\1.9.6-SNAPSHOT\maven-scm-provider-gittest-1.9.6-SNAPSHOT.pom
[windows-jdk9] [INFO] Installing F:\jenkins\jenkins-slave\workspace\maven-box_maven-scm_SCM-797-TSNF7ZXLGM4LUVYJCJU2O25GA4EZKSADD3776FMZEGJH3QG3LZLQ\m\maven-scm-providers\maven-scm-providers-git\maven-scm-provider-gittest\target\maven-scm-provider-gittest-1.9.6-SNAPSHOT.jar to F:\jenkins\jenkins-slave\workspace\maven-box_maven-scm_SCM-797-TSNF7ZXLGM4LUVYJCJU2O25GA4EZKSADD3776FMZEGJH3QG3LZLQ\m\maven-scm-plugin\target\local-repo\org\apache\maven\scm\maven-scm-provider-gittest\1.9.6-SNAPSHOT\maven-scm-provider-gittest-1.9.6-SNAPSHOT.jar
[windows-jdk9] [INFO] Installing F:\jenkins\jenkins-slave\workspace\maven-box_maven-scm_SCM-797-TSNF7ZXLGM4LUVYJCJU2O25GA4EZKSADD3776FMZEGJH3QG3LZLQ\m\maven-scm-providers\maven-scm-providers-git\maven-scm-provider-gitexe\pom.xml to F:\jenkins\jenkins-slave\workspace\maven-box_maven-scm_SCM-797-TSNF7ZXLGM4LUVYJCJU2O25GA4EZKSADD3776FMZEGJH3QG3LZLQ\m\maven-scm-plugin\target\local-repo\org\apache\maven\scm\maven-scm-provider-gitexe\1.9.6-SNAPSHOT\maven-scm-provider-gitexe-1.9.6-SNAPSHOT.pom
[windows-jdk9] [INFO] Installing F:\jenkins\jenkins-slave\workspace\maven-box_maven-scm_SCM-797-TSNF7ZXLGM4LUVYJCJU2O25GA4EZKSADD3776FMZEGJH3QG3LZLQ\m\maven-scm-providers\maven-scm-providers-git\maven-scm-provider-gitexe\target\maven-scm-provider-gitexe-1.9.6-SNAPSHOT.jar to F:\jenkins\jenkins-slave\workspace\maven-box_maven-scm_SCM-797-TSNF7ZXLGM4LUVYJCJU2O25GA4EZKSADD3776FMZEGJH3QG3LZLQ\m\maven-scm-plugin\target\local-repo\org\apache\maven\scm\maven-scm-provider-gitexe\1.9.6-SNAPSHOT\maven-scm-provider-gitexe-1.9.6-SNAPSHOT.jar
[windows-jdk9] [INFO] Installing F:\jenkins\jenkins-slave\workspace\maven-box_maven-scm_SCM-797-TSNF7ZXLGM4LUVYJCJU2O25GA4EZKSADD3776FMZEGJH3QG3LZLQ\m\maven-scm-providers\maven-scm-providers-git\maven-scm-provider-jgit\pom.xml to F:\jenkins\jenkins-slave\workspace\maven-box_maven-scm_SCM-797-TSNF7ZXLGM4LUVYJCJU2O25GA4EZKSADD3776FMZEGJH3QG3LZLQ\m\maven-scm-plugin\target\local-repo\org\apache\maven\scm\maven-scm-provider-jgit\1.9.6-SNAPSHOT\maven-scm-provider-jgit-1.9.6-SNAPSHOT.pom
[windows-jdk9] [INFO] Installing F:\jenkins\jenkins-slave\workspace\maven-box_maven-scm_SCM-797-TSNF7ZXLGM4LUVYJCJU2O25GA4EZKSADD3776FMZEGJH3QG3LZLQ\m\maven-scm-providers\maven-scm-providers-git\maven-scm-provider-jgit\target\maven-scm-provider-jgit-1.9.6-SNAPSHOT.jar to F:\jenkins\jenkins-slave\workspace\maven-box_maven-scm_SCM-797-TSNF7ZXLGM4LUVYJCJU2O25GA4EZKSADD3776FMZEGJH3QG3LZLQ\m\maven-scm-plugin\target\local-repo\org\apache\maven\scm\maven-scm-provider-jgit\1.9.6-SNAPSHOT\maven-scm-provider-jgit-1.9.6-SNAPSHOT.jar
[windows-jdk9] [INFO] Installing F:\jenkins\jenkins-slave\workspace\maven-box_maven-scm_SCM-797-TSNF7ZXLGM4LUVYJCJU2O25GA4EZKSADD3776FMZEGJH3QG3LZLQ\m\maven-scm-providers\maven-scm-provider-local\pom.xml to F:\jenkins\jenkins-slave\workspace\maven-box_maven-scm_SCM-797-TSNF7ZXLGM4LUVYJCJU2O25GA4EZKSADD3776FMZEGJH3QG3LZLQ\m\maven-scm-plugin\target\local-repo\org\apache\maven\scm\maven-scm-provider-local\1.9.6-SNAPSHOT\maven-scm-provider-local-1.9.6-SNAPSHOT.pom
[windows-jdk9] [INFO] Installing F:\jenkins\jenkins-slave\workspace\maven-box_maven-scm_SCM-797-TSNF7ZXLGM4LUVYJCJU2O25GA4EZKSADD3776FMZEGJH3QG3LZLQ\m\maven-scm-providers\maven-scm-provider-local\target\maven-scm-provider-local-1.9.6-SNAPSHOT.jar to F:\jenkins\jenkins-slave\workspace\maven-box_maven-scm_SCM-797-TSNF7ZXLGM4LUVYJCJU2O25GA4EZKSADD3776FMZEGJH3QG3LZLQ\m\maven-scm-plugin\target\local-repo\org\apache\maven\scm\maven-scm-provider-local\1.9.6-SNAPSHOT\maven-scm-provider-local-1.9.6-SNAPSHOT.jar
[windows-jdk9] [INFO] Installing F:\jenkins\jenkins-slave\workspace\maven-box_maven-scm_SCM-797-TSNF7ZXLGM4LUVYJCJU2O25GA4EZKSADD3776FMZEGJH3QG3LZLQ\m\maven-scm-providers\maven-scm-provider-perforce\pom.xml to F:\jenkins\jenkins-slave\workspace\maven-box_maven-scm_SCM-797-TSNF7ZXLGM4LUVYJCJU2O25GA4EZKSADD3776FMZEGJH3QG3LZLQ\m\maven-scm-plugin\target\local-repo\org\apache\maven\scm\maven-scm-provider-perforce\1.9.6-SNAPSHOT\maven-scm-provider-perforce-1.9.6-SNAPSHOT.pom
[windows-jdk9] [INFO] Installing F:\jenkins\jenkins-slave\workspace\maven-box_maven-scm_SCM-797-TSNF7ZXLGM4LUVYJCJU2O25GA4EZKSADD3776FMZEGJH3QG3LZLQ\m\maven-scm-providers\maven-scm-provider-perforce\target\maven-scm-provider-perforce-1.9.6-SNAPSHOT.jar to F:\jenkins\jenkins-slave\workspace\maven-box_maven-scm_SCM-797-TSNF7ZXLGM4LUVYJCJU2O25GA4EZKSADD3776FMZEGJH3QG3LZLQ\m\maven-scm-plugin\target\local-repo\org\apache\maven\scm\maven-scm-provider-perforce\1.9.6-SNAPSHOT\maven-scm-provider-perforce-1.9.6-SNAPSHOT.jar
[windows-jdk9] [INFO] Installing F:\jenkins\jenkins-slave\workspace\maven-box_maven-scm_SCM-797-TSNF7ZXLGM4LUVYJCJU2O25GA4EZKSADD3776FMZEGJH3QG3LZLQ\m\maven-scm-providers\maven-scm-provider-starteam\pom.xml to F:\jenkins\jenkins-slave\workspace\maven-box_maven-scm_SCM-797-TSNF7ZXLGM4LUVYJCJU2O25GA4EZKSADD3776FMZEGJH3QG3LZLQ\m\maven-scm-plugin\target\local-repo\org\apache\maven\scm\maven-scm-provider-starteam\1.9.6-SNAPSHOT\maven-scm-provider-starteam-1.9.6-SNAPSHOT.pom
[windows-jdk9] [INFO] Installing F:\jenkins\jenkins-slave\workspace\maven-box_maven-scm_SCM-797-TSNF7ZXLGM4LUVYJCJU2O25GA4EZKSADD3776FMZEGJH3QG3LZLQ\m\maven-scm-providers\maven-scm-provider-starteam\target\maven-scm-provider-starteam-1.9.6-SNAPSHOT.jar to F:\jenkins\jenkins-slave\workspace\maven-box_maven-scm_SCM-797-TSNF7ZXLGM4LUVYJCJU2O25GA4EZKSADD3776FMZEGJH3QG3LZLQ\m\maven-scm-plugin\target\local-repo\org\apache\maven\scm\maven-scm-provider-starteam\1.9.6-SNAPSHOT\maven-scm-provider-starteam-1.9.6-SNAPSHOT.jar
[windows-jdk9] [INFO] Installing F:\jenkins\jenkins-slave\workspace\maven-box_maven-scm_SCM-797-TSNF7ZXLGM4LUVYJCJU2O25GA4EZKSADD3776FMZEGJH3QG3LZLQ\m\maven-scm-providers\maven-scm-providers-svn\pom.xml to F:\jenkins\jenkins-slave\workspace\maven-box_maven-scm_SCM-797-TSNF7ZXLGM4LUVYJCJU2O25GA4EZKSADD3776FMZEGJH3QG3LZLQ\m\maven-scm-plugin\target\local-repo\org\apache\maven\scm\maven-scm-providers-svn\1.9.6-SNAPSHOT\maven-scm-providers-svn-1.9.6-SNAPSHOT.pom
[windows-jdk9] [INFO] Installing F:\jenkins\jenkins-slave\workspace\maven-box_maven-scm_SCM-797-TSNF7ZXLGM4LUVYJCJU2O25GA4EZKSADD3776FMZEGJH3QG3LZLQ\m\maven-scm-providers\maven-scm-providers-svn\target\maven-scm-providers-svn-1.9.6-SNAPSHOT-site.xml to F:\jenkins\jenkins-slave\workspace\maven-box_maven-scm_SCM-797-TSNF7ZXLGM4LUVYJCJU2O25GA4EZKSADD3776FMZEGJH3QG3LZLQ\m\maven-scm-plugin\target\local-repo\org\apache\maven\scm\maven-scm-providers-svn\1.9.6-SNAPSHOT\maven-scm-providers-svn-1.9.6-SNAPSHOT-site.xml
[windows-jdk9] [INFO] Installing F:\jenkins\jenkins-slave\workspace\maven-box_maven-scm_SCM-797-TSNF7ZXLGM4LUVYJCJU2O25GA4EZKSADD3776FMZEGJH3QG3LZLQ\m\maven-scm-providers\maven-scm-providers-svn\maven-scm-provider-svn-commons\pom.xml to F:\jenkins\jenkins-slave\workspace\maven-box_maven-scm_SCM-797-TSNF7ZXLGM4LUVYJCJU2O25GA4EZKSADD3776FMZEGJH3QG3LZLQ\m\maven-scm-plugin\target\local-repo\org\apache\maven\scm\maven-scm-provider-svn-commons\1.9.6-SNAPSHOT\maven-scm-provider-svn-commons-1.9.6-SNAPSHOT.pom
[windows-jdk9] [INFO] Installing F:\jenkins\jenkins-slave\workspace\maven-box_maven-scm_SCM-797-TSNF7ZXLGM4LUVYJCJU2O25GA4EZKSADD3776FMZEGJH3QG3LZLQ\m\maven-scm-providers\maven-scm-providers-svn\maven-scm-provider-svn-commons\target\maven-scm-provider-svn-commons-1.9.6-SNAPSHOT.jar to F:\jenkins\jenkins-slave\workspace\maven-box_maven-scm_SCM-797-TSNF7ZXLGM4LUVYJCJU2O25GA4EZKSADD3776FMZEGJH3QG3LZLQ\m\maven-scm-plugin\target\local-repo\org\apache\maven\scm\maven-scm-provider-svn-commons\1.9.6-SNAPSHOT\maven-scm-provider-svn-commons-1.9.6-SNAPSHOT.jar
[windows-jdk9] [INFO] Installing F:\jenkins\jenkins-slave\workspace\maven-box_maven-scm_SCM-797-TSNF7ZXLGM4LUVYJCJU2O25GA4EZKSADD3776FMZEGJH3QG3LZLQ\m\maven-scm-providers\maven-scm-providers-svn\maven-scm-provider-svntest\pom.xml to F:\jenkins\jenkins-slave\workspace\maven-box_maven-scm_SCM-797-TSNF7ZXLGM4LUVYJCJU2O25GA4EZKSADD3776FMZEGJH3QG3LZLQ\m\maven-scm-plugin\target\local-repo\org\apache\maven\scm\maven-scm-provider-svntest\1.9.6-SNAPSHOT\maven-scm-provider-svntest-1.9.6-SNAPSHOT.pom
[windows-jdk9] [INFO] Installing F:\jenkins\jenkins-slave\workspace\maven-box_maven-scm_SCM-797-TSNF7ZXLGM4LUVYJCJU2O25GA4EZKSADD3776FMZEGJH3QG3LZLQ\m\maven-scm-providers\maven-scm-providers-svn\maven-scm-provider-svntest\target\maven-scm-provider-svntest-1.9.6-SNAPSHOT.jar to F:\jenkins\jenkins-slave\workspace\maven-box_maven-scm_SCM-797-TSNF7ZXLGM4LUVYJCJU2O25GA4EZKSADD3776FMZEGJH3QG3LZLQ\m\maven-scm-plugin\target\local-repo\org\apache\maven\scm\maven-scm-provider-svntest\1.9.6-SNAPSHOT\maven-scm-provider-svntest-1.9.6-SNAPSHOT.jar
[windows-jdk9] [INFO] Installing F:\jenkins\jenkins-slave\workspace\maven-box_maven-scm_SCM-797-TSNF7ZXLGM4LUVYJCJU2O25GA4EZKSADD3776FMZEGJH3QG3LZLQ\m\maven-scm-providers\maven-scm-providers-svn\maven-scm-provider-svnexe\pom.xml to F:\jenkins\jenkins-slave\workspace\maven-box_maven-scm_SCM-797-TSNF7ZXLGM4LUVYJCJU2O25GA4EZKSADD3776FMZEGJH3QG3LZLQ\m\maven-scm-plugin\target\local-repo\org\apache\maven\scm\maven-scm-provider-svnexe\1.9.6-SNAPSHOT\maven-scm-provider-svnexe-1.9.6-SNAPSHOT.pom
[windows-jdk9] [INFO] Installing F:\jenkins\jenkins-slave\workspace\maven-box_maven-scm_SCM-797-TSNF7ZXLGM4LUVYJCJU2O25GA4EZKSADD3776FMZEGJH3QG3LZLQ\m\maven-scm-providers\maven-scm-providers-svn\maven-scm-provider-svnexe\target\maven-scm-provider-svnexe-1.9.6-SNAPSHOT.jar to F:\jenkins\jenkins-slave\workspace\maven-box_maven-scm_SCM-797-TSNF7ZXLGM4LUVYJCJU2O25GA4EZKSADD3776FMZEGJH3QG3LZLQ\m\maven-scm-plugin\target\local-repo\org\apache\maven\scm\maven-scm-provider-svnexe\1.9.6-SNAPSHOT\maven-scm-provider-svnexe-1.9.6-SNAPSHOT.jar
[windows-jdk9] [INFO] Installing F:\jenkins\jenkins-slave\workspace\maven-box_maven-scm_SCM-797-TSNF7ZXLGM4LUVYJCJU2O25GA4EZKSADD3776FMZEGJH3QG3LZLQ\m\maven-scm-providers\maven-scm-provider-synergy\pom.xml to F:\jenkins\jenkins-slave\workspace\maven-box_maven-scm_SCM-797-TSNF7ZXLGM4LUVYJCJU2O25GA4EZKSADD3776FMZEGJH3QG3LZLQ\m\maven-scm-plugin\target\local-repo\org\apache\maven\scm\maven-scm-provider-synergy\1.9.6-SNAPSHOT\maven-scm-provider-synergy-1.9.6-SNAPSHOT.pom
[windows-jdk9] [INFO] Installing F:\jenkins\jenkins-slave\workspace\maven-box_maven-scm_SCM-797-TSNF7ZXLGM4LUVYJCJU2O25GA4EZKSADD3776FMZEGJH3QG3LZLQ\m\maven-scm-providers\maven-scm-provider-synergy\target\maven-scm-provider-synergy-1.9.6-SNAPSHOT.jar to F:\jenkins\jenkins-slave\workspace\maven-box_maven-scm_SCM-797-TSNF7ZXLGM4LUVYJCJU2O25GA4EZKSADD3776FMZEGJH3QG3LZLQ\m\maven-scm-plugin\target\local-repo\org\apache\maven\scm\maven-scm-provider-synergy\1.9.6-SNAPSHOT\maven-scm-provider-synergy-1.9.6-SNAPSHOT.jar
[windows-jdk9] [INFO] Installing F:\jenkins\jenkins-slave\workspace\maven-box_maven-scm_SCM-797-TSNF7ZXLGM4LUVYJCJU2O25GA4EZKSADD3776FMZEGJH3QG3LZLQ\m\maven-scm-providers\maven-scm-provider-vss\pom.xml to F:\jenkins\jenkins-slave\workspace\maven-box_maven-scm_SCM-797-TSNF7ZXLGM4LUVYJCJU2O25GA4EZKSADD3776FMZEGJH3QG3LZLQ\m\maven-scm-plugin\target\local-repo\org\apache\maven\scm\maven-scm-provider-vss\1.9.6-SNAPSHOT\maven-scm-provider-vss-1.9.6-SNAPSHOT.pom
[windows-jdk9] [INFO] Installing F:\jenkins\jenkins-slave\workspace\maven-box_maven-scm_SCM-797-TSNF7ZXLGM4LUVYJCJU2O25GA4EZKSADD3776FMZEGJH3QG3LZLQ\m\maven-scm-providers\maven-scm-provider-vss\target\maven-scm-provider-vss-1.9.6-SNAPSHOT.jar to F:\jenkins\jenkins-slave\workspace\maven-box_maven-scm_SCM-797-TSNF7ZXLGM4LUVYJCJU2O25GA4EZKSADD3776FMZEGJH3QG3LZLQ\m\maven-scm-plugin\target\local-repo\org\apache\maven\scm\maven-scm-provider-vss\1.9.6-SNAPSHOT\maven-scm-provider-vss-1.9.6-SNAPSHOT.jar
[windows-jdk9] [INFO] Installing F:\jenkins\jenkins-slave\workspace\maven-box_maven-scm_SCM-797-TSNF7ZXLGM4LUVYJCJU2O25GA4EZKSADD3776FMZEGJH3QG3LZLQ\m\maven-scm-providers\maven-scm-provider-tfs\pom.xml to F:\jenkins\jenkins-slave\workspace\maven-box_maven-scm_SCM-797-TSNF7ZXLGM4LUVYJCJU2O25GA4EZKSADD3776FMZEGJH3QG3LZLQ\m\maven-scm-plugin\target\local-repo\org\apache\maven\scm\maven-scm-provider-tfs\1.9.6-SNAPSHOT\maven-scm-provider-tfs-1.9.6-SNAPSHOT.pom
[windows-jdk9] [INFO] Installing F:\jenkins\jenkins-slave\workspace\maven-box_maven-scm_SCM-797-TSNF7ZXLGM4LUVYJCJU2O25GA4EZKSADD3776FMZEGJH3QG3LZLQ\m\maven-scm-providers\maven-scm-provider-tfs\target\maven-scm-provider-tfs-1.9.6-SNAPSHOT.jar to F:\jenkins\jenkins-slave\workspace\maven-box_maven-scm_SCM-797-TSNF7ZXLGM4LUVYJCJU2O25GA4EZKSADD3776FMZEGJH3QG3LZLQ\m\maven-scm-plugin\target\local-repo\org\apache\maven\scm\maven-scm-provider-tfs\1.9.6-SNAPSHOT\maven-scm-provider-tfs-1.9.6-SNAPSHOT.jar
[windows-jdk9] [INFO] Installing F:\jenkins\jenkins-slave\workspace\maven-box_maven-scm_SCM-797-TSNF7ZXLGM4LUVYJCJU2O25GA4EZKSADD3776FMZEGJH3QG3LZLQ\m\maven-scm-providers\maven-scm-provider-integrity\pom.xml to F:\jenkins\jenkins-slave\workspace\maven-box_maven-scm_SCM-797-TSNF7ZXLGM4LUVYJCJU2O25GA4EZKSADD3776FMZEGJH3QG3LZLQ\m\maven-scm-plugin\target\local-repo\org\apache\maven\scm\maven-scm-provider-integrity\1.9.6-SNAPSHOT\maven-scm-provider-integrity-1.9.6-SNAPSHOT.pom
[windows-jdk9] [INFO] Installing F:\jenkins\jenkins-slave\workspace\maven-box_maven-scm_SCM-797-TSNF7ZXLGM4LUVYJCJU2O25GA4EZKSADD3776FMZEGJH3QG3LZLQ\m\maven-scm-providers\maven-scm-provider-integrity\target\maven-scm-provider-integrity-1.9.6-SNAPSHOT.jar to F:\jenkins\jenkins-slave\workspace\maven-box_maven-scm_SCM-797-TSNF7ZXLGM4LUVYJCJU2O25GA4EZKSADD3776FMZEGJH3QG3LZLQ\m\maven-scm-plugin\target\local-repo\org\apache\maven\scm\maven-scm-provider-integrity\1.9.6-SNAPSHOT\maven-scm-provider-integrity-1.9.6-SNAPSHOT.jar
[windows-jdk9] [INFO] Installing F:\jenkins\jenkins-slave\workspace\maven-box_maven-scm_SCM-797-TSNF7ZXLGM4LUVYJCJU2O25GA4EZKSADD3776FMZEGJH3QG3LZLQ\m\maven-scm-providers\maven-scm-provider-jazz\pom.xml to F:\jenkins\jenkins-slave\workspace\maven-box_maven-scm_SCM-797-TSNF7ZXLGM4LUVYJCJU2O25GA4EZKSADD3776FMZEGJH3QG3LZLQ\m\maven-scm-plugin\target\local-repo\org\apache\maven\scm\maven-scm-provider-jazz\1.9.6-SNAPSHOT\maven-scm-provider-jazz-1.9.6-SNAPSHOT.pom
[windows-jdk9] [INFO] Installing F:\jenkins\jenkins-slave\workspace\maven-box_maven-scm_SCM-797-TSNF7ZXLGM4LUVYJCJU2O25GA4EZKSADD3776FMZEGJH3QG3LZLQ\m\maven-scm-providers\maven-scm-provider-jazz\target\maven-scm-provider-jazz-1.9.6-SNAPSHOT.jar to F:\jenkins\jenkins-slave\workspace\maven-box_maven-scm_SCM-797-TSNF7ZXLGM4LUVYJCJU2O25GA4EZKSADD3776FMZEGJH3QG3LZLQ\m\maven-scm-plugin\target\local-repo\org\apache\maven\scm\maven-scm-provider-jazz\1.9.6-SNAPSHOT\maven-scm-provider-jazz-1.9.6-SNAPSHOT.jar
[windows-jdk9] [INFO] Installing F:\jenkins\jenkins-slave\workspace\maven-box_maven-scm_SCM-797-TSNF7ZXLGM4LUVYJCJU2O25GA4EZKSADD3776FMZEGJH3QG3LZLQ\m\maven-scm-providers\maven-scm-providers-standard\pom.xml to F:\jenkins\jenkins-slave\workspace\maven-box_maven-scm_SCM-797-TSNF7ZXLGM4LUVYJCJU2O25GA4EZKSADD3776FMZEGJH3QG3LZLQ\m\maven-scm-plugin\target\local-repo\org\apache\maven\scm\maven-scm-providers-standard\1.9.6-SNAPSHOT\maven-scm-providers-standard-1.9.6-SNAPSHOT.pom
[windows-jdk9] [INFO] Installing F:\jenkins\jenkins-slave\workspace\maven-box_maven-scm_SCM-797-TSNF7ZXLGM4LUVYJCJU2O25GA4EZKSADD3776FMZEGJH3QG3LZLQ\m\maven-scm-client\pom.xml to F:\jenkins\jenkins-slave\workspace\maven-box_maven-scm_SCM-797-TSNF7ZXLGM4LUVYJCJU2O25GA4EZKSADD3776FMZEGJH3QG3LZLQ\m\maven-scm-plugin\target\local-repo\org\apache\maven\scm\maven-scm-client\1.9.6-SNAPSHOT\maven-scm-client-1.9.6-SNAPSHOT.pom
[windows-jdk9] [INFO] Installing F:\jenkins\jenkins-slave\workspace\maven-box_maven-scm_SCM-797-TSNF7ZXLGM4LUVYJCJU2O25GA4EZKSADD3776FMZEGJH3QG3LZLQ\m\maven-scm-client\target\maven-scm-client-1.9.6-SNAPSHOT.jar to F:\jenkins\jenkins-slave\workspace\maven-box_maven-scm_SCM-797-TSNF7ZXLGM4LUVYJCJU2O25GA4EZKSADD3776FMZEGJH3QG3LZLQ\m\maven-scm-plugin\target\local-repo\org\apache\maven\scm\maven-scm-client\1.9.6-SNAPSHOT\maven-scm-client-1.9.6-SNAPSHOT.jar
[windows-jdk9] [INFO] Installing F:\jenkins\jenkins-slave\workspace\maven-box_maven-scm_SCM-797-TSNF7ZXLGM4LUVYJCJU2O25GA4EZKSADD3776FMZEGJH3QG3LZLQ\m\maven-scm-client\target\maven-scm-client-1.9.6-SNAPSHOT-jar-with-dependencies.jar to F:\jenkins\jenkins-slave\workspace\maven-box_maven-scm_SCM-797-TSNF7ZXLGM4LUVYJCJU2O25GA4EZKSADD3776FMZEGJH3QG3LZLQ\m\maven-scm-plugin\target\local-repo\org\apache\maven\scm\maven-scm-client\1.9.6-SNAPSHOT\maven-scm-client-1.9.6-SNAPSHOT-jar-with-dependencies.jar
[windows-jdk9] [INFO] Installing F:\jenkins\jenkins-slave\workspace\maven-box_maven-scm_SCM-797-TSNF7ZXLGM4LUVYJCJU2O25GA4EZKSADD3776FMZEGJH3QG3LZLQ\m\maven-scm-plugin\pom.xml to F:\jenkins\jenkins-slave\workspace\maven-box_maven-scm_SCM-797-TSNF7ZXLGM4LUVYJCJU2O25GA4EZKSADD3776FMZEGJH3QG3LZLQ\m\maven-scm-plugin\target\local-repo\org\apache\maven\plugins\maven-scm-plugin\1.9.6-SNAPSHOT\maven-scm-plugin-1.9.6-SNAPSHOT.pom
[windows-jdk9] [INFO] Installing F:\jenkins\jenkins-slave\workspace\maven-box_maven-scm_SCM-797-TSNF7ZXLGM4LUVYJCJU2O25GA4EZKSADD3776FMZEGJH3QG3LZLQ\m\maven-scm-plugin\target\maven-scm-plugin-1.9.6-SNAPSHOT.jar to F:\jenkins\jenkins-slave\workspace\maven-box_maven-scm_SCM-797-TSNF7ZXLGM4LUVYJCJU2O25GA4EZKSADD3776FMZEGJH3QG3LZLQ\m\maven-scm-plugin\target\local-repo\org\apache\maven\plugins\maven-scm-plugin\1.9.6-SNAPSHOT\maven-scm-plugin-1.9.6-SNAPSHOT.jar
[windows-jdk9] [INFO]
[windows-jdk9] [INFO] --- maven-invoker-plugin:2.0.0:run (integration-test) @ maven-scm-plugin ---
[windows-jdk9] [INFO] No projects were selected for execution.
[windows-jdk9] [INFO]
[windows-jdk9] [INFO] --- maven-checkstyle-plugin:2.15:check (checkstyle-check) @ maven-scm-plugin ---
[windows-jdk9] [INFO] There are 5 errors reported by Checkstyle 6.1.1 with config/maven_checks.xml ruleset.
[windows-jdk9] [ERROR] src\main\java\org\apache\maven\scm\plugin\BootstrapMojo.java[3] (header) RegexpHeader: Line does not match expected header line of '^/\*\s*$'.
[windows-jdk9] [ERROR] src\main\java\org\apache\maven\scm\plugin\BootstrapMojo.java[72:53] (whitespace) WhitespaceAround: '=' is not preceded with whitespace.
[windows-jdk9] [ERROR] src\main\java\org\apache\maven\scm\plugin\BootstrapMojo.java[72:54] (whitespace) WhitespaceAround: '=' is not followed by whitespace.
[windows-jdk9] [ERROR] src\main\java\org\apache\maven\scm\plugin\BootstrapMojo.java[72:69] (whitespace) ParenPad: ')' is not preceded with whitespace.
[windows-jdk9] [ERROR] src\main\java\org\apache\maven\scm\plugin\BootstrapMojo.java[120:39] (whitespace) WhitespaceAfter: ';' is not followed by whitespace.
[windows-jdk9] [WARNING] checkstyle:check violations detected but failOnViolation set to false
[windows-jdk9] [INFO] ------------------------------------------------------------------------
[windows-jdk9] [INFO] Reactor Summary:
[windows-jdk9] [INFO]
[windows-jdk9] [INFO] Maven SCM .......................................... SUCCESS [ 34.787 s]
[windows-jdk9] [INFO] Maven SCM API ...................................... SUCCESS [ 11.877 s]
[windows-jdk9] [INFO] Maven SCM Managers ................................. SUCCESS [ 0.903 s]
[windows-jdk9] [INFO] Maven SCM Manager for Plexus ....................... SUCCESS [ 3.581 s]
[windows-jdk9] [INFO] Maven SCM Test ..................................... SUCCESS [ 3.562 s]
[windows-jdk9] [INFO] Maven SCM Providers ................................ SUCCESS [ 1.101 s]
[windows-jdk9] [INFO] Maven SCM AccuRev Provider ......................... SUCCESS [ 8.661 s]
[windows-jdk9] [INFO] Maven SCM Bazaar Provider .......................... SUCCESS [ 5.174 s]
[windows-jdk9] [INFO] Maven SCM Clearcase Provider ....................... SUCCESS [ 8.241 s]
[windows-jdk9] [INFO] Maven SCM CVS Provider - Parent .................... SUCCESS [ 1.061 s]
[windows-jdk9] [INFO] Maven SCM CVS Provider TCK tests ................... SUCCESS [ 1.950 s]
[windows-jdk9] [INFO] Maven SCM CVS Provider - Common library ............ SUCCESS [ 4.680 s]
[windows-jdk9] [INFO] Maven SCM CVS Provider - CVS Executable Impl. ...... SUCCESS [ 4.221 s]
[windows-jdk9] [INFO] Maven SCM CVS Provider - CVS Java Impl. ............ SUCCESS [ 4.306 s]
[windows-jdk9] [INFO] Maven SCM Mercurial (Hg) Provider .................. SUCCESS [ 3.812 s]
[windows-jdk9] [INFO] Maven SCM Git Provider - Parent .................... SUCCESS [ 0.918 s]
[windows-jdk9] [INFO] Maven SCM Git Provider - Common library ............ SUCCESS [ 3.898 s]
[windows-jdk9] [INFO] Maven SCM Git Provider TCK Tests ................... SUCCESS [ 1.623 s]
[windows-jdk9] [INFO] Maven SCM Git Provider - Git Executable Impl. ...... SUCCESS [ 6.608 s]
[windows-jdk9] [INFO] Maven SCM Git Provider - JGit Impl. ................ SUCCESS [ 42.847 s]
[windows-jdk9] [INFO] Maven SCM Local Provider ........................... SUCCESS [ 3.827 s]
[windows-jdk9] [INFO] Maven SCM Perforce Provider ........................ SUCCESS [ 5.955 s]
[windows-jdk9] [INFO] Maven SCM Starteam Provider ........................ SUCCESS [ 6.177 s]
[windows-jdk9] [INFO] Maven SCM Subversion Provider - Parent ............. SUCCESS [ 0.900 s]
[windows-jdk9] [INFO] Maven SCM Subversion Provider - Common library ..... SUCCESS [ 3.821 s]
[windows-jdk9] [INFO] Maven SCM Subversion Provider TCK Tests ............ SUCCESS [ 1.527 s]
[windows-jdk9] [INFO] Maven SCM Subversion Provider - SVN Executable Impl. SUCCESS [ 7.475 s]
[windows-jdk9] [INFO] Maven SCM Synergy Provider ......................... SUCCESS [ 4.680 s]
[windows-jdk9] [INFO] Maven SCM Visual Source Safe Provider .............. SUCCESS [ 7.885 s]
[windows-jdk9] [INFO] Maven SCM TFS Provider ............................. SUCCESS [ 4.001 s]
[windows-jdk9] [INFO] Maven SCM MKS Integrity Provider ................... SUCCESS [ 5.312 s]
[windows-jdk9] [INFO] Maven SCM Jazz/Rational Team Concert Provider ...... SUCCESS [ 5.884 s]
[windows-jdk9] [INFO] Maven SCM Standard Providers ....................... SUCCESS [ 2.352 s]
[windows-jdk9] [INFO] Maven SCM Client ................................... SUCCESS [ 7.252 s]
[windows-jdk9] [INFO] Maven SCM Plugin ................................... SUCCESS [ 56.799 s]
[windows-jdk9] [INFO] ------------------------------------------------------------------------
[windows-jdk9] [INFO] BUILD SUCCESS
[windows-jdk9] [INFO] ------------------------------------------------------------------------
[windows-jdk9] [INFO] Total time: 04:39 min
[windows-jdk9] [INFO] Finished at: 2018-08-20T03:40:20-07:00
[windows-jdk9] [INFO] Final Memory: 62M/208M
[windows-jdk9] [INFO] ------------------------------------------------------------------------
[windows-jdk9] [WARNING] The requested profile "run-its" could not be activated because it does not exist.
[windows-jdk9] [INFO] [jenkins-event-spy] Generated F:\jenkins\jenkins-slave\workspace\maven-box_maven-scm_SCM-797-TSNF7ZXLGM4LUVYJCJU2O25GA4EZKSADD3776FMZEGJH3QG3LZLQ@tmp\withMaven67dbc5b4\maven-spy-20180820-033540-2319223331160659236734.log
[Pipeline] [windows-jdk9] }
[Pipeline] [windows-jdk9] // dir
[Pipeline] [windows-jdk9] }
[windows-jdk9] [withMaven] invokerPublisher - Archive invoker results for Maven artifact MavenArtifact{org.apache.maven.plugins:maven-scm-plugin::1.9.6-SNAPSHOT(version: 1.9.6-SNAPSHOT, snapshot:false) } generated by PluginInvocation{org.apache.maven.plugins:maven-invoker-plugin:2.0.0@run integration-test}: m\maven-scm-plugin\target\invoker-reports\*.xml
[windows-jdk9] performing MavenInvokerRecorder, reportsFilenamePattern:'**/m\maven-scm-plugin\target\invoker-reports/BUILD*.xml', invokerBuildDir:'**/m\maven-scm-plugin\target\it'
[windows-jdk9] Found reports:[]
[windows-jdk9] Found logs:[]
[windows-jdk9] Finished parsing Maven Invoker results (found 0)
[windows-jdk9] [withMaven] junitPublisher - Archive test results for Maven artifact org.apache.maven.scm:maven-scm-api:1.9.6-SNAPSHOT generated by maven-surefire-plugin:test (default-test): m\maven-scm-api\target\surefire-reports\*.xml
[windows-jdk9] Recording test results
[windows-jdk9] [withMaven] junitPublisher - Archive test results for Maven artifact org.apache.maven.scm:maven-scm-manager-plexus:1.9.6-SNAPSHOT generated by maven-surefire-plugin:test (default-test): m\maven-scm-managers\maven-scm-manager-plexus\target\surefire-reports\*.xml
[windows-jdk9] Recording test results
[windows-jdk9] None of the test reports contained any result
[windows-jdk9] [withMaven] junitPublisher - Archive test results for Maven artifact org.apache.maven.scm:maven-scm-test:1.9.6-SNAPSHOT generated by maven-surefire-plugin:test (default-test): m\maven-scm-test\target\surefire-reports\*.xml
[windows-jdk9] Recording test results
[windows-jdk9] [withMaven] junitPublisher - Archive test results for Maven artifact org.apache.maven.scm:maven-scm-provider-accurev:1.9.6-SNAPSHOT generated by maven-surefire-plugin:test (default-test): m\maven-scm-providers\maven-scm-provider-accurev\target\surefire-reports\*.xml
[windows-jdk9] Recording test results
[windows-jdk9] [withMaven] junitPublisher - Archive test results for Maven artifact org.apache.maven.scm:maven-scm-provider-bazaar:1.9.6-SNAPSHOT generated by maven-surefire-plugin:test (default-test): m\maven-scm-providers\maven-scm-provider-bazaar\target\surefire-reports\*.xml
[windows-jdk9] Recording test results
[windows-jdk9] [withMaven] junitPublisher - Archive test results for Maven artifact org.apache.maven.scm:maven-scm-provider-clearcase:1.9.6-SNAPSHOT generated by maven-surefire-plugin:test (default-test): m\maven-scm-providers\maven-scm-provider-clearcase\target\surefire-reports\*.xml
[windows-jdk9] Recording test results
[windows-jdk9] [withMaven] junitPublisher - Archive test results for Maven artifact org.apache.maven.scm:maven-scm-provider-cvstest:1.9.6-SNAPSHOT generated by maven-surefire-plugin:test (default-test): m\maven-scm-providers\maven-scm-providers-cvs\maven-scm-provider-cvstest\target\surefire-reports\*.xml
[windows-jdk9] Recording test results
[windows-jdk9] None of the test reports contained any result
[windows-jdk9] [withMaven] junitPublisher - Archive test results for Maven artifact org.apache.maven.scm:maven-scm-provider-cvs-commons:1.9.6-SNAPSHOT generated by maven-surefire-plugin:test (default-test): m\maven-scm-providers\maven-scm-providers-cvs\maven-scm-provider-cvs-commons\target\surefire-reports\*.xml
[windows-jdk9] Recording test results
[windows-jdk9] [withMaven] junitPublisher - Archive test results for Maven artifact org.apache.maven.scm:maven-scm-provider-cvsexe:1.9.6-SNAPSHOT generated by maven-surefire-plugin:test (default-test): m\maven-scm-providers\maven-scm-providers-cvs\maven-scm-provider-cvsexe\target\surefire-reports\*.xml
[windows-jdk9] Recording test results
[windows-jdk9] [withMaven] junitPublisher - Archive test results for Maven artifact org.apache.maven.scm:maven-scm-provider-cvsjava:1.9.6-SNAPSHOT generated by maven-surefire-plugin:test (default-test): m\maven-scm-providers\maven-scm-providers-cvs\maven-scm-provider-cvsjava\target\surefire-reports\*.xml
[windows-jdk9] Recording test results
[windows-jdk9] [withMaven] junitPublisher - Archive test results for Maven artifact org.apache.maven.scm:maven-scm-provider-hg:1.9.6-SNAPSHOT generated by maven-surefire-plugin:test (default-test): m\maven-scm-providers\maven-scm-provider-hg\target\surefire-reports\*.xml
[windows-jdk9] Recording test results
[windows-jdk9] [withMaven] junitPublisher - Archive test results for Maven artifact org.apache.maven.scm:maven-scm-provider-git-commons:1.9.6-SNAPSHOT generated by maven-surefire-plugin:test (default-test): m\maven-scm-providers\maven-scm-providers-git\maven-scm-provider-git-commons\target\surefire-reports\*.xml
[windows-jdk9] Recording test results
[windows-jdk9] [withMaven] junitPublisher - Archive test results for Maven artifact org.apache.maven.scm:maven-scm-provider-gittest:1.9.6-SNAPSHOT generated by maven-surefire-plugin:test (default-test): m\maven-scm-providers\maven-scm-providers-git\maven-scm-provider-gittest\target\surefire-reports\*.xml
[windows-jdk9] Recording test results
[windows-jdk9] None of the test reports contained any result
[windows-jdk9] [withMaven] junitPublisher - Archive test results for Maven artifact org.apache.maven.scm:maven-scm-provider-gitexe:1.9.6-SNAPSHOT generated by maven-surefire-plugin:test (default-test): m\maven-scm-providers\maven-scm-providers-git\maven-scm-provider-gitexe\target\surefire-reports\*.xml
[windows-jdk9] Recording test results
[windows-jdk9] [withMaven] junitPublisher - Archive test results for Maven artifact org.apache.maven.scm:maven-scm-provider-jgit:1.9.6-SNAPSHOT generated by maven-surefire-plugin:test (default-test): m\maven-scm-providers\maven-scm-providers-git\maven-scm-provider-jgit\target\surefire-reports\*.xml
[windows-jdk9] Recording test results
[windows-jdk9] [withMaven] junitPublisher - Archive test results for Maven artifact org.apache.maven.scm:maven-scm-provider-local:1.9.6-SNAPSHOT generated by maven-surefire-plugin:test (default-test): m\maven-scm-providers\maven-scm-provider-local\target\surefire-reports\*.xml
[windows-jdk9] Recording test results
[windows-jdk9] [withMaven] junitPublisher - Archive test results for Maven artifact org.apache.maven.scm:maven-scm-provider-perforce:1.9.6-SNAPSHOT generated by maven-surefire-plugin:test (default-test): m\maven-scm-providers\maven-scm-provider-perforce\target\surefire-reports\*.xml
[windows-jdk9] Recording test results
[windows-jdk9] [withMaven] junitPublisher - Archive test results for Maven artifact org.apache.maven.scm:maven-scm-provider-starteam:1.9.6-SNAPSHOT generated by maven-surefire-plugin:test (default-test): m\maven-scm-providers\maven-scm-provider-starteam\target\surefire-reports\*.xml
[windows-jdk9] Recording test results
[windows-jdk9] [withMaven] junitPublisher - Archive test results for Maven artifact org.apache.maven.scm:maven-scm-provider-svn-commons:1.9.6-SNAPSHOT generated by maven-surefire-plugin:test (default-test): m\maven-scm-providers\maven-scm-providers-svn\maven-scm-provider-svn-commons\target\surefire-reports\*.xml
[windows-jdk9] Recording test results
[windows-jdk9] [withMaven] junitPublisher - Archive test results for Maven artifact org.apache.maven.scm:maven-scm-provider-svntest:1.9.6-SNAPSHOT generated by maven-surefire-plugin:test (default-test): m\maven-scm-providers\maven-scm-providers-svn\maven-scm-provider-svntest\target\surefire-reports\*.xml
[windows-jdk9] Recording test results
[windows-jdk9] None of the test reports contained any result
[windows-jdk9] [withMaven] junitPublisher - Archive test results for Maven artifact org.apache.maven.scm:maven-scm-provider-svnexe:1.9.6-SNAPSHOT generated by maven-surefire-plugin:test (default-test): m\maven-scm-providers\maven-scm-providers-svn\maven-scm-provider-svnexe\target\surefire-reports\*.xml
[windows-jdk9] Recording test results
[windows-jdk9] [withMaven] junitPublisher - Archive test results for Maven artifact org.apache.maven.scm:maven-scm-provider-synergy:1.9.6-SNAPSHOT generated by maven-surefire-plugin:test (default-test): m\maven-scm-providers\maven-scm-provider-synergy\target\surefire-reports\*.xml
[windows-jdk9] Recording test results
[windows-jdk9] [withMaven] junitPublisher - Archive test results for Maven artifact org.apache.maven.scm:maven-scm-provider-vss:1.9.6-SNAPSHOT generated by maven-surefire-plugin:test (default-test): m\maven-scm-providers\maven-scm-provider-vss\target\surefire-reports\*.xml
[windows-jdk9] Recording test results
[windows-jdk9] [withMaven] junitPublisher - Archive test results for Maven artifact org.apache.maven.scm:maven-scm-provider-tfs:1.9.6-SNAPSHOT generated by maven-surefire-plugin:test (default-test): m\maven-scm-providers\maven-scm-provider-tfs\target\surefire-reports\*.xml
[windows-jdk9] Recording test results
[windows-jdk9] [withMaven] junitPublisher - Archive test results for Maven artifact org.apache.maven.scm:maven-scm-provider-integrity:1.9.6-SNAPSHOT generated by maven-surefire-plugin:test (default-test): m\maven-scm-providers\maven-scm-provider-integrity\target\surefire-reports\*.xml
[windows-jdk9] Recording test results
[windows-jdk9] [withMaven] junitPublisher - Archive test results for Maven artifact org.apache.maven.scm:maven-scm-provider-jazz:1.9.6-SNAPSHOT generated by maven-surefire-plugin:test (default-test): m\maven-scm-providers\maven-scm-provider-jazz\target\surefire-reports\*.xml
[windows-jdk9] Recording test results
[windows-jdk9] [withMaven] junitPublisher - Archive test results for Maven artifact org.apache.maven.scm:maven-scm-client:1.9.6-SNAPSHOT generated by maven-surefire-plugin:test (default-test): m\maven-scm-client\target\surefire-reports\*.xml
[windows-jdk9] Recording test results
[windows-jdk9] None of the test reports contained any result
[windows-jdk9] [withMaven] junitPublisher - Archive test results for Maven artifact org.apache.maven.plugins:maven-scm-plugin:1.9.6-SNAPSHOT generated by maven-surefire-plugin:test (default-test): m\maven-scm-plugin\target\surefire-reports\*.xml
[windows-jdk9] Recording test results
[Pipeline] [windows-jdk9] // withMaven
[Pipeline] [windows-jdk9] cleanWs
[windows-jdk9] [WS-CLEANUP] Deleting project workspace...[WS-CLEANUP] done
[Pipeline] [windows-jdk9] }
[Pipeline] [windows-jdk9] // stage
[Pipeline] [windows-jdk9] }
[Pipeline] [windows-jdk9] // node
[Pipeline] [windows-jdk9] }
[Pipeline] // parallel
[Pipeline] stage
[Pipeline] { (Notifications)
[Pipeline] echo
Build result: FAILURE
[Pipeline] jiraIssueSelector
[Pipeline] emailext
Build failed in Jenkins: Maven TLP » maven-scm » SCM-797 #11
Posted by Apache Jenkins Server <je...@builds.apache.org>.
See https://builds.apache.org/job/maven-box/job/maven-scm/job/SCM-797/11/
Changes:
* Upgrade latest version of Maven
* [INFRA-16893] set Windows to windows-2016-1 node
* Back to Windows label
* Windows + M3.5.x = M3.5.2
* [INFRA-16893] Trying workaround
* Revert "[INFRA-16893] Trying workaround"
* Try to display PATH value
12 tests failed.
FAILED: org.apache.maven.scm.provider.git.gitexe.command.checkin.GitCheckInCommandNoBranchTest.testCheckinNoBranch
Error Message:
The check out result success flag was false.
Stack Trace:
junit.framework.AssertionFailedError: The check out result success flag was false.
at org.apache.maven.scm.provider.git.gitexe.command.checkin.GitCheckInCommandNoBranchTest.testCheckinNoBranch(GitCheckInCommandNoBranchTest.java:75)
FAILED: org.apache.maven.scm.provider.git.gitexe.command.checkin.GitCheckInCommandNoBranchTest.testCheckinNoBranch
Error Message:
The check out result success flag was false.
Stack Trace:
junit.framework.AssertionFailedError: The check out result success flag was false.
at org.apache.maven.scm.provider.git.gitexe.command.checkin.GitCheckInCommandNoBranchTest.testCheckinNoBranch(GitCheckInCommandNoBranchTest.java:75)
FAILED: org.apache.maven.scm.provider.git.gitexe.command.checkin.GitCheckInCommandNoBranchTest.testCheckinNoBranch
Error Message:
The check out result success flag was false.
Stack Trace:
junit.framework.AssertionFailedError: The check out result success flag was false.
at org.apache.maven.scm.provider.git.gitexe.command.checkin.GitCheckInCommandNoBranchTest.testCheckinNoBranch(GitCheckInCommandNoBranchTest.java:75)
FAILED: org.apache.maven.scm.provider.git.gitexe.command.checkin.GitCheckInCommandNoBranchTest.testCheckinNoBranch
Error Message:
The check out result success flag was false.
Stack Trace:
junit.framework.AssertionFailedError: The check out result success flag was false.
at org.apache.maven.scm.provider.git.gitexe.command.checkin.GitCheckInCommandNoBranchTest.testCheckinNoBranch(GitCheckInCommandNoBranchTest.java:75)
FAILED: org.apache.maven.scm.provider.git.gitexe.command.checkin.GitCheckInCommandTest.testCheckinAfterRename
Error Message:
The check out result success flag was false.
Stack Trace:
junit.framework.AssertionFailedError: The check out result success flag was false.
at org.apache.maven.scm.provider.git.gitexe.command.checkin.GitCheckInCommandTest.testCheckinAfterRename(GitCheckInCommandTest.java:113)
FAILED: org.apache.maven.scm.provider.git.gitexe.command.checkin.GitCheckInCommandTest.testCheckinAfterRename
Error Message:
The check out result success flag was false.
Stack Trace:
junit.framework.AssertionFailedError: The check out result success flag was false.
at org.apache.maven.scm.provider.git.gitexe.command.checkin.GitCheckInCommandTest.testCheckinAfterRename(GitCheckInCommandTest.java:113)
FAILED: org.apache.maven.scm.provider.git.gitexe.command.checkin.GitCheckInCommandTest.testCheckinAfterRename
Error Message:
The check out result success flag was false.
Stack Trace:
junit.framework.AssertionFailedError: The check out result success flag was false.
at org.apache.maven.scm.provider.git.gitexe.command.checkin.GitCheckInCommandTest.testCheckinAfterRename(GitCheckInCommandTest.java:113)
FAILED: org.apache.maven.scm.provider.git.gitexe.command.checkin.GitCheckInCommandTest.testCheckinAfterRename
Error Message:
The check out result success flag was false.
Stack Trace:
junit.framework.AssertionFailedError: The check out result success flag was false.
at org.apache.maven.scm.provider.git.gitexe.command.checkin.GitCheckInCommandTest.testCheckinAfterRename(GitCheckInCommandTest.java:113)
FAILED: org.apache.maven.scm.provider.git.gitexe.command.checkin.GitCheckInCommandTest.testCheckinAfterRename
Error Message:
Exception while executing SCM command.
Stack Trace:
org.apache.maven.scm.ScmException: Exception while executing SCM command.
at org.apache.maven.scm.provider.git.gitexe.command.checkin.GitCheckInCommandTest.checkoutRepoInto(GitCheckInCommandTest.java:141)
at org.apache.maven.scm.provider.git.gitexe.command.checkin.GitCheckInCommandTest.testCheckinAfterRename(GitCheckInCommandTest.java:99)
Caused by: org.apache.maven.scm.ScmException: Error while executing command.
at org.apache.maven.scm.provider.git.gitexe.command.checkin.GitCheckInCommandTest.checkoutRepoInto(GitCheckInCommandTest.java:141)
at org.apache.maven.scm.provider.git.gitexe.command.checkin.GitCheckInCommandTest.testCheckinAfterRename(GitCheckInCommandTest.java:99)
Caused by: org.codehaus.plexus.util.cli.CommandLineException: Error while executing process.
at org.apache.maven.scm.provider.git.gitexe.command.checkin.GitCheckInCommandTest.checkoutRepoInto(GitCheckInCommandTest.java:141)
at org.apache.maven.scm.provider.git.gitexe.command.checkin.GitCheckInCommandTest.testCheckinAfterRename(GitCheckInCommandTest.java:99)
Caused by: java.io.IOException: Cannot run program "git" (in directory "F:\jenkins\jenkins-slave\workspace\maven-box_maven-scm_SCM-797-TSNF7ZXLGM4LUVYJCJU2O25GA4EZKSADD3776FMZEGJH3QG3LZLQ\m\maven-scm-providers\maven-scm-providers-git\maven-scm-provider-gitexe\target\scm-test"): CreateProcess error=2, The system cannot find the file specified
at org.apache.maven.scm.provider.git.gitexe.command.checkin.GitCheckInCommandTest.checkoutRepoInto(GitCheckInCommandTest.java:141)
at org.apache.maven.scm.provider.git.gitexe.command.checkin.GitCheckInCommandTest.testCheckinAfterRename(GitCheckInCommandTest.java:99)
Caused by: java.io.IOException: CreateProcess error=2, The system cannot find the file specified
at org.apache.maven.scm.provider.git.gitexe.command.checkin.GitCheckInCommandTest.checkoutRepoInto(GitCheckInCommandTest.java:141)
at org.apache.maven.scm.provider.git.gitexe.command.checkin.GitCheckInCommandTest.testCheckinAfterRename(GitCheckInCommandTest.java:99)
FAILED: org.apache.maven.scm.provider.git.gitexe.command.checkin.GitCheckInCommandTest.testCheckinAfterRename
Error Message:
Exception while executing SCM command.
Stack Trace:
org.apache.maven.scm.ScmException: Exception while executing SCM command.
at org.apache.maven.scm.provider.git.gitexe.command.checkin.GitCheckInCommandTest.checkoutRepoInto(GitCheckInCommandTest.java:141)
at org.apache.maven.scm.provider.git.gitexe.command.checkin.GitCheckInCommandTest.testCheckinAfterRename(GitCheckInCommandTest.java:99)
Caused by: org.apache.maven.scm.ScmException: Error while executing command.
at org.apache.maven.scm.provider.git.gitexe.command.checkin.GitCheckInCommandTest.checkoutRepoInto(GitCheckInCommandTest.java:141)
at org.apache.maven.scm.provider.git.gitexe.command.checkin.GitCheckInCommandTest.testCheckinAfterRename(GitCheckInCommandTest.java:99)
Caused by: org.codehaus.plexus.util.cli.CommandLineException: Error while executing process.
at org.apache.maven.scm.provider.git.gitexe.command.checkin.GitCheckInCommandTest.checkoutRepoInto(GitCheckInCommandTest.java:141)
at org.apache.maven.scm.provider.git.gitexe.command.checkin.GitCheckInCommandTest.testCheckinAfterRename(GitCheckInCommandTest.java:99)
Caused by: java.io.IOException: Cannot run program "git" (in directory "F:\jenkins\jenkins-slave\workspace\maven-box_maven-scm_SCM-797-TSNF7ZXLGM4LUVYJCJU2O25GA4EZKSADD3776FMZEGJH3QG3LZLQ\m\maven-scm-providers\maven-scm-providers-git\maven-scm-provider-gitexe\target\scm-test"): CreateProcess error=2, The system cannot find the file specified
at org.apache.maven.scm.provider.git.gitexe.command.checkin.GitCheckInCommandTest.checkoutRepoInto(GitCheckInCommandTest.java:141)
at org.apache.maven.scm.provider.git.gitexe.command.checkin.GitCheckInCommandTest.testCheckinAfterRename(GitCheckInCommandTest.java:99)
Caused by: java.io.IOException: CreateProcess error=2, The system cannot find the file specified
at org.apache.maven.scm.provider.git.gitexe.command.checkin.GitCheckInCommandTest.checkoutRepoInto(GitCheckInCommandTest.java:141)
at org.apache.maven.scm.provider.git.gitexe.command.checkin.GitCheckInCommandTest.testCheckinAfterRename(GitCheckInCommandTest.java:99)
FAILED: org.apache.maven.scm.provider.git.gitexe.command.checkin.GitCheckInCommandTest.testCheckinAfterRename
Error Message:
Exception while executing SCM command.
Stack Trace:
org.apache.maven.scm.ScmException: Exception while executing SCM command.
at org.apache.maven.scm.provider.git.gitexe.command.checkin.GitCheckInCommandTest.checkoutRepoInto(GitCheckInCommandTest.java:140)
at org.apache.maven.scm.provider.git.gitexe.command.checkin.GitCheckInCommandTest.testCheckinAfterRename(GitCheckInCommandTest.java:99)
Caused by: org.apache.maven.scm.ScmException: Error while executing command.
at org.apache.maven.scm.provider.git.gitexe.command.checkin.GitCheckInCommandTest.checkoutRepoInto(GitCheckInCommandTest.java:140)
at org.apache.maven.scm.provider.git.gitexe.command.checkin.GitCheckInCommandTest.testCheckinAfterRename(GitCheckInCommandTest.java:99)
Caused by: org.codehaus.plexus.util.cli.CommandLineException: Error while executing process.
at org.apache.maven.scm.provider.git.gitexe.command.checkin.GitCheckInCommandTest.checkoutRepoInto(GitCheckInCommandTest.java:140)
at org.apache.maven.scm.provider.git.gitexe.command.checkin.GitCheckInCommandTest.testCheckinAfterRename(GitCheckInCommandTest.java:99)
Caused by: java.io.IOException: Cannot run program "git" (in directory "F:\jenkins\jenkins-slave\workspace\maven-box_maven-scm_SCM-797-TSNF7ZXLGM4LUVYJCJU2O25GA4EZKSADD3776FMZEGJH3QG3LZLQ\m\maven-scm-providers\maven-scm-providers-git\maven-scm-provider-gitexe\target\scm-test"): CreateProcess error=2, The system cannot find the file specified
at org.apache.maven.scm.provider.git.gitexe.command.checkin.GitCheckInCommandTest.checkoutRepoInto(GitCheckInCommandTest.java:140)
at org.apache.maven.scm.provider.git.gitexe.command.checkin.GitCheckInCommandTest.testCheckinAfterRename(GitCheckInCommandTest.java:99)
Caused by: java.io.IOException: CreateProcess error=2, The system cannot find the file specified
at org.apache.maven.scm.provider.git.gitexe.command.checkin.GitCheckInCommandTest.checkoutRepoInto(GitCheckInCommandTest.java:140)
at org.apache.maven.scm.provider.git.gitexe.command.checkin.GitCheckInCommandTest.testCheckinAfterRename(GitCheckInCommandTest.java:99)
FAILED: org.apache.maven.scm.provider.git.gitexe.command.checkin.GitCheckInCommandTest.testCheckinAfterRename
Error Message:
Exception while executing SCM command.
Stack Trace:
org.apache.maven.scm.ScmException: Exception while executing SCM command.
at org.apache.maven.scm.provider.git.gitexe.command.checkin.GitCheckInCommandTest.checkoutRepoInto(GitCheckInCommandTest.java:141)
at org.apache.maven.scm.provider.git.gitexe.command.checkin.GitCheckInCommandTest.testCheckinAfterRename(GitCheckInCommandTest.java:99)
Caused by: org.apache.maven.scm.ScmException: Error while executing command.
at org.apache.maven.scm.provider.git.gitexe.command.checkin.GitCheckInCommandTest.checkoutRepoInto(GitCheckInCommandTest.java:141)
at org.apache.maven.scm.provider.git.gitexe.command.checkin.GitCheckInCommandTest.testCheckinAfterRename(GitCheckInCommandTest.java:99)
Caused by: org.codehaus.plexus.util.cli.CommandLineException: Error while executing process.
at org.apache.maven.scm.provider.git.gitexe.command.checkin.GitCheckInCommandTest.checkoutRepoInto(GitCheckInCommandTest.java:141)
at org.apache.maven.scm.provider.git.gitexe.command.checkin.GitCheckInCommandTest.testCheckinAfterRename(GitCheckInCommandTest.java:99)
Caused by: java.io.IOException: Cannot run program "git" (in directory "F:\jenkins\jenkins-slave\workspace\maven-box_maven-scm_SCM-797-TSNF7ZXLGM4LUVYJCJU2O25GA4EZKSADD3776FMZEGJH3QG3LZLQ\m\maven-scm-providers\maven-scm-providers-git\maven-scm-provider-gitexe\target\scm-test"): CreateProcess error=2, The system cannot find the file specified
at org.apache.maven.scm.provider.git.gitexe.command.checkin.GitCheckInCommandTest.checkoutRepoInto(GitCheckInCommandTest.java:141)
at org.apache.maven.scm.provider.git.gitexe.command.checkin.GitCheckInCommandTest.testCheckinAfterRename(GitCheckInCommandTest.java:99)
Caused by: java.io.IOException: CreateProcess error=2, The system cannot find the file specified
at org.apache.maven.scm.provider.git.gitexe.command.checkin.GitCheckInCommandTest.checkoutRepoInto(GitCheckInCommandTest.java:141)
at org.apache.maven.scm.provider.git.gitexe.command.checkin.GitCheckInCommandTest.testCheckinAfterRename(GitCheckInCommandTest.java:99)
Build log:
[...truncated 7.44 MB...]
[windows-jdk9] [INFO] Downloading from central: https://repo.maven.apache.org/maven2/org/apache/maven/doxia/doxia-module-fml/1.1.4/doxia-module-fml-1.1.4.pom
[windows-jdk9] [INFO] Downloaded from central: https://repo.maven.apache.org/maven2/org/apache/maven/doxia/doxia-module-fml/1.1.4/doxia-module-fml-1.1.4.pom (5.5 kB at 289 kB/s)
[windows-jdk9] [INFO] Downloading from central: https://repo.maven.apache.org/maven2/org/codehaus/groovy/groovy-all/2.0.1/groovy-all-2.0.1.pom
[windows-jdk9] [INFO] Downloaded from central: https://repo.maven.apache.org/maven2/org/codehaus/groovy/groovy-all/2.0.1/groovy-all-2.0.1.pom (18 kB at 1.1 MB/s)
[windows-jdk9] [INFO] Downloading from central: https://repo.maven.apache.org/maven2/org/apache/maven/shared/maven-invoker/2.2/maven-invoker-2.2.jar
[windows-jdk9] [INFO] Downloading from central: https://repo.maven.apache.org/maven2/org/apache/maven/reporting/maven-reporting-impl/2.2/maven-reporting-impl-2.2.jar
[windows-jdk9] [INFO] Downloading from central: https://repo.maven.apache.org/maven2/org/apache/maven/shared/maven-script-interpreter/1.1/maven-script-interpreter-1.1.jar
[windows-jdk9] [INFO] Downloading from central: https://repo.maven.apache.org/maven2/org/ow2/asm/asm-tree/4.0/asm-tree-4.0.jar
[windows-jdk9] [INFO] Downloading from central: https://repo.maven.apache.org/maven2/org/codehaus/groovy/groovy/2.0.1/groovy-2.0.1.jar
[windows-jdk9] [INFO] Downloaded from central: https://repo.maven.apache.org/maven2/org/codehaus/groovy/groovy/2.0.1/groovy-2.0.1.jar (3.3 MB at 24 MB/s)
[windows-jdk9] [INFO] Downloading from central: https://repo.maven.apache.org/maven2/org/ow2/asm/asm-commons/4.0/asm-commons-4.0.jar
[windows-jdk9] [INFO] Downloaded from central: https://repo.maven.apache.org/maven2/org/apache/maven/shared/maven-script-interpreter/1.1/maven-script-interpreter-1.1.jar (21 kB at 126 kB/s)
[windows-jdk9] [INFO] Downloading from central: https://repo.maven.apache.org/maven2/org/ow2/asm/asm/4.0/asm-4.0.jar
[windows-jdk9] [INFO] Downloaded from central: https://repo.maven.apache.org/maven2/org/ow2/asm/asm-tree/4.0/asm-tree-4.0.jar (22 kB at 124 kB/s)
[windows-jdk9] [INFO] Downloading from central: https://repo.maven.apache.org/maven2/org/ow2/asm/asm-util/4.0/asm-util-4.0.jar
[windows-jdk9] [INFO] Downloaded from central: https://repo.maven.apache.org/maven2/org/apache/maven/shared/maven-invoker/2.2/maven-invoker-2.2.jar (30 kB at 150 kB/s)
[windows-jdk9] [INFO] Downloading from central: https://repo.maven.apache.org/maven2/org/ow2/asm/asm-analysis/4.0/asm-analysis-4.0.jar
[windows-jdk9] [INFO] Downloaded from central: https://repo.maven.apache.org/maven2/org/apache/maven/reporting/maven-reporting-impl/2.2/maven-reporting-impl-2.2.jar (17 kB at 81 kB/s)
[windows-jdk9] [INFO] Downloading from central: https://repo.maven.apache.org/maven2/org/apache/maven/doxia/doxia-site-renderer/1.1.4/doxia-site-renderer-1.1.4.jar
[windows-jdk9] [INFO] Downloaded from central: https://repo.maven.apache.org/maven2/org/ow2/asm/asm-commons/4.0/asm-commons-4.0.jar (38 kB at 134 kB/s)
[windows-jdk9] [INFO] Downloading from central: https://repo.maven.apache.org/maven2/org/apache/maven/doxia/doxia-decoration-model/1.1.4/doxia-decoration-model-1.1.4.jar
[windows-jdk9] [INFO] Downloaded from central: https://repo.maven.apache.org/maven2/org/ow2/asm/asm-analysis/4.0/asm-analysis-4.0.jar (20 kB at 69 kB/s)
[windows-jdk9] [INFO] Downloading from central: https://repo.maven.apache.org/maven2/org/apache/maven/doxia/doxia-module-xhtml/1.1.4/doxia-module-xhtml-1.1.4.jar
[windows-jdk9] [INFO] Downloaded from central: https://repo.maven.apache.org/maven2/org/apache/maven/doxia/doxia-site-renderer/1.1.4/doxia-site-renderer-1.1.4.jar (51 kB at 178 kB/s)
[windows-jdk9] [INFO] Downloading from central: https://repo.maven.apache.org/maven2/org/apache/maven/doxia/doxia-module-fml/1.1.4/doxia-module-fml-1.1.4.jar
[windows-jdk9] [INFO] Downloaded from central: https://repo.maven.apache.org/maven2/org/apache/maven/doxia/doxia-decoration-model/1.1.4/doxia-decoration-model-1.1.4.jar (52 kB at 171 kB/s)
[windows-jdk9] [INFO] Downloading from central: https://repo.maven.apache.org/maven2/commons-collections/commons-collections/3.2/commons-collections-3.2.jar
[windows-jdk9] [INFO] Downloaded from central: https://repo.maven.apache.org/maven2/commons-collections/commons-collections/3.2/commons-collections-3.2.jar (571 kB at 1.7 MB/s)
[windows-jdk9] [INFO] Downloading from central: https://repo.maven.apache.org/maven2/org/codehaus/groovy/groovy-all/2.0.1/groovy-all-2.0.1.jar
[windows-jdk9] [INFO] Downloaded from central: https://repo.maven.apache.org/maven2/org/ow2/asm/asm/4.0/asm-4.0.jar (46 kB at 133 kB/s)
[windows-jdk9] [INFO] Downloading from central: https://repo.maven.apache.org/maven2/org/apache/ant/ant/1.8.1/ant-1.8.1.jar
[windows-jdk9] [INFO] Downloaded from central: https://repo.maven.apache.org/maven2/org/ow2/asm/asm-util/4.0/asm-util-4.0.jar (37 kB at 105 kB/s)
[windows-jdk9] [INFO] Downloaded from central: https://repo.maven.apache.org/maven2/org/apache/maven/doxia/doxia-module-xhtml/1.1.4/doxia-module-xhtml-1.1.4.jar (15 kB at 38 kB/s)
[windows-jdk9] [INFO] Downloaded from central: https://repo.maven.apache.org/maven2/org/apache/ant/ant/1.8.1/ant-1.8.1.jar (1.5 MB at 3.8 MB/s)
[windows-jdk9] [INFO] Downloaded from central: https://repo.maven.apache.org/maven2/org/apache/maven/doxia/doxia-module-fml/1.1.4/doxia-module-fml-1.1.4.jar (37 kB at 86 kB/s)
[windows-jdk9] [INFO] Downloaded from central: https://repo.maven.apache.org/maven2/org/codehaus/groovy/groovy-all/2.0.1/groovy-all-2.0.1.jar (6.2 MB at 12 MB/s)
[windows-jdk9] [INFO] Installing f:\jenkins\jenkins-slave\workspace\maven-box_maven-scm_SCM-797-TSNF7ZXLGM4LUVYJCJU2O25GA4EZKSADD3776FMZEGJH3QG3LZLQ\m\pom.xml to F:\jenkins\jenkins-slave\workspace\maven-box_maven-scm_SCM-797-TSNF7ZXLGM4LUVYJCJU2O25GA4EZKSADD3776FMZEGJH3QG3LZLQ\m\maven-scm-plugin\target\local-repo\org\apache\maven\scm\maven-scm\1.9.6-SNAPSHOT\maven-scm-1.9.6-SNAPSHOT.pom
[windows-jdk9] [INFO] Installing f:\jenkins\jenkins-slave\workspace\maven-box_maven-scm_SCM-797-TSNF7ZXLGM4LUVYJCJU2O25GA4EZKSADD3776FMZEGJH3QG3LZLQ\m\target\maven-scm-1.9.6-SNAPSHOT-site.xml to F:\jenkins\jenkins-slave\workspace\maven-box_maven-scm_SCM-797-TSNF7ZXLGM4LUVYJCJU2O25GA4EZKSADD3776FMZEGJH3QG3LZLQ\m\maven-scm-plugin\target\local-repo\org\apache\maven\scm\maven-scm\1.9.6-SNAPSHOT\maven-scm-1.9.6-SNAPSHOT-site.xml
[windows-jdk9] [INFO] Installing F:\jenkins\jenkins-slave\workspace\maven-box_maven-scm_SCM-797-TSNF7ZXLGM4LUVYJCJU2O25GA4EZKSADD3776FMZEGJH3QG3LZLQ\m\maven-scm-api\pom.xml to F:\jenkins\jenkins-slave\workspace\maven-box_maven-scm_SCM-797-TSNF7ZXLGM4LUVYJCJU2O25GA4EZKSADD3776FMZEGJH3QG3LZLQ\m\maven-scm-plugin\target\local-repo\org\apache\maven\scm\maven-scm-api\1.9.6-SNAPSHOT\maven-scm-api-1.9.6-SNAPSHOT.pom
[windows-jdk9] [INFO] Installing F:\jenkins\jenkins-slave\workspace\maven-box_maven-scm_SCM-797-TSNF7ZXLGM4LUVYJCJU2O25GA4EZKSADD3776FMZEGJH3QG3LZLQ\m\maven-scm-api\target\maven-scm-api-1.9.6-SNAPSHOT.jar to F:\jenkins\jenkins-slave\workspace\maven-box_maven-scm_SCM-797-TSNF7ZXLGM4LUVYJCJU2O25GA4EZKSADD3776FMZEGJH3QG3LZLQ\m\maven-scm-plugin\target\local-repo\org\apache\maven\scm\maven-scm-api\1.9.6-SNAPSHOT\maven-scm-api-1.9.6-SNAPSHOT.jar
[windows-jdk9] [INFO] Installing F:\jenkins\jenkins-slave\workspace\maven-box_maven-scm_SCM-797-TSNF7ZXLGM4LUVYJCJU2O25GA4EZKSADD3776FMZEGJH3QG3LZLQ\m\maven-scm-managers\pom.xml to F:\jenkins\jenkins-slave\workspace\maven-box_maven-scm_SCM-797-TSNF7ZXLGM4LUVYJCJU2O25GA4EZKSADD3776FMZEGJH3QG3LZLQ\m\maven-scm-plugin\target\local-repo\org\apache\maven\scm\maven-scm-managers\1.9.6-SNAPSHOT\maven-scm-managers-1.9.6-SNAPSHOT.pom
[windows-jdk9] [INFO] Installing F:\jenkins\jenkins-slave\workspace\maven-box_maven-scm_SCM-797-TSNF7ZXLGM4LUVYJCJU2O25GA4EZKSADD3776FMZEGJH3QG3LZLQ\m\maven-scm-managers\target\maven-scm-managers-1.9.6-SNAPSHOT-site.xml to F:\jenkins\jenkins-slave\workspace\maven-box_maven-scm_SCM-797-TSNF7ZXLGM4LUVYJCJU2O25GA4EZKSADD3776FMZEGJH3QG3LZLQ\m\maven-scm-plugin\target\local-repo\org\apache\maven\scm\maven-scm-managers\1.9.6-SNAPSHOT\maven-scm-managers-1.9.6-SNAPSHOT-site.xml
[windows-jdk9] [INFO] Installing F:\jenkins\jenkins-slave\workspace\maven-box_maven-scm_SCM-797-TSNF7ZXLGM4LUVYJCJU2O25GA4EZKSADD3776FMZEGJH3QG3LZLQ\m\maven-scm-managers\maven-scm-manager-plexus\pom.xml to F:\jenkins\jenkins-slave\workspace\maven-box_maven-scm_SCM-797-TSNF7ZXLGM4LUVYJCJU2O25GA4EZKSADD3776FMZEGJH3QG3LZLQ\m\maven-scm-plugin\target\local-repo\org\apache\maven\scm\maven-scm-manager-plexus\1.9.6-SNAPSHOT\maven-scm-manager-plexus-1.9.6-SNAPSHOT.pom
[windows-jdk9] [INFO] Installing F:\jenkins\jenkins-slave\workspace\maven-box_maven-scm_SCM-797-TSNF7ZXLGM4LUVYJCJU2O25GA4EZKSADD3776FMZEGJH3QG3LZLQ\m\maven-scm-managers\maven-scm-manager-plexus\target\maven-scm-manager-plexus-1.9.6-SNAPSHOT.jar to F:\jenkins\jenkins-slave\workspace\maven-box_maven-scm_SCM-797-TSNF7ZXLGM4LUVYJCJU2O25GA4EZKSADD3776FMZEGJH3QG3LZLQ\m\maven-scm-plugin\target\local-repo\org\apache\maven\scm\maven-scm-manager-plexus\1.9.6-SNAPSHOT\maven-scm-manager-plexus-1.9.6-SNAPSHOT.jar
[windows-jdk9] [INFO] Installing F:\jenkins\jenkins-slave\workspace\maven-box_maven-scm_SCM-797-TSNF7ZXLGM4LUVYJCJU2O25GA4EZKSADD3776FMZEGJH3QG3LZLQ\m\maven-scm-test\pom.xml to F:\jenkins\jenkins-slave\workspace\maven-box_maven-scm_SCM-797-TSNF7ZXLGM4LUVYJCJU2O25GA4EZKSADD3776FMZEGJH3QG3LZLQ\m\maven-scm-plugin\target\local-repo\org\apache\maven\scm\maven-scm-test\1.9.6-SNAPSHOT\maven-scm-test-1.9.6-SNAPSHOT.pom
[windows-jdk9] [INFO] Installing F:\jenkins\jenkins-slave\workspace\maven-box_maven-scm_SCM-797-TSNF7ZXLGM4LUVYJCJU2O25GA4EZKSADD3776FMZEGJH3QG3LZLQ\m\maven-scm-test\target\maven-scm-test-1.9.6-SNAPSHOT.jar to F:\jenkins\jenkins-slave\workspace\maven-box_maven-scm_SCM-797-TSNF7ZXLGM4LUVYJCJU2O25GA4EZKSADD3776FMZEGJH3QG3LZLQ\m\maven-scm-plugin\target\local-repo\org\apache\maven\scm\maven-scm-test\1.9.6-SNAPSHOT\maven-scm-test-1.9.6-SNAPSHOT.jar
[windows-jdk9] [INFO] Installing F:\jenkins\jenkins-slave\workspace\maven-box_maven-scm_SCM-797-TSNF7ZXLGM4LUVYJCJU2O25GA4EZKSADD3776FMZEGJH3QG3LZLQ\m\maven-scm-providers\pom.xml to F:\jenkins\jenkins-slave\workspace\maven-box_maven-scm_SCM-797-TSNF7ZXLGM4LUVYJCJU2O25GA4EZKSADD3776FMZEGJH3QG3LZLQ\m\maven-scm-plugin\target\local-repo\org\apache\maven\scm\maven-scm-providers\1.9.6-SNAPSHOT\maven-scm-providers-1.9.6-SNAPSHOT.pom
[windows-jdk9] [INFO] Installing F:\jenkins\jenkins-slave\workspace\maven-box_maven-scm_SCM-797-TSNF7ZXLGM4LUVYJCJU2O25GA4EZKSADD3776FMZEGJH3QG3LZLQ\m\maven-scm-providers\target\maven-scm-providers-1.9.6-SNAPSHOT-site.xml to F:\jenkins\jenkins-slave\workspace\maven-box_maven-scm_SCM-797-TSNF7ZXLGM4LUVYJCJU2O25GA4EZKSADD3776FMZEGJH3QG3LZLQ\m\maven-scm-plugin\target\local-repo\org\apache\maven\scm\maven-scm-providers\1.9.6-SNAPSHOT\maven-scm-providers-1.9.6-SNAPSHOT-site.xml
[windows-jdk9] [INFO] Installing F:\jenkins\jenkins-slave\workspace\maven-box_maven-scm_SCM-797-TSNF7ZXLGM4LUVYJCJU2O25GA4EZKSADD3776FMZEGJH3QG3LZLQ\m\maven-scm-providers\maven-scm-provider-accurev\pom.xml to F:\jenkins\jenkins-slave\workspace\maven-box_maven-scm_SCM-797-TSNF7ZXLGM4LUVYJCJU2O25GA4EZKSADD3776FMZEGJH3QG3LZLQ\m\maven-scm-plugin\target\local-repo\org\apache\maven\scm\maven-scm-provider-accurev\1.9.6-SNAPSHOT\maven-scm-provider-accurev-1.9.6-SNAPSHOT.pom
[windows-jdk9] [INFO] Installing F:\jenkins\jenkins-slave\workspace\maven-box_maven-scm_SCM-797-TSNF7ZXLGM4LUVYJCJU2O25GA4EZKSADD3776FMZEGJH3QG3LZLQ\m\maven-scm-providers\maven-scm-provider-accurev\target\maven-scm-provider-accurev-1.9.6-SNAPSHOT.jar to F:\jenkins\jenkins-slave\workspace\maven-box_maven-scm_SCM-797-TSNF7ZXLGM4LUVYJCJU2O25GA4EZKSADD3776FMZEGJH3QG3LZLQ\m\maven-scm-plugin\target\local-repo\org\apache\maven\scm\maven-scm-provider-accurev\1.9.6-SNAPSHOT\maven-scm-provider-accurev-1.9.6-SNAPSHOT.jar
[windows-jdk9] [INFO] Installing F:\jenkins\jenkins-slave\workspace\maven-box_maven-scm_SCM-797-TSNF7ZXLGM4LUVYJCJU2O25GA4EZKSADD3776FMZEGJH3QG3LZLQ\m\maven-scm-providers\maven-scm-provider-bazaar\pom.xml to F:\jenkins\jenkins-slave\workspace\maven-box_maven-scm_SCM-797-TSNF7ZXLGM4LUVYJCJU2O25GA4EZKSADD3776FMZEGJH3QG3LZLQ\m\maven-scm-plugin\target\local-repo\org\apache\maven\scm\maven-scm-provider-bazaar\1.9.6-SNAPSHOT\maven-scm-provider-bazaar-1.9.6-SNAPSHOT.pom
[windows-jdk9] [INFO] Installing F:\jenkins\jenkins-slave\workspace\maven-box_maven-scm_SCM-797-TSNF7ZXLGM4LUVYJCJU2O25GA4EZKSADD3776FMZEGJH3QG3LZLQ\m\maven-scm-providers\maven-scm-provider-bazaar\target\maven-scm-provider-bazaar-1.9.6-SNAPSHOT.jar to F:\jenkins\jenkins-slave\workspace\maven-box_maven-scm_SCM-797-TSNF7ZXLGM4LUVYJCJU2O25GA4EZKSADD3776FMZEGJH3QG3LZLQ\m\maven-scm-plugin\target\local-repo\org\apache\maven\scm\maven-scm-provider-bazaar\1.9.6-SNAPSHOT\maven-scm-provider-bazaar-1.9.6-SNAPSHOT.jar
[windows-jdk9] [INFO] Installing F:\jenkins\jenkins-slave\workspace\maven-box_maven-scm_SCM-797-TSNF7ZXLGM4LUVYJCJU2O25GA4EZKSADD3776FMZEGJH3QG3LZLQ\m\maven-scm-providers\maven-scm-provider-clearcase\pom.xml to F:\jenkins\jenkins-slave\workspace\maven-box_maven-scm_SCM-797-TSNF7ZXLGM4LUVYJCJU2O25GA4EZKSADD3776FMZEGJH3QG3LZLQ\m\maven-scm-plugin\target\local-repo\org\apache\maven\scm\maven-scm-provider-clearcase\1.9.6-SNAPSHOT\maven-scm-provider-clearcase-1.9.6-SNAPSHOT.pom
[windows-jdk9] [INFO] Installing F:\jenkins\jenkins-slave\workspace\maven-box_maven-scm_SCM-797-TSNF7ZXLGM4LUVYJCJU2O25GA4EZKSADD3776FMZEGJH3QG3LZLQ\m\maven-scm-providers\maven-scm-provider-clearcase\target\maven-scm-provider-clearcase-1.9.6-SNAPSHOT.jar to F:\jenkins\jenkins-slave\workspace\maven-box_maven-scm_SCM-797-TSNF7ZXLGM4LUVYJCJU2O25GA4EZKSADD3776FMZEGJH3QG3LZLQ\m\maven-scm-plugin\target\local-repo\org\apache\maven\scm\maven-scm-provider-clearcase\1.9.6-SNAPSHOT\maven-scm-provider-clearcase-1.9.6-SNAPSHOT.jar
[windows-jdk9] [INFO] Installing F:\jenkins\jenkins-slave\workspace\maven-box_maven-scm_SCM-797-TSNF7ZXLGM4LUVYJCJU2O25GA4EZKSADD3776FMZEGJH3QG3LZLQ\m\maven-scm-providers\maven-scm-providers-cvs\pom.xml to F:\jenkins\jenkins-slave\workspace\maven-box_maven-scm_SCM-797-TSNF7ZXLGM4LUVYJCJU2O25GA4EZKSADD3776FMZEGJH3QG3LZLQ\m\maven-scm-plugin\target\local-repo\org\apache\maven\scm\maven-scm-providers-cvs\1.9.6-SNAPSHOT\maven-scm-providers-cvs-1.9.6-SNAPSHOT.pom
[windows-jdk9] [INFO] Installing F:\jenkins\jenkins-slave\workspace\maven-box_maven-scm_SCM-797-TSNF7ZXLGM4LUVYJCJU2O25GA4EZKSADD3776FMZEGJH3QG3LZLQ\m\maven-scm-providers\maven-scm-providers-cvs\target\maven-scm-providers-cvs-1.9.6-SNAPSHOT-site.xml to F:\jenkins\jenkins-slave\workspace\maven-box_maven-scm_SCM-797-TSNF7ZXLGM4LUVYJCJU2O25GA4EZKSADD3776FMZEGJH3QG3LZLQ\m\maven-scm-plugin\target\local-repo\org\apache\maven\scm\maven-scm-providers-cvs\1.9.6-SNAPSHOT\maven-scm-providers-cvs-1.9.6-SNAPSHOT-site.xml
[windows-jdk9] [INFO] Installing F:\jenkins\jenkins-slave\workspace\maven-box_maven-scm_SCM-797-TSNF7ZXLGM4LUVYJCJU2O25GA4EZKSADD3776FMZEGJH3QG3LZLQ\m\maven-scm-providers\maven-scm-providers-cvs\maven-scm-provider-cvstest\pom.xml to F:\jenkins\jenkins-slave\workspace\maven-box_maven-scm_SCM-797-TSNF7ZXLGM4LUVYJCJU2O25GA4EZKSADD3776FMZEGJH3QG3LZLQ\m\maven-scm-plugin\target\local-repo\org\apache\maven\scm\maven-scm-provider-cvstest\1.9.6-SNAPSHOT\maven-scm-provider-cvstest-1.9.6-SNAPSHOT.pom
[windows-jdk9] [INFO] Installing F:\jenkins\jenkins-slave\workspace\maven-box_maven-scm_SCM-797-TSNF7ZXLGM4LUVYJCJU2O25GA4EZKSADD3776FMZEGJH3QG3LZLQ\m\maven-scm-providers\maven-scm-providers-cvs\maven-scm-provider-cvstest\target\maven-scm-provider-cvstest-1.9.6-SNAPSHOT.jar to F:\jenkins\jenkins-slave\workspace\maven-box_maven-scm_SCM-797-TSNF7ZXLGM4LUVYJCJU2O25GA4EZKSADD3776FMZEGJH3QG3LZLQ\m\maven-scm-plugin\target\local-repo\org\apache\maven\scm\maven-scm-provider-cvstest\1.9.6-SNAPSHOT\maven-scm-provider-cvstest-1.9.6-SNAPSHOT.jar
[windows-jdk9] [INFO] Installing F:\jenkins\jenkins-slave\workspace\maven-box_maven-scm_SCM-797-TSNF7ZXLGM4LUVYJCJU2O25GA4EZKSADD3776FMZEGJH3QG3LZLQ\m\maven-scm-providers\maven-scm-providers-cvs\maven-scm-provider-cvs-commons\pom.xml to F:\jenkins\jenkins-slave\workspace\maven-box_maven-scm_SCM-797-TSNF7ZXLGM4LUVYJCJU2O25GA4EZKSADD3776FMZEGJH3QG3LZLQ\m\maven-scm-plugin\target\local-repo\org\apache\maven\scm\maven-scm-provider-cvs-commons\1.9.6-SNAPSHOT\maven-scm-provider-cvs-commons-1.9.6-SNAPSHOT.pom
[windows-jdk9] [INFO] Installing F:\jenkins\jenkins-slave\workspace\maven-box_maven-scm_SCM-797-TSNF7ZXLGM4LUVYJCJU2O25GA4EZKSADD3776FMZEGJH3QG3LZLQ\m\maven-scm-providers\maven-scm-providers-cvs\maven-scm-provider-cvs-commons\target\maven-scm-provider-cvs-commons-1.9.6-SNAPSHOT.jar to F:\jenkins\jenkins-slave\workspace\maven-box_maven-scm_SCM-797-TSNF7ZXLGM4LUVYJCJU2O25GA4EZKSADD3776FMZEGJH3QG3LZLQ\m\maven-scm-plugin\target\local-repo\org\apache\maven\scm\maven-scm-provider-cvs-commons\1.9.6-SNAPSHOT\maven-scm-provider-cvs-commons-1.9.6-SNAPSHOT.jar
[windows-jdk9] [INFO] Installing F:\jenkins\jenkins-slave\workspace\maven-box_maven-scm_SCM-797-TSNF7ZXLGM4LUVYJCJU2O25GA4EZKSADD3776FMZEGJH3QG3LZLQ\m\maven-scm-providers\maven-scm-providers-cvs\maven-scm-provider-cvsexe\pom.xml to F:\jenkins\jenkins-slave\workspace\maven-box_maven-scm_SCM-797-TSNF7ZXLGM4LUVYJCJU2O25GA4EZKSADD3776FMZEGJH3QG3LZLQ\m\maven-scm-plugin\target\local-repo\org\apache\maven\scm\maven-scm-provider-cvsexe\1.9.6-SNAPSHOT\maven-scm-provider-cvsexe-1.9.6-SNAPSHOT.pom
[windows-jdk9] [INFO] Installing F:\jenkins\jenkins-slave\workspace\maven-box_maven-scm_SCM-797-TSNF7ZXLGM4LUVYJCJU2O25GA4EZKSADD3776FMZEGJH3QG3LZLQ\m\maven-scm-providers\maven-scm-providers-cvs\maven-scm-provider-cvsexe\target\maven-scm-provider-cvsexe-1.9.6-SNAPSHOT.jar to F:\jenkins\jenkins-slave\workspace\maven-box_maven-scm_SCM-797-TSNF7ZXLGM4LUVYJCJU2O25GA4EZKSADD3776FMZEGJH3QG3LZLQ\m\maven-scm-plugin\target\local-repo\org\apache\maven\scm\maven-scm-provider-cvsexe\1.9.6-SNAPSHOT\maven-scm-provider-cvsexe-1.9.6-SNAPSHOT.jar
[windows-jdk9] [INFO] Installing F:\jenkins\jenkins-slave\workspace\maven-box_maven-scm_SCM-797-TSNF7ZXLGM4LUVYJCJU2O25GA4EZKSADD3776FMZEGJH3QG3LZLQ\m\maven-scm-providers\maven-scm-providers-cvs\maven-scm-provider-cvsjava\pom.xml to F:\jenkins\jenkins-slave\workspace\maven-box_maven-scm_SCM-797-TSNF7ZXLGM4LUVYJCJU2O25GA4EZKSADD3776FMZEGJH3QG3LZLQ\m\maven-scm-plugin\target\local-repo\org\apache\maven\scm\maven-scm-provider-cvsjava\1.9.6-SNAPSHOT\maven-scm-provider-cvsjava-1.9.6-SNAPSHOT.pom
[windows-jdk9] [INFO] Installing F:\jenkins\jenkins-slave\workspace\maven-box_maven-scm_SCM-797-TSNF7ZXLGM4LUVYJCJU2O25GA4EZKSADD3776FMZEGJH3QG3LZLQ\m\maven-scm-providers\maven-scm-providers-cvs\maven-scm-provider-cvsjava\target\maven-scm-provider-cvsjava-1.9.6-SNAPSHOT.jar to F:\jenkins\jenkins-slave\workspace\maven-box_maven-scm_SCM-797-TSNF7ZXLGM4LUVYJCJU2O25GA4EZKSADD3776FMZEGJH3QG3LZLQ\m\maven-scm-plugin\target\local-repo\org\apache\maven\scm\maven-scm-provider-cvsjava\1.9.6-SNAPSHOT\maven-scm-provider-cvsjava-1.9.6-SNAPSHOT.jar
[windows-jdk9] [INFO] Installing F:\jenkins\jenkins-slave\workspace\maven-box_maven-scm_SCM-797-TSNF7ZXLGM4LUVYJCJU2O25GA4EZKSADD3776FMZEGJH3QG3LZLQ\m\maven-scm-providers\maven-scm-provider-hg\pom.xml to F:\jenkins\jenkins-slave\workspace\maven-box_maven-scm_SCM-797-TSNF7ZXLGM4LUVYJCJU2O25GA4EZKSADD3776FMZEGJH3QG3LZLQ\m\maven-scm-plugin\target\local-repo\org\apache\maven\scm\maven-scm-provider-hg\1.9.6-SNAPSHOT\maven-scm-provider-hg-1.9.6-SNAPSHOT.pom
[windows-jdk9] [INFO] Installing F:\jenkins\jenkins-slave\workspace\maven-box_maven-scm_SCM-797-TSNF7ZXLGM4LUVYJCJU2O25GA4EZKSADD3776FMZEGJH3QG3LZLQ\m\maven-scm-providers\maven-scm-provider-hg\target\maven-scm-provider-hg-1.9.6-SNAPSHOT.jar to F:\jenkins\jenkins-slave\workspace\maven-box_maven-scm_SCM-797-TSNF7ZXLGM4LUVYJCJU2O25GA4EZKSADD3776FMZEGJH3QG3LZLQ\m\maven-scm-plugin\target\local-repo\org\apache\maven\scm\maven-scm-provider-hg\1.9.6-SNAPSHOT\maven-scm-provider-hg-1.9.6-SNAPSHOT.jar
[windows-jdk9] [INFO] Installing F:\jenkins\jenkins-slave\workspace\maven-box_maven-scm_SCM-797-TSNF7ZXLGM4LUVYJCJU2O25GA4EZKSADD3776FMZEGJH3QG3LZLQ\m\maven-scm-providers\maven-scm-providers-git\pom.xml to F:\jenkins\jenkins-slave\workspace\maven-box_maven-scm_SCM-797-TSNF7ZXLGM4LUVYJCJU2O25GA4EZKSADD3776FMZEGJH3QG3LZLQ\m\maven-scm-plugin\target\local-repo\org\apache\maven\scm\maven-scm-providers-git\1.9.6-SNAPSHOT\maven-scm-providers-git-1.9.6-SNAPSHOT.pom
[windows-jdk9] [INFO] Installing F:\jenkins\jenkins-slave\workspace\maven-box_maven-scm_SCM-797-TSNF7ZXLGM4LUVYJCJU2O25GA4EZKSADD3776FMZEGJH3QG3LZLQ\m\maven-scm-providers\maven-scm-providers-git\target\maven-scm-providers-git-1.9.6-SNAPSHOT-site.xml to F:\jenkins\jenkins-slave\workspace\maven-box_maven-scm_SCM-797-TSNF7ZXLGM4LUVYJCJU2O25GA4EZKSADD3776FMZEGJH3QG3LZLQ\m\maven-scm-plugin\target\local-repo\org\apache\maven\scm\maven-scm-providers-git\1.9.6-SNAPSHOT\maven-scm-providers-git-1.9.6-SNAPSHOT-site.xml
[windows-jdk9] [INFO] Installing F:\jenkins\jenkins-slave\workspace\maven-box_maven-scm_SCM-797-TSNF7ZXLGM4LUVYJCJU2O25GA4EZKSADD3776FMZEGJH3QG3LZLQ\m\maven-scm-providers\maven-scm-providers-git\maven-scm-provider-git-commons\pom.xml to F:\jenkins\jenkins-slave\workspace\maven-box_maven-scm_SCM-797-TSNF7ZXLGM4LUVYJCJU2O25GA4EZKSADD3776FMZEGJH3QG3LZLQ\m\maven-scm-plugin\target\local-repo\org\apache\maven\scm\maven-scm-provider-git-commons\1.9.6-SNAPSHOT\maven-scm-provider-git-commons-1.9.6-SNAPSHOT.pom
[windows-jdk9] [INFO] Installing F:\jenkins\jenkins-slave\workspace\maven-box_maven-scm_SCM-797-TSNF7ZXLGM4LUVYJCJU2O25GA4EZKSADD3776FMZEGJH3QG3LZLQ\m\maven-scm-providers\maven-scm-providers-git\maven-scm-provider-git-commons\target\maven-scm-provider-git-commons-1.9.6-SNAPSHOT.jar to F:\jenkins\jenkins-slave\workspace\maven-box_maven-scm_SCM-797-TSNF7ZXLGM4LUVYJCJU2O25GA4EZKSADD3776FMZEGJH3QG3LZLQ\m\maven-scm-plugin\target\local-repo\org\apache\maven\scm\maven-scm-provider-git-commons\1.9.6-SNAPSHOT\maven-scm-provider-git-commons-1.9.6-SNAPSHOT.jar
[windows-jdk9] [INFO] Installing F:\jenkins\jenkins-slave\workspace\maven-box_maven-scm_SCM-797-TSNF7ZXLGM4LUVYJCJU2O25GA4EZKSADD3776FMZEGJH3QG3LZLQ\m\maven-scm-providers\maven-scm-providers-git\maven-scm-provider-gittest\pom.xml to F:\jenkins\jenkins-slave\workspace\maven-box_maven-scm_SCM-797-TSNF7ZXLGM4LUVYJCJU2O25GA4EZKSADD3776FMZEGJH3QG3LZLQ\m\maven-scm-plugin\target\local-repo\org\apache\maven\scm\maven-scm-provider-gittest\1.9.6-SNAPSHOT\maven-scm-provider-gittest-1.9.6-SNAPSHOT.pom
[windows-jdk9] [INFO] Installing F:\jenkins\jenkins-slave\workspace\maven-box_maven-scm_SCM-797-TSNF7ZXLGM4LUVYJCJU2O25GA4EZKSADD3776FMZEGJH3QG3LZLQ\m\maven-scm-providers\maven-scm-providers-git\maven-scm-provider-gittest\target\maven-scm-provider-gittest-1.9.6-SNAPSHOT.jar to F:\jenkins\jenkins-slave\workspace\maven-box_maven-scm_SCM-797-TSNF7ZXLGM4LUVYJCJU2O25GA4EZKSADD3776FMZEGJH3QG3LZLQ\m\maven-scm-plugin\target\local-repo\org\apache\maven\scm\maven-scm-provider-gittest\1.9.6-SNAPSHOT\maven-scm-provider-gittest-1.9.6-SNAPSHOT.jar
[windows-jdk9] [INFO] Installing F:\jenkins\jenkins-slave\workspace\maven-box_maven-scm_SCM-797-TSNF7ZXLGM4LUVYJCJU2O25GA4EZKSADD3776FMZEGJH3QG3LZLQ\m\maven-scm-providers\maven-scm-providers-git\maven-scm-provider-gitexe\pom.xml to F:\jenkins\jenkins-slave\workspace\maven-box_maven-scm_SCM-797-TSNF7ZXLGM4LUVYJCJU2O25GA4EZKSADD3776FMZEGJH3QG3LZLQ\m\maven-scm-plugin\target\local-repo\org\apache\maven\scm\maven-scm-provider-gitexe\1.9.6-SNAPSHOT\maven-scm-provider-gitexe-1.9.6-SNAPSHOT.pom
[windows-jdk9] [INFO] Installing F:\jenkins\jenkins-slave\workspace\maven-box_maven-scm_SCM-797-TSNF7ZXLGM4LUVYJCJU2O25GA4EZKSADD3776FMZEGJH3QG3LZLQ\m\maven-scm-providers\maven-scm-providers-git\maven-scm-provider-gitexe\target\maven-scm-provider-gitexe-1.9.6-SNAPSHOT.jar to F:\jenkins\jenkins-slave\workspace\maven-box_maven-scm_SCM-797-TSNF7ZXLGM4LUVYJCJU2O25GA4EZKSADD3776FMZEGJH3QG3LZLQ\m\maven-scm-plugin\target\local-repo\org\apache\maven\scm\maven-scm-provider-gitexe\1.9.6-SNAPSHOT\maven-scm-provider-gitexe-1.9.6-SNAPSHOT.jar
[windows-jdk9] [INFO] Installing F:\jenkins\jenkins-slave\workspace\maven-box_maven-scm_SCM-797-TSNF7ZXLGM4LUVYJCJU2O25GA4EZKSADD3776FMZEGJH3QG3LZLQ\m\maven-scm-providers\maven-scm-providers-git\maven-scm-provider-jgit\pom.xml to F:\jenkins\jenkins-slave\workspace\maven-box_maven-scm_SCM-797-TSNF7ZXLGM4LUVYJCJU2O25GA4EZKSADD3776FMZEGJH3QG3LZLQ\m\maven-scm-plugin\target\local-repo\org\apache\maven\scm\maven-scm-provider-jgit\1.9.6-SNAPSHOT\maven-scm-provider-jgit-1.9.6-SNAPSHOT.pom
[windows-jdk9] [INFO] Installing F:\jenkins\jenkins-slave\workspace\maven-box_maven-scm_SCM-797-TSNF7ZXLGM4LUVYJCJU2O25GA4EZKSADD3776FMZEGJH3QG3LZLQ\m\maven-scm-providers\maven-scm-providers-git\maven-scm-provider-jgit\target\maven-scm-provider-jgit-1.9.6-SNAPSHOT.jar to F:\jenkins\jenkins-slave\workspace\maven-box_maven-scm_SCM-797-TSNF7ZXLGM4LUVYJCJU2O25GA4EZKSADD3776FMZEGJH3QG3LZLQ\m\maven-scm-plugin\target\local-repo\org\apache\maven\scm\maven-scm-provider-jgit\1.9.6-SNAPSHOT\maven-scm-provider-jgit-1.9.6-SNAPSHOT.jar
[windows-jdk9] [INFO] Installing F:\jenkins\jenkins-slave\workspace\maven-box_maven-scm_SCM-797-TSNF7ZXLGM4LUVYJCJU2O25GA4EZKSADD3776FMZEGJH3QG3LZLQ\m\maven-scm-providers\maven-scm-provider-local\pom.xml to F:\jenkins\jenkins-slave\workspace\maven-box_maven-scm_SCM-797-TSNF7ZXLGM4LUVYJCJU2O25GA4EZKSADD3776FMZEGJH3QG3LZLQ\m\maven-scm-plugin\target\local-repo\org\apache\maven\scm\maven-scm-provider-local\1.9.6-SNAPSHOT\maven-scm-provider-local-1.9.6-SNAPSHOT.pom
[windows-jdk9] [INFO] Installing F:\jenkins\jenkins-slave\workspace\maven-box_maven-scm_SCM-797-TSNF7ZXLGM4LUVYJCJU2O25GA4EZKSADD3776FMZEGJH3QG3LZLQ\m\maven-scm-providers\maven-scm-provider-local\target\maven-scm-provider-local-1.9.6-SNAPSHOT.jar to F:\jenkins\jenkins-slave\workspace\maven-box_maven-scm_SCM-797-TSNF7ZXLGM4LUVYJCJU2O25GA4EZKSADD3776FMZEGJH3QG3LZLQ\m\maven-scm-plugin\target\local-repo\org\apache\maven\scm\maven-scm-provider-local\1.9.6-SNAPSHOT\maven-scm-provider-local-1.9.6-SNAPSHOT.jar
[windows-jdk9] [INFO] Installing F:\jenkins\jenkins-slave\workspace\maven-box_maven-scm_SCM-797-TSNF7ZXLGM4LUVYJCJU2O25GA4EZKSADD3776FMZEGJH3QG3LZLQ\m\maven-scm-providers\maven-scm-provider-perforce\pom.xml to F:\jenkins\jenkins-slave\workspace\maven-box_maven-scm_SCM-797-TSNF7ZXLGM4LUVYJCJU2O25GA4EZKSADD3776FMZEGJH3QG3LZLQ\m\maven-scm-plugin\target\local-repo\org\apache\maven\scm\maven-scm-provider-perforce\1.9.6-SNAPSHOT\maven-scm-provider-perforce-1.9.6-SNAPSHOT.pom
[windows-jdk9] [INFO] Installing F:\jenkins\jenkins-slave\workspace\maven-box_maven-scm_SCM-797-TSNF7ZXLGM4LUVYJCJU2O25GA4EZKSADD3776FMZEGJH3QG3LZLQ\m\maven-scm-providers\maven-scm-provider-perforce\target\maven-scm-provider-perforce-1.9.6-SNAPSHOT.jar to F:\jenkins\jenkins-slave\workspace\maven-box_maven-scm_SCM-797-TSNF7ZXLGM4LUVYJCJU2O25GA4EZKSADD3776FMZEGJH3QG3LZLQ\m\maven-scm-plugin\target\local-repo\org\apache\maven\scm\maven-scm-provider-perforce\1.9.6-SNAPSHOT\maven-scm-provider-perforce-1.9.6-SNAPSHOT.jar
[windows-jdk9] [INFO] Installing F:\jenkins\jenkins-slave\workspace\maven-box_maven-scm_SCM-797-TSNF7ZXLGM4LUVYJCJU2O25GA4EZKSADD3776FMZEGJH3QG3LZLQ\m\maven-scm-providers\maven-scm-provider-starteam\pom.xml to F:\jenkins\jenkins-slave\workspace\maven-box_maven-scm_SCM-797-TSNF7ZXLGM4LUVYJCJU2O25GA4EZKSADD3776FMZEGJH3QG3LZLQ\m\maven-scm-plugin\target\local-repo\org\apache\maven\scm\maven-scm-provider-starteam\1.9.6-SNAPSHOT\maven-scm-provider-starteam-1.9.6-SNAPSHOT.pom
[windows-jdk9] [INFO] Installing F:\jenkins\jenkins-slave\workspace\maven-box_maven-scm_SCM-797-TSNF7ZXLGM4LUVYJCJU2O25GA4EZKSADD3776FMZEGJH3QG3LZLQ\m\maven-scm-providers\maven-scm-provider-starteam\target\maven-scm-provider-starteam-1.9.6-SNAPSHOT.jar to F:\jenkins\jenkins-slave\workspace\maven-box_maven-scm_SCM-797-TSNF7ZXLGM4LUVYJCJU2O25GA4EZKSADD3776FMZEGJH3QG3LZLQ\m\maven-scm-plugin\target\local-repo\org\apache\maven\scm\maven-scm-provider-starteam\1.9.6-SNAPSHOT\maven-scm-provider-starteam-1.9.6-SNAPSHOT.jar
[windows-jdk9] [INFO] Installing F:\jenkins\jenkins-slave\workspace\maven-box_maven-scm_SCM-797-TSNF7ZXLGM4LUVYJCJU2O25GA4EZKSADD3776FMZEGJH3QG3LZLQ\m\maven-scm-providers\maven-scm-providers-svn\pom.xml to F:\jenkins\jenkins-slave\workspace\maven-box_maven-scm_SCM-797-TSNF7ZXLGM4LUVYJCJU2O25GA4EZKSADD3776FMZEGJH3QG3LZLQ\m\maven-scm-plugin\target\local-repo\org\apache\maven\scm\maven-scm-providers-svn\1.9.6-SNAPSHOT\maven-scm-providers-svn-1.9.6-SNAPSHOT.pom
[windows-jdk9] [INFO] Installing F:\jenkins\jenkins-slave\workspace\maven-box_maven-scm_SCM-797-TSNF7ZXLGM4LUVYJCJU2O25GA4EZKSADD3776FMZEGJH3QG3LZLQ\m\maven-scm-providers\maven-scm-providers-svn\target\maven-scm-providers-svn-1.9.6-SNAPSHOT-site.xml to F:\jenkins\jenkins-slave\workspace\maven-box_maven-scm_SCM-797-TSNF7ZXLGM4LUVYJCJU2O25GA4EZKSADD3776FMZEGJH3QG3LZLQ\m\maven-scm-plugin\target\local-repo\org\apache\maven\scm\maven-scm-providers-svn\1.9.6-SNAPSHOT\maven-scm-providers-svn-1.9.6-SNAPSHOT-site.xml
[windows-jdk9] [INFO] Installing F:\jenkins\jenkins-slave\workspace\maven-box_maven-scm_SCM-797-TSNF7ZXLGM4LUVYJCJU2O25GA4EZKSADD3776FMZEGJH3QG3LZLQ\m\maven-scm-providers\maven-scm-providers-svn\maven-scm-provider-svn-commons\pom.xml to F:\jenkins\jenkins-slave\workspace\maven-box_maven-scm_SCM-797-TSNF7ZXLGM4LUVYJCJU2O25GA4EZKSADD3776FMZEGJH3QG3LZLQ\m\maven-scm-plugin\target\local-repo\org\apache\maven\scm\maven-scm-provider-svn-commons\1.9.6-SNAPSHOT\maven-scm-provider-svn-commons-1.9.6-SNAPSHOT.pom
[windows-jdk9] [INFO] Installing F:\jenkins\jenkins-slave\workspace\maven-box_maven-scm_SCM-797-TSNF7ZXLGM4LUVYJCJU2O25GA4EZKSADD3776FMZEGJH3QG3LZLQ\m\maven-scm-providers\maven-scm-providers-svn\maven-scm-provider-svn-commons\target\maven-scm-provider-svn-commons-1.9.6-SNAPSHOT.jar to F:\jenkins\jenkins-slave\workspace\maven-box_maven-scm_SCM-797-TSNF7ZXLGM4LUVYJCJU2O25GA4EZKSADD3776FMZEGJH3QG3LZLQ\m\maven-scm-plugin\target\local-repo\org\apache\maven\scm\maven-scm-provider-svn-commons\1.9.6-SNAPSHOT\maven-scm-provider-svn-commons-1.9.6-SNAPSHOT.jar
[windows-jdk9] [INFO] Installing F:\jenkins\jenkins-slave\workspace\maven-box_maven-scm_SCM-797-TSNF7ZXLGM4LUVYJCJU2O25GA4EZKSADD3776FMZEGJH3QG3LZLQ\m\maven-scm-providers\maven-scm-providers-svn\maven-scm-provider-svntest\pom.xml to F:\jenkins\jenkins-slave\workspace\maven-box_maven-scm_SCM-797-TSNF7ZXLGM4LUVYJCJU2O25GA4EZKSADD3776FMZEGJH3QG3LZLQ\m\maven-scm-plugin\target\local-repo\org\apache\maven\scm\maven-scm-provider-svntest\1.9.6-SNAPSHOT\maven-scm-provider-svntest-1.9.6-SNAPSHOT.pom
[windows-jdk9] [INFO] Installing F:\jenkins\jenkins-slave\workspace\maven-box_maven-scm_SCM-797-TSNF7ZXLGM4LUVYJCJU2O25GA4EZKSADD3776FMZEGJH3QG3LZLQ\m\maven-scm-providers\maven-scm-providers-svn\maven-scm-provider-svntest\target\maven-scm-provider-svntest-1.9.6-SNAPSHOT.jar to F:\jenkins\jenkins-slave\workspace\maven-box_maven-scm_SCM-797-TSNF7ZXLGM4LUVYJCJU2O25GA4EZKSADD3776FMZEGJH3QG3LZLQ\m\maven-scm-plugin\target\local-repo\org\apache\maven\scm\maven-scm-provider-svntest\1.9.6-SNAPSHOT\maven-scm-provider-svntest-1.9.6-SNAPSHOT.jar
[windows-jdk9] [INFO] Installing F:\jenkins\jenkins-slave\workspace\maven-box_maven-scm_SCM-797-TSNF7ZXLGM4LUVYJCJU2O25GA4EZKSADD3776FMZEGJH3QG3LZLQ\m\maven-scm-providers\maven-scm-providers-svn\maven-scm-provider-svnexe\pom.xml to F:\jenkins\jenkins-slave\workspace\maven-box_maven-scm_SCM-797-TSNF7ZXLGM4LUVYJCJU2O25GA4EZKSADD3776FMZEGJH3QG3LZLQ\m\maven-scm-plugin\target\local-repo\org\apache\maven\scm\maven-scm-provider-svnexe\1.9.6-SNAPSHOT\maven-scm-provider-svnexe-1.9.6-SNAPSHOT.pom
[windows-jdk9] [INFO] Installing F:\jenkins\jenkins-slave\workspace\maven-box_maven-scm_SCM-797-TSNF7ZXLGM4LUVYJCJU2O25GA4EZKSADD3776FMZEGJH3QG3LZLQ\m\maven-scm-providers\maven-scm-providers-svn\maven-scm-provider-svnexe\target\maven-scm-provider-svnexe-1.9.6-SNAPSHOT.jar to F:\jenkins\jenkins-slave\workspace\maven-box_maven-scm_SCM-797-TSNF7ZXLGM4LUVYJCJU2O25GA4EZKSADD3776FMZEGJH3QG3LZLQ\m\maven-scm-plugin\target\local-repo\org\apache\maven\scm\maven-scm-provider-svnexe\1.9.6-SNAPSHOT\maven-scm-provider-svnexe-1.9.6-SNAPSHOT.jar
[windows-jdk9] [INFO] Installing F:\jenkins\jenkins-slave\workspace\maven-box_maven-scm_SCM-797-TSNF7ZXLGM4LUVYJCJU2O25GA4EZKSADD3776FMZEGJH3QG3LZLQ\m\maven-scm-providers\maven-scm-provider-synergy\pom.xml to F:\jenkins\jenkins-slave\workspace\maven-box_maven-scm_SCM-797-TSNF7ZXLGM4LUVYJCJU2O25GA4EZKSADD3776FMZEGJH3QG3LZLQ\m\maven-scm-plugin\target\local-repo\org\apache\maven\scm\maven-scm-provider-synergy\1.9.6-SNAPSHOT\maven-scm-provider-synergy-1.9.6-SNAPSHOT.pom
[windows-jdk9] [INFO] Installing F:\jenkins\jenkins-slave\workspace\maven-box_maven-scm_SCM-797-TSNF7ZXLGM4LUVYJCJU2O25GA4EZKSADD3776FMZEGJH3QG3LZLQ\m\maven-scm-providers\maven-scm-provider-synergy\target\maven-scm-provider-synergy-1.9.6-SNAPSHOT.jar to F:\jenkins\jenkins-slave\workspace\maven-box_maven-scm_SCM-797-TSNF7ZXLGM4LUVYJCJU2O25GA4EZKSADD3776FMZEGJH3QG3LZLQ\m\maven-scm-plugin\target\local-repo\org\apache\maven\scm\maven-scm-provider-synergy\1.9.6-SNAPSHOT\maven-scm-provider-synergy-1.9.6-SNAPSHOT.jar
[windows-jdk9] [INFO] Installing F:\jenkins\jenkins-slave\workspace\maven-box_maven-scm_SCM-797-TSNF7ZXLGM4LUVYJCJU2O25GA4EZKSADD3776FMZEGJH3QG3LZLQ\m\maven-scm-providers\maven-scm-provider-vss\pom.xml to F:\jenkins\jenkins-slave\workspace\maven-box_maven-scm_SCM-797-TSNF7ZXLGM4LUVYJCJU2O25GA4EZKSADD3776FMZEGJH3QG3LZLQ\m\maven-scm-plugin\target\local-repo\org\apache\maven\scm\maven-scm-provider-vss\1.9.6-SNAPSHOT\maven-scm-provider-vss-1.9.6-SNAPSHOT.pom
[windows-jdk9] [INFO] Installing F:\jenkins\jenkins-slave\workspace\maven-box_maven-scm_SCM-797-TSNF7ZXLGM4LUVYJCJU2O25GA4EZKSADD3776FMZEGJH3QG3LZLQ\m\maven-scm-providers\maven-scm-provider-vss\target\maven-scm-provider-vss-1.9.6-SNAPSHOT.jar to F:\jenkins\jenkins-slave\workspace\maven-box_maven-scm_SCM-797-TSNF7ZXLGM4LUVYJCJU2O25GA4EZKSADD3776FMZEGJH3QG3LZLQ\m\maven-scm-plugin\target\local-repo\org\apache\maven\scm\maven-scm-provider-vss\1.9.6-SNAPSHOT\maven-scm-provider-vss-1.9.6-SNAPSHOT.jar
[windows-jdk9] [INFO] Installing F:\jenkins\jenkins-slave\workspace\maven-box_maven-scm_SCM-797-TSNF7ZXLGM4LUVYJCJU2O25GA4EZKSADD3776FMZEGJH3QG3LZLQ\m\maven-scm-providers\maven-scm-provider-tfs\pom.xml to F:\jenkins\jenkins-slave\workspace\maven-box_maven-scm_SCM-797-TSNF7ZXLGM4LUVYJCJU2O25GA4EZKSADD3776FMZEGJH3QG3LZLQ\m\maven-scm-plugin\target\local-repo\org\apache\maven\scm\maven-scm-provider-tfs\1.9.6-SNAPSHOT\maven-scm-provider-tfs-1.9.6-SNAPSHOT.pom
[windows-jdk9] [INFO] Installing F:\jenkins\jenkins-slave\workspace\maven-box_maven-scm_SCM-797-TSNF7ZXLGM4LUVYJCJU2O25GA4EZKSADD3776FMZEGJH3QG3LZLQ\m\maven-scm-providers\maven-scm-provider-tfs\target\maven-scm-provider-tfs-1.9.6-SNAPSHOT.jar to F:\jenkins\jenkins-slave\workspace\maven-box_maven-scm_SCM-797-TSNF7ZXLGM4LUVYJCJU2O25GA4EZKSADD3776FMZEGJH3QG3LZLQ\m\maven-scm-plugin\target\local-repo\org\apache\maven\scm\maven-scm-provider-tfs\1.9.6-SNAPSHOT\maven-scm-provider-tfs-1.9.6-SNAPSHOT.jar
[windows-jdk9] [INFO] Installing F:\jenkins\jenkins-slave\workspace\maven-box_maven-scm_SCM-797-TSNF7ZXLGM4LUVYJCJU2O25GA4EZKSADD3776FMZEGJH3QG3LZLQ\m\maven-scm-providers\maven-scm-provider-integrity\pom.xml to F:\jenkins\jenkins-slave\workspace\maven-box_maven-scm_SCM-797-TSNF7ZXLGM4LUVYJCJU2O25GA4EZKSADD3776FMZEGJH3QG3LZLQ\m\maven-scm-plugin\target\local-repo\org\apache\maven\scm\maven-scm-provider-integrity\1.9.6-SNAPSHOT\maven-scm-provider-integrity-1.9.6-SNAPSHOT.pom
[windows-jdk9] [INFO] Installing F:\jenkins\jenkins-slave\workspace\maven-box_maven-scm_SCM-797-TSNF7ZXLGM4LUVYJCJU2O25GA4EZKSADD3776FMZEGJH3QG3LZLQ\m\maven-scm-providers\maven-scm-provider-integrity\target\maven-scm-provider-integrity-1.9.6-SNAPSHOT.jar to F:\jenkins\jenkins-slave\workspace\maven-box_maven-scm_SCM-797-TSNF7ZXLGM4LUVYJCJU2O25GA4EZKSADD3776FMZEGJH3QG3LZLQ\m\maven-scm-plugin\target\local-repo\org\apache\maven\scm\maven-scm-provider-integrity\1.9.6-SNAPSHOT\maven-scm-provider-integrity-1.9.6-SNAPSHOT.jar
[windows-jdk9] [INFO] Installing F:\jenkins\jenkins-slave\workspace\maven-box_maven-scm_SCM-797-TSNF7ZXLGM4LUVYJCJU2O25GA4EZKSADD3776FMZEGJH3QG3LZLQ\m\maven-scm-providers\maven-scm-provider-jazz\pom.xml to F:\jenkins\jenkins-slave\workspace\maven-box_maven-scm_SCM-797-TSNF7ZXLGM4LUVYJCJU2O25GA4EZKSADD3776FMZEGJH3QG3LZLQ\m\maven-scm-plugin\target\local-repo\org\apache\maven\scm\maven-scm-provider-jazz\1.9.6-SNAPSHOT\maven-scm-provider-jazz-1.9.6-SNAPSHOT.pom
[windows-jdk9] [INFO] Installing F:\jenkins\jenkins-slave\workspace\maven-box_maven-scm_SCM-797-TSNF7ZXLGM4LUVYJCJU2O25GA4EZKSADD3776FMZEGJH3QG3LZLQ\m\maven-scm-providers\maven-scm-provider-jazz\target\maven-scm-provider-jazz-1.9.6-SNAPSHOT.jar to F:\jenkins\jenkins-slave\workspace\maven-box_maven-scm_SCM-797-TSNF7ZXLGM4LUVYJCJU2O25GA4EZKSADD3776FMZEGJH3QG3LZLQ\m\maven-scm-plugin\target\local-repo\org\apache\maven\scm\maven-scm-provider-jazz\1.9.6-SNAPSHOT\maven-scm-provider-jazz-1.9.6-SNAPSHOT.jar
[windows-jdk9] [INFO] Installing F:\jenkins\jenkins-slave\workspace\maven-box_maven-scm_SCM-797-TSNF7ZXLGM4LUVYJCJU2O25GA4EZKSADD3776FMZEGJH3QG3LZLQ\m\maven-scm-providers\maven-scm-providers-standard\pom.xml to F:\jenkins\jenkins-slave\workspace\maven-box_maven-scm_SCM-797-TSNF7ZXLGM4LUVYJCJU2O25GA4EZKSADD3776FMZEGJH3QG3LZLQ\m\maven-scm-plugin\target\local-repo\org\apache\maven\scm\maven-scm-providers-standard\1.9.6-SNAPSHOT\maven-scm-providers-standard-1.9.6-SNAPSHOT.pom
[windows-jdk9] [INFO] Installing F:\jenkins\jenkins-slave\workspace\maven-box_maven-scm_SCM-797-TSNF7ZXLGM4LUVYJCJU2O25GA4EZKSADD3776FMZEGJH3QG3LZLQ\m\maven-scm-client\pom.xml to F:\jenkins\jenkins-slave\workspace\maven-box_maven-scm_SCM-797-TSNF7ZXLGM4LUVYJCJU2O25GA4EZKSADD3776FMZEGJH3QG3LZLQ\m\maven-scm-plugin\target\local-repo\org\apache\maven\scm\maven-scm-client\1.9.6-SNAPSHOT\maven-scm-client-1.9.6-SNAPSHOT.pom
[windows-jdk9] [INFO] Installing F:\jenkins\jenkins-slave\workspace\maven-box_maven-scm_SCM-797-TSNF7ZXLGM4LUVYJCJU2O25GA4EZKSADD3776FMZEGJH3QG3LZLQ\m\maven-scm-client\target\maven-scm-client-1.9.6-SNAPSHOT.jar to F:\jenkins\jenkins-slave\workspace\maven-box_maven-scm_SCM-797-TSNF7ZXLGM4LUVYJCJU2O25GA4EZKSADD3776FMZEGJH3QG3LZLQ\m\maven-scm-plugin\target\local-repo\org\apache\maven\scm\maven-scm-client\1.9.6-SNAPSHOT\maven-scm-client-1.9.6-SNAPSHOT.jar
[windows-jdk9] [INFO] Installing F:\jenkins\jenkins-slave\workspace\maven-box_maven-scm_SCM-797-TSNF7ZXLGM4LUVYJCJU2O25GA4EZKSADD3776FMZEGJH3QG3LZLQ\m\maven-scm-client\target\maven-scm-client-1.9.6-SNAPSHOT-jar-with-dependencies.jar to F:\jenkins\jenkins-slave\workspace\maven-box_maven-scm_SCM-797-TSNF7ZXLGM4LUVYJCJU2O25GA4EZKSADD3776FMZEGJH3QG3LZLQ\m\maven-scm-plugin\target\local-repo\org\apache\maven\scm\maven-scm-client\1.9.6-SNAPSHOT\maven-scm-client-1.9.6-SNAPSHOT-jar-with-dependencies.jar
[windows-jdk9] [INFO] Installing F:\jenkins\jenkins-slave\workspace\maven-box_maven-scm_SCM-797-TSNF7ZXLGM4LUVYJCJU2O25GA4EZKSADD3776FMZEGJH3QG3LZLQ\m\maven-scm-plugin\pom.xml to F:\jenkins\jenkins-slave\workspace\maven-box_maven-scm_SCM-797-TSNF7ZXLGM4LUVYJCJU2O25GA4EZKSADD3776FMZEGJH3QG3LZLQ\m\maven-scm-plugin\target\local-repo\org\apache\maven\plugins\maven-scm-plugin\1.9.6-SNAPSHOT\maven-scm-plugin-1.9.6-SNAPSHOT.pom
[windows-jdk9] [INFO] Installing F:\jenkins\jenkins-slave\workspace\maven-box_maven-scm_SCM-797-TSNF7ZXLGM4LUVYJCJU2O25GA4EZKSADD3776FMZEGJH3QG3LZLQ\m\maven-scm-plugin\target\maven-scm-plugin-1.9.6-SNAPSHOT.jar to F:\jenkins\jenkins-slave\workspace\maven-box_maven-scm_SCM-797-TSNF7ZXLGM4LUVYJCJU2O25GA4EZKSADD3776FMZEGJH3QG3LZLQ\m\maven-scm-plugin\target\local-repo\org\apache\maven\plugins\maven-scm-plugin\1.9.6-SNAPSHOT\maven-scm-plugin-1.9.6-SNAPSHOT.jar
[windows-jdk9] [INFO]
[windows-jdk9] [INFO] --- maven-invoker-plugin:2.0.0:run (integration-test) @ maven-scm-plugin ---
[windows-jdk9] [INFO] No projects were selected for execution.
[windows-jdk9] [INFO]
[windows-jdk9] [INFO] --- maven-checkstyle-plugin:2.15:check (checkstyle-check) @ maven-scm-plugin ---
[windows-jdk9] [INFO] There are 5 errors reported by Checkstyle 6.1.1 with config/maven_checks.xml ruleset.
[windows-jdk9] [ERROR] src\main\java\org\apache\maven\scm\plugin\BootstrapMojo.java[3] (header) RegexpHeader: Line does not match expected header line of '^/\*\s*$'.
[windows-jdk9] [ERROR] src\main\java\org\apache\maven\scm\plugin\BootstrapMojo.java[72:53] (whitespace) WhitespaceAround: '=' is not preceded with whitespace.
[windows-jdk9] [ERROR] src\main\java\org\apache\maven\scm\plugin\BootstrapMojo.java[72:54] (whitespace) WhitespaceAround: '=' is not followed by whitespace.
[windows-jdk9] [ERROR] src\main\java\org\apache\maven\scm\plugin\BootstrapMojo.java[72:69] (whitespace) ParenPad: ')' is not preceded with whitespace.
[windows-jdk9] [ERROR] src\main\java\org\apache\maven\scm\plugin\BootstrapMojo.java[120:39] (whitespace) WhitespaceAfter: ';' is not followed by whitespace.
[windows-jdk9] [WARNING] checkstyle:check violations detected but failOnViolation set to false
[windows-jdk9] [INFO] ------------------------------------------------------------------------
[windows-jdk9] [INFO] Reactor Summary:
[windows-jdk9] [INFO]
[windows-jdk9] [INFO] Maven SCM .......................................... SUCCESS [ 37.460 s]
[windows-jdk9] [INFO] Maven SCM API ...................................... SUCCESS [ 13.721 s]
[windows-jdk9] [INFO] Maven SCM Managers ................................. SUCCESS [ 1.018 s]
[windows-jdk9] [INFO] Maven SCM Manager for Plexus ....................... SUCCESS [ 4.188 s]
[windows-jdk9] [INFO] Maven SCM Test ..................................... SUCCESS [ 4.162 s]
[windows-jdk9] [INFO] Maven SCM Providers ................................ SUCCESS [ 1.081 s]
[windows-jdk9] [INFO] Maven SCM AccuRev Provider ......................... SUCCESS [ 12.052 s]
[windows-jdk9] [INFO] Maven SCM Bazaar Provider .......................... SUCCESS [ 5.131 s]
[windows-jdk9] [INFO] Maven SCM Clearcase Provider ....................... SUCCESS [ 11.242 s]
[windows-jdk9] [INFO] Maven SCM CVS Provider - Parent .................... SUCCESS [ 1.151 s]
[windows-jdk9] [INFO] Maven SCM CVS Provider TCK tests ................... SUCCESS [ 2.814 s]
[windows-jdk9] [INFO] Maven SCM CVS Provider - Common library ............ SUCCESS [ 5.350 s]
[windows-jdk9] [INFO] Maven SCM CVS Provider - CVS Executable Impl. ...... SUCCESS [ 4.534 s]
[windows-jdk9] [INFO] Maven SCM CVS Provider - CVS Java Impl. ............ SUCCESS [ 5.232 s]
[windows-jdk9] [INFO] Maven SCM Mercurial (Hg) Provider .................. SUCCESS [ 5.025 s]
[windows-jdk9] [INFO] Maven SCM Git Provider - Parent .................... SUCCESS [ 1.185 s]
[windows-jdk9] [INFO] Maven SCM Git Provider - Common library ............ SUCCESS [ 5.384 s]
[windows-jdk9] [INFO] Maven SCM Git Provider TCK Tests ................... SUCCESS [ 2.302 s]
[windows-jdk9] [INFO] Maven SCM Git Provider - Git Executable Impl. ...... SUCCESS [ 8.109 s]
[windows-jdk9] [INFO] Maven SCM Git Provider - JGit Impl. ................ SUCCESS [ 47.125 s]
[windows-jdk9] [INFO] Maven SCM Local Provider ........................... SUCCESS [ 4.203 s]
[windows-jdk9] [INFO] Maven SCM Perforce Provider ........................ SUCCESS [ 6.193 s]
[windows-jdk9] [INFO] Maven SCM Starteam Provider ........................ SUCCESS [ 6.970 s]
[windows-jdk9] [INFO] Maven SCM Subversion Provider - Parent ............. SUCCESS [ 0.912 s]
[windows-jdk9] [INFO] Maven SCM Subversion Provider - Common library ..... SUCCESS [ 4.232 s]
[windows-jdk9] [INFO] Maven SCM Subversion Provider TCK Tests ............ SUCCESS [ 2.461 s]
[windows-jdk9] [INFO] Maven SCM Subversion Provider - SVN Executable Impl. SUCCESS [ 8.336 s]
[windows-jdk9] [INFO] Maven SCM Synergy Provider ......................... SUCCESS [ 4.394 s]
[windows-jdk9] [INFO] Maven SCM Visual Source Safe Provider .............. SUCCESS [ 8.289 s]
[windows-jdk9] [INFO] Maven SCM TFS Provider ............................. SUCCESS [ 4.532 s]
[windows-jdk9] [INFO] Maven SCM MKS Integrity Provider ................... SUCCESS [ 5.807 s]
[windows-jdk9] [INFO] Maven SCM Jazz/Rational Team Concert Provider ...... SUCCESS [ 6.935 s]
[windows-jdk9] [INFO] Maven SCM Standard Providers ....................... SUCCESS [ 2.425 s]
[windows-jdk9] [INFO] Maven SCM Client ................................... SUCCESS [ 7.602 s]
[windows-jdk9] [INFO] Maven SCM Plugin ................................... SUCCESS [ 51.416 s]
[windows-jdk9] [INFO] ------------------------------------------------------------------------
[windows-jdk9] [INFO] BUILD SUCCESS
[windows-jdk9] [INFO] ------------------------------------------------------------------------
[windows-jdk9] [INFO] Total time: 05:05 min
[windows-jdk9] [INFO] Finished at: 2018-08-16T04:00:14-07:00
[windows-jdk9] [INFO] Final Memory: 59M/198M
[windows-jdk9] [INFO] ------------------------------------------------------------------------
[windows-jdk9] [WARNING] The requested profile "run-its" could not be activated because it does not exist.
[windows-jdk9] [INFO] [jenkins-event-spy] Generated F:\jenkins\jenkins-slave\workspace\maven-box_maven-scm_SCM-797-TSNF7ZXLGM4LUVYJCJU2O25GA4EZKSADD3776FMZEGJH3QG3LZLQ@tmp\withMavena3b062dc\maven-spy-20180816-035509-1826326054534850725503.log
[Pipeline] [windows-jdk9] }
[Pipeline] [windows-jdk9] // dir
[Pipeline] [windows-jdk9] }
[windows-jdk9] [withMaven] invokerPublisher - Archive invoker results for Maven artifact MavenArtifact{org.apache.maven.plugins:maven-scm-plugin::1.9.6-SNAPSHOT(version: 1.9.6-SNAPSHOT, snapshot:false) } generated by PluginInvocation{org.apache.maven.plugins:maven-invoker-plugin:2.0.0@run integration-test}: m\maven-scm-plugin\target\invoker-reports\*.xml
[windows-jdk9] performing MavenInvokerRecorder, reportsFilenamePattern:'**/m\maven-scm-plugin\target\invoker-reports/BUILD*.xml', invokerBuildDir:'**/m\maven-scm-plugin\target\it'
[windows-jdk9] Found reports:[]
[windows-jdk9] Found logs:[]
[windows-jdk9] Finished parsing Maven Invoker results (found 0)
[windows-jdk9] [withMaven] junitPublisher - Archive test results for Maven artifact org.apache.maven.scm:maven-scm-api:1.9.6-SNAPSHOT generated by maven-surefire-plugin:test (default-test): m\maven-scm-api\target\surefire-reports\*.xml
[windows-jdk9] Recording test results
[windows-jdk9] [withMaven] junitPublisher - Archive test results for Maven artifact org.apache.maven.scm:maven-scm-manager-plexus:1.9.6-SNAPSHOT generated by maven-surefire-plugin:test (default-test): m\maven-scm-managers\maven-scm-manager-plexus\target\surefire-reports\*.xml
[windows-jdk9] Recording test results
[windows-jdk9] None of the test reports contained any result
[windows-jdk9] [withMaven] junitPublisher - Archive test results for Maven artifact org.apache.maven.scm:maven-scm-test:1.9.6-SNAPSHOT generated by maven-surefire-plugin:test (default-test): m\maven-scm-test\target\surefire-reports\*.xml
[windows-jdk9] Recording test results
[windows-jdk9] [withMaven] junitPublisher - Archive test results for Maven artifact org.apache.maven.scm:maven-scm-provider-accurev:1.9.6-SNAPSHOT generated by maven-surefire-plugin:test (default-test): m\maven-scm-providers\maven-scm-provider-accurev\target\surefire-reports\*.xml
[windows-jdk9] Recording test results
[windows-jdk9] [withMaven] junitPublisher - Archive test results for Maven artifact org.apache.maven.scm:maven-scm-provider-bazaar:1.9.6-SNAPSHOT generated by maven-surefire-plugin:test (default-test): m\maven-scm-providers\maven-scm-provider-bazaar\target\surefire-reports\*.xml
[windows-jdk9] Recording test results
[windows-jdk9] [withMaven] junitPublisher - Archive test results for Maven artifact org.apache.maven.scm:maven-scm-provider-clearcase:1.9.6-SNAPSHOT generated by maven-surefire-plugin:test (default-test): m\maven-scm-providers\maven-scm-provider-clearcase\target\surefire-reports\*.xml
[windows-jdk9] Recording test results
[windows-jdk9] [withMaven] junitPublisher - Archive test results for Maven artifact org.apache.maven.scm:maven-scm-provider-cvstest:1.9.6-SNAPSHOT generated by maven-surefire-plugin:test (default-test): m\maven-scm-providers\maven-scm-providers-cvs\maven-scm-provider-cvstest\target\surefire-reports\*.xml
[windows-jdk9] Recording test results
[windows-jdk9] None of the test reports contained any result
[windows-jdk9] [withMaven] junitPublisher - Archive test results for Maven artifact org.apache.maven.scm:maven-scm-provider-cvs-commons:1.9.6-SNAPSHOT generated by maven-surefire-plugin:test (default-test): m\maven-scm-providers\maven-scm-providers-cvs\maven-scm-provider-cvs-commons\target\surefire-reports\*.xml
[windows-jdk9] Recording test results
[windows-jdk9] [withMaven] junitPublisher - Archive test results for Maven artifact org.apache.maven.scm:maven-scm-provider-cvsexe:1.9.6-SNAPSHOT generated by maven-surefire-plugin:test (default-test): m\maven-scm-providers\maven-scm-providers-cvs\maven-scm-provider-cvsexe\target\surefire-reports\*.xml
[windows-jdk9] Recording test results
[windows-jdk9] [withMaven] junitPublisher - Archive test results for Maven artifact org.apache.maven.scm:maven-scm-provider-cvsjava:1.9.6-SNAPSHOT generated by maven-surefire-plugin:test (default-test): m\maven-scm-providers\maven-scm-providers-cvs\maven-scm-provider-cvsjava\target\surefire-reports\*.xml
[windows-jdk9] Recording test results
[windows-jdk9] [withMaven] junitPublisher - Archive test results for Maven artifact org.apache.maven.scm:maven-scm-provider-hg:1.9.6-SNAPSHOT generated by maven-surefire-plugin:test (default-test): m\maven-scm-providers\maven-scm-provider-hg\target\surefire-reports\*.xml
[windows-jdk9] Recording test results
[windows-jdk9] [withMaven] junitPublisher - Archive test results for Maven artifact org.apache.maven.scm:maven-scm-provider-git-commons:1.9.6-SNAPSHOT generated by maven-surefire-plugin:test (default-test): m\maven-scm-providers\maven-scm-providers-git\maven-scm-provider-git-commons\target\surefire-reports\*.xml
[windows-jdk9] Recording test results
[windows-jdk9] [withMaven] junitPublisher - Archive test results for Maven artifact org.apache.maven.scm:maven-scm-provider-gittest:1.9.6-SNAPSHOT generated by maven-surefire-plugin:test (default-test): m\maven-scm-providers\maven-scm-providers-git\maven-scm-provider-gittest\target\surefire-reports\*.xml
[windows-jdk9] Recording test results
[windows-jdk9] None of the test reports contained any result
[windows-jdk9] [withMaven] junitPublisher - Archive test results for Maven artifact org.apache.maven.scm:maven-scm-provider-gitexe:1.9.6-SNAPSHOT generated by maven-surefire-plugin:test (default-test): m\maven-scm-providers\maven-scm-providers-git\maven-scm-provider-gitexe\target\surefire-reports\*.xml
[windows-jdk9] Recording test results
[windows-jdk9] [withMaven] junitPublisher - Archive test results for Maven artifact org.apache.maven.scm:maven-scm-provider-jgit:1.9.6-SNAPSHOT generated by maven-surefire-plugin:test (default-test): m\maven-scm-providers\maven-scm-providers-git\maven-scm-provider-jgit\target\surefire-reports\*.xml
[windows-jdk9] Recording test results
[windows-jdk9] [withMaven] junitPublisher - Archive test results for Maven artifact org.apache.maven.scm:maven-scm-provider-local:1.9.6-SNAPSHOT generated by maven-surefire-plugin:test (default-test): m\maven-scm-providers\maven-scm-provider-local\target\surefire-reports\*.xml
[windows-jdk9] Recording test results
[windows-jdk9] [withMaven] junitPublisher - Archive test results for Maven artifact org.apache.maven.scm:maven-scm-provider-perforce:1.9.6-SNAPSHOT generated by maven-surefire-plugin:test (default-test): m\maven-scm-providers\maven-scm-provider-perforce\target\surefire-reports\*.xml
[windows-jdk9] Recording test results
[windows-jdk9] [withMaven] junitPublisher - Archive test results for Maven artifact org.apache.maven.scm:maven-scm-provider-starteam:1.9.6-SNAPSHOT generated by maven-surefire-plugin:test (default-test): m\maven-scm-providers\maven-scm-provider-starteam\target\surefire-reports\*.xml
[windows-jdk9] Recording test results
[windows-jdk9] [withMaven] junitPublisher - Archive test results for Maven artifact org.apache.maven.scm:maven-scm-provider-svn-commons:1.9.6-SNAPSHOT generated by maven-surefire-plugin:test (default-test): m\maven-scm-providers\maven-scm-providers-svn\maven-scm-provider-svn-commons\target\surefire-reports\*.xml
[windows-jdk9] Recording test results
[windows-jdk9] [withMaven] junitPublisher - Archive test results for Maven artifact org.apache.maven.scm:maven-scm-provider-svntest:1.9.6-SNAPSHOT generated by maven-surefire-plugin:test (default-test): m\maven-scm-providers\maven-scm-providers-svn\maven-scm-provider-svntest\target\surefire-reports\*.xml
[windows-jdk9] Recording test results
[windows-jdk9] None of the test reports contained any result
[windows-jdk9] [withMaven] junitPublisher - Archive test results for Maven artifact org.apache.maven.scm:maven-scm-provider-svnexe:1.9.6-SNAPSHOT generated by maven-surefire-plugin:test (default-test): m\maven-scm-providers\maven-scm-providers-svn\maven-scm-provider-svnexe\target\surefire-reports\*.xml
[windows-jdk9] Recording test results
[windows-jdk9] [withMaven] junitPublisher - Archive test results for Maven artifact org.apache.maven.scm:maven-scm-provider-synergy:1.9.6-SNAPSHOT generated by maven-surefire-plugin:test (default-test): m\maven-scm-providers\maven-scm-provider-synergy\target\surefire-reports\*.xml
[windows-jdk9] Recording test results
[windows-jdk9] [withMaven] junitPublisher - Archive test results for Maven artifact org.apache.maven.scm:maven-scm-provider-vss:1.9.6-SNAPSHOT generated by maven-surefire-plugin:test (default-test): m\maven-scm-providers\maven-scm-provider-vss\target\surefire-reports\*.xml
[windows-jdk9] Recording test results
[windows-jdk9] [withMaven] junitPublisher - Archive test results for Maven artifact org.apache.maven.scm:maven-scm-provider-tfs:1.9.6-SNAPSHOT generated by maven-surefire-plugin:test (default-test): m\maven-scm-providers\maven-scm-provider-tfs\target\surefire-reports\*.xml
[windows-jdk9] Recording test results
[windows-jdk9] [withMaven] junitPublisher - Archive test results for Maven artifact org.apache.maven.scm:maven-scm-provider-integrity:1.9.6-SNAPSHOT generated by maven-surefire-plugin:test (default-test): m\maven-scm-providers\maven-scm-provider-integrity\target\surefire-reports\*.xml
[windows-jdk9] Recording test results
[windows-jdk9] [withMaven] junitPublisher - Archive test results for Maven artifact org.apache.maven.scm:maven-scm-provider-jazz:1.9.6-SNAPSHOT generated by maven-surefire-plugin:test (default-test): m\maven-scm-providers\maven-scm-provider-jazz\target\surefire-reports\*.xml
[windows-jdk9] Recording test results
[windows-jdk9] [withMaven] junitPublisher - Archive test results for Maven artifact org.apache.maven.scm:maven-scm-client:1.9.6-SNAPSHOT generated by maven-surefire-plugin:test (default-test): m\maven-scm-client\target\surefire-reports\*.xml
[windows-jdk9] Recording test results
[windows-jdk9] None of the test reports contained any result
[windows-jdk9] [withMaven] junitPublisher - Archive test results for Maven artifact org.apache.maven.plugins:maven-scm-plugin:1.9.6-SNAPSHOT generated by maven-surefire-plugin:test (default-test): m\maven-scm-plugin\target\surefire-reports\*.xml
[windows-jdk9] Recording test results
[Pipeline] [windows-jdk9] // withMaven
[Pipeline] [windows-jdk9] cleanWs
[windows-jdk9] [WS-CLEANUP] Deleting project workspace...[WS-CLEANUP] done
[Pipeline] [windows-jdk9] }
[Pipeline] [windows-jdk9] // stage
[Pipeline] [windows-jdk9] }
[Pipeline] [windows-jdk9] // node
[Pipeline] [windows-jdk9] }
[Pipeline] // parallel
[Pipeline] stage
[Pipeline] { (Notifications)
[Pipeline] echo
Build result: FAILURE
[Pipeline] jiraIssueSelector
[Pipeline] emailext