You are viewing a plain text version of this content. The canonical link for it is here.
Posted to dev@allura.apache.org by Apache Jenkins Server <je...@builds.apache.org> on 2023/08/14 17:23:15 UTC

Build failed in Jenkins: Allura » Allura-py3.7 #258

See <https://ci-builds.apache.org/job/Allura/job/Allura-py3.7/258/display/redirect>

Changes:


------------------------------------------
Started by user David Philip Brondsema
Running as SYSTEM
[EnvInject] - Loading node environment variables.
Building remotely on builds60 (ubuntu) in workspace <https://ci-builds.apache.org/job/Allura/job/Allura-py3.7/ws/>
[WS-CLEANUP] Deleting project workspace...
[WS-CLEANUP] Deferred wipeout is used...
[WS-CLEANUP] Done
The recommended git tool is: NONE
No credentials specified
Cloning the remote Git repository
Cloning repository https://gitbox.apache.org/repos/asf/allura.git/
 > git init <https://ci-builds.apache.org/job/Allura/job/Allura-py3.7/ws/> # timeout=10
Fetching upstream changes from https://gitbox.apache.org/repos/asf/allura.git/
 > git --version # timeout=10
 > git --version # 'git version 2.17.1'
 > git fetch --tags --progress -- https://gitbox.apache.org/repos/asf/allura.git/ +refs/heads/*:refs/remotes/origin/* # timeout=10
 > git config remote.origin.url https://gitbox.apache.org/repos/asf/allura.git/ # timeout=10
 > git config --add remote.origin.fetch +refs/heads/*:refs/remotes/origin/* # timeout=10
Avoid second fetch
 > git rev-parse refs/remotes/origin/master^{commit} # timeout=10
Checking out Revision 90b07ba2f6d010273068235f31185075d02fd317 (refs/remotes/origin/master)
 > git config core.sparsecheckout # timeout=10
 > git checkout -f 90b07ba2f6d010273068235f31185075d02fd317 # timeout=10
Commit message: "pillow downgrade 10.0.0 -> 9.5.0"
 > git rev-list --no-walk 90b07ba2f6d010273068235f31185075d02fd317 # timeout=10
[Allura-py3.7] $ /bin/bash /tmp/jenkins4856687153645778376.sh

=============================================================================
Jenkins Host Info:
=============================================================================
cpu count: 24
hostname: asf960
whoami: jenkins
NODE_NAME: builds60
docker: Client: Docker Engine - Community Version: 24.0.2 API version: 1.43 Go version: go1.20.4 Git commit: cb74dfc Built: Thu May 25 21:52:13 2023 OS/Arch: linux/amd64 Context: default Server: Docker Engine - Community Engine: Version: 24.0.2 API version: 1.43 (minimum version 1.12) Go version: go1.20.4 Git commit: 659604f Built: Thu May 25 21:52:13 2023 OS/Arch: linux/amd64 Experimental: false containerd: Version: 1.6.21 GitCommit: 3dce8eb055cbb6872793272b4f20ed16117344f8 runc: Version: 1.1.7 GitCommit: v1.1.7-0-g860f061 docker-init: Version: 0.19.0 GitCommit: de40ad0
/usr/local/lib/python2.7/dist-packages/paramiko/transport.py:33: CryptographyDeprecationWarning: Python 2 is no longer supported by the Python core team. Support for it is now deprecated in cryptography, and will be removed in the next release.
  from cryptography.hazmat.backends import default_backend
docker compose: docker-compose version 1.26.2, build unknown docker-py version: 4.4.4 CPython version: 2.7.17 OpenSSL version: OpenSSL 1.1.1 11 Sep 2018
path: /usr/local/sbin:/usr/local/bin:/usr/sbin:/usr/bin:/sbin:/bin:/snap/bin
workspace: <https://ci-builds.apache.org/job/Allura/job/Allura-py3.7/ws/>
jenkins_home: /home/jenkins/jenkins-home
home: /home/jenkins
pwd: <https://ci-builds.apache.org/job/Allura/job/Allura-py3.7/ws/>
GIT_COMMIT=90b07ba2f6d010273068235f31185075d02fd317
RUN_DISPLAY_URL=https://ci-builds.apache.org/job/Allura/job/Allura-py3.7/258/display/redirect
JENKINS_URL=https://ci-builds.apache.org/
EXECUTOR_NUMBER=2
SSH_CONNECTION=95.217.196.215 57114 67.195.81.180 22
LANG=en_US
BUILD_ID=258
BUILD_CAUSE=MANUALTRIGGER
OLDPWD=/home/jenkins
RUN_CHANGES_DISPLAY_URL=https://ci-builds.apache.org/job/Allura/job/Allura-py3.7/258/display/redirect?page=changes
GRADLE_ENTERPRISE_ACCESS_KEY=ge.apache.org=etlwjhwel56ybdijfxymbj5bb6fwydcy3sj2oe6rlwjzotgalrea
JENKINSGRADLEPLUGIN_GRADLE_ENTERPRISE_PLUGIN_VERSION=3.13.1
JOB_BASE_NAME=Allura-py3.7
WORKSPACE_TMP=<ht...@tmp>
BUILD_TIMESTAMP=2023-08-14 17:22:51 UTC
CI=true
GIT_URL=https://gitbox.apache.org/repos/asf/allura.git/
HUDSON_COOKIE=2de2b422-5931-4e6b-97c7-350927baef88
XDG_SESSION_ID=1081
USER=jenkins
BUILD_NUMBER=258
WORKSPACE=<https://ci-builds.apache.org/job/Allura/job/Allura-py3.7/ws/>
PWD=<https://ci-builds.apache.org/job/Allura/job/Allura-py3.7/ws/>
HUDSON_URL=https://ci-builds.apache.org/
HOME=/home/jenkins
JENKINSGRADLEPLUGIN_CCUD_PLUGIN_VERSION=1.10
NODE_NAME=builds60
HUDSON_SERVER_COOKIE=9c7f00b5d9bf9427
SSH_CLIENT=95.217.196.215 57114 22
JENKINS_HOME=/home/jenkins/jenkins-home
JOB_NAME=Allura/Allura-py3.7
RUN_TESTS_DISPLAY_URL=https://ci-builds.apache.org/job/Allura/job/Allura-py3.7/258/display/redirect?page=tests
GIT_PREVIOUS_COMMIT=90b07ba2f6d010273068235f31185075d02fd317
HUDSON_HOME=/home/jenkins/jenkins-home
JOB_DISPLAY_URL=https://ci-builds.apache.org/job/Allura/job/Allura-py3.7/display/redirect
JENKINSGRADLEPLUGIN_GRADLE_ENTERPRISE_ENFORCE_URL=true
JENKINSGRADLEPLUGIN_GRADLE_AUTO_INJECTION=true
RUN_ARTIFACTS_DISPLAY_URL=https://ci-builds.apache.org/job/Allura/job/Allura-py3.7/258/display/redirect?page=artifacts
MAIL=/var/mail/jenkins
BUILD_URL=https://ci-builds.apache.org/job/Allura/job/Allura-py3.7/258/
SHELL=/bin/bash
JOB_URL=https://ci-builds.apache.org/job/Allura/job/Allura-py3.7/
BUILD_DISPLAY_NAME=#258
PY_VERSION=3.7
ROOT_BUILD_CAUSE=MANUALTRIGGER
SHLVL=3
GIT_BRANCH=origin/master
JENKINSGRADLEPLUGIN_GRADLE_ENTERPRISE_URL=https://ge.apache.org
ROOT_BUILD_CAUSE_MANUALTRIGGER=true
BUILD_TAG=jenkins-Allura-Allura-py3.7-258
JENKINSGRADLEPLUGIN_GRADLE_ENTERPRISE_GRADLE_INJECTION_ENABLED=false
NODE_LABELS=builds60 ubuntu
LOGNAME=jenkins
DBUS_SESSION_BUS_ADDRESS=unix:path=/run/user/910/bus
XDG_RUNTIME_DIR=/run/user/910
PATH=/usr/local/sbin:/usr/local/bin:/usr/sbin:/usr/bin:/sbin:/bin:/snap/bin
BUILD_CAUSE_MANUALTRIGGER=true
GIT_PREVIOUS_SUCCESSFUL_COMMIT=61ee60cac206a2ef7e705c1e4496cc6a43fd91a1
JENKINS_SERVER_COOKIE=9c7f00b5d9bf9427
_=/usr/bin/env

=============================================================================
Run: cleanup previous runs
=============================================================================
/usr/local/lib/python2.7/dist-packages/paramiko/transport.py:33: CryptographyDeprecationWarning: Python 2 is no longer supported by the Python core team. Support for it is now deprecated in cryptography, and will be removed in the next release.
  from cryptography.hazmat.backends import default_backend
Removing network allura_default
Network allura_default not found.

=============================================================================
Run: build docker image
=============================================================================
/usr/local/lib/python2.7/dist-packages/paramiko/transport.py:33: CryptographyDeprecationWarning: Python 2 is no longer supported by the Python core team. Support for it is now deprecated in cryptography, and will be removed in the next release.
  from cryptography.hazmat.backends import default_backend
--build-arg is only supported when services are specified for API version < 1.25. Please use a Compose file version > 2.2 or specify which services to build.

=============================================================================
Setup: venv, pip, pysvn, ./rebuild-all.sh, npm, etc.
=============================================================================
/usr/local/lib/python2.7/dist-packages/paramiko/transport.py:33: CryptographyDeprecationWarning: Python 2 is no longer supported by the Python core team. Support for it is now deprecated in cryptography, and will be removed in the next release.
  from cryptography.hazmat.backends import default_backend
Creating network "allura_default" with the default driver
Creating allura_mongo_1 ... 
Creating allura_solr_1  ... 
Creating allura_solr_1  ... doneCreating allura_mongo_1 ... doneBuilding web
Traceback (most recent call last):
  File "/usr/local/bin/docker-compose", line 8, in <module>
    sys.exit(main())
  File "/usr/local/lib/python2.7/dist-packages/compose/cli/main.py", line 72, in main
    command()
  File "/usr/local/lib/python2.7/dist-packages/compose/cli/main.py", line 128, in perform_command
    handler(command, command_options)
  File "/usr/local/lib/python2.7/dist-packages/compose/cli/main.py", line 866, in run
    self.toplevel_options, self.toplevel_environment
  File "/usr/local/lib/python2.7/dist-packages/compose/cli/main.py", line 1327, in run_one_off_container
    **container_options)
  File "/usr/local/lib/python2.7/dist-packages/compose/service.py", line 331, in create_container
    self.ensure_image_exists()
  File "/usr/local/lib/python2.7/dist-packages/compose/service.py", line 367, in ensure_image_exists
    self.build(cli=cli)
  File "/usr/local/lib/python2.7/dist-packages/compose/service.py", line 1106, in build
    platform=self.platform,
  File "/usr/local/lib/python2.7/dist-packages/docker/api/build.py", line 160, in build
    path, exclude=exclude, dockerfile=dockerfile, gzip=gzip
  File "/usr/local/lib/python2.7/dist-packages/docker/utils/build.py", line 30, in tar
    files=sorted(exclude_paths(root, exclude, dockerfile=dockerfile[0])),
  File "/usr/local/lib/python2.7/dist-packages/docker/utils/build.py", line 49, in exclude_paths
    return set(pm.walk(root))
  File "/usr/local/lib/python2.7/dist-packages/docker/utils/build.py", line 215, in rec_walk
    for sub in rec_walk(cur):
  File "/usr/local/lib/python2.7/dist-packages/docker/utils/build.py", line 215, in rec_walk
    for sub in rec_walk(cur):
  File "/usr/local/lib/python2.7/dist-packages/docker/utils/build.py", line 215, in rec_walk
    for sub in rec_walk(cur):
  File "/usr/local/lib/python2.7/dist-packages/docker/utils/build.py", line 185, in rec_walk
    for f in os.listdir(current_dir):
OSError: [Errno 13] Permission denied: '<https://ci-builds.apache.org/job/Allura/job/Allura-py3.7/ws/allura-data/mongo/journal'>

=============================================================================
Starting up docker containers
=============================================================================
/usr/local/lib/python2.7/dist-packages/paramiko/transport.py:33: CryptographyDeprecationWarning: Python 2 is no longer supported by the Python core team. Support for it is now deprecated in cryptography, and will be removed in the next release.
  from cryptography.hazmat.backends import default_backend
Building web
Traceback (most recent call last):
  File "/usr/local/bin/docker-compose", line 8, in <module>
    sys.exit(main())
  File "/usr/local/lib/python2.7/dist-packages/compose/cli/main.py", line 72, in main
    command()
  File "/usr/local/lib/python2.7/dist-packages/compose/cli/main.py", line 128, in perform_command
    handler(command, command_options)
  File "/usr/local/lib/python2.7/dist-packages/compose/cli/main.py", line 1078, in up
    to_attach = up(False)
  File "/usr/local/lib/python2.7/dist-packages/compose/cli/main.py", line 1074, in up
    cli=native_builder,
  File "/usr/local/lib/python2.7/dist-packages/compose/project.py", line 548, in up
    svc.ensure_image_exists(do_build=do_build, silent=silent, cli=cli)
  File "/usr/local/lib/python2.7/dist-packages/compose/service.py", line 367, in ensure_image_exists
    self.build(cli=cli)
  File "/usr/local/lib/python2.7/dist-packages/compose/service.py", line 1106, in build
    platform=self.platform,
  File "/usr/local/lib/python2.7/dist-packages/docker/api/build.py", line 160, in build
    path, exclude=exclude, dockerfile=dockerfile, gzip=gzip
  File "/usr/local/lib/python2.7/dist-packages/docker/utils/build.py", line 30, in tar
    files=sorted(exclude_paths(root, exclude, dockerfile=dockerfile[0])),
  File "/usr/local/lib/python2.7/dist-packages/docker/utils/build.py", line 49, in exclude_paths
    return set(pm.walk(root))
  File "/usr/local/lib/python2.7/dist-packages/docker/utils/build.py", line 215, in rec_walk
    for sub in rec_walk(cur):
  File "/usr/local/lib/python2.7/dist-packages/docker/utils/build.py", line 215, in rec_walk
    for sub in rec_walk(cur):
  File "/usr/local/lib/python2.7/dist-packages/docker/utils/build.py", line 215, in rec_walk
    for sub in rec_walk(cur):
  File "/usr/local/lib/python2.7/dist-packages/docker/utils/build.py", line 185, in rec_walk
    for f in os.listdir(current_dir):
OSError: [Errno 13] Permission denied: '<https://ci-builds.apache.org/job/Allura/job/Allura-py3.7/ws/allura-data/mongo/journal'>

=============================================================================
Docker Container Info:
=============================================================================
/usr/local/lib/python2.7/dist-packages/paramiko/transport.py:33: CryptographyDeprecationWarning: Python 2 is no longer supported by the Python core team. Support for it is now deprecated in cryptography, and will be removed in the next release.
  from cryptography.hazmat.backends import default_backend
No container found for web_1

=============================================================================
Setup: tests
=============================================================================
/usr/local/lib/python2.7/dist-packages/paramiko/transport.py:33: CryptographyDeprecationWarning: Python 2 is no longer supported by the Python core team. Support for it is now deprecated in cryptography, and will be removed in the next release.
  from cryptography.hazmat.backends import default_backend
No container found for web_1
/usr/local/lib/python2.7/dist-packages/paramiko/transport.py:33: CryptographyDeprecationWarning: Python 2 is no longer supported by the Python core team. Support for it is now deprecated in cryptography, and will be removed in the next release.
  from cryptography.hazmat.backends import default_backend
No container found for web_1

=============================================================================
Run: tests
=============================================================================
/usr/local/lib/python2.7/dist-packages/paramiko/transport.py:33: CryptographyDeprecationWarning: Python 2 is no longer supported by the Python core team. Support for it is now deprecated in cryptography, and will be removed in the next release.
  from cryptography.hazmat.backends import default_backend
No container found for web_1
/usr/local/lib/python2.7/dist-packages/paramiko/transport.py:33: CryptographyDeprecationWarning: Python 2 is no longer supported by the Python core team. Support for it is now deprecated in cryptography, and will be removed in the next release.
  from cryptography.hazmat.backends import default_backend
No container found for web_1
/usr/local/lib/python2.7/dist-packages/paramiko/transport.py:33: CryptographyDeprecationWarning: Python 2 is no longer supported by the Python core team. Support for it is now deprecated in cryptography, and will be removed in the next release.
  from cryptography.hazmat.backends import default_backend
Setting environment for exec is not supported in API < 1.25 (1.24)

=============================================================================
Shutdown
=============================================================================
/usr/local/lib/python2.7/dist-packages/paramiko/transport.py:33: CryptographyDeprecationWarning: Python 2 is no longer supported by the Python core team. Support for it is now deprecated in cryptography, and will be removed in the next release.
  from cryptography.hazmat.backends import default_backend
Stopping allura_solr_1  ... 
Stopping allura_mongo_1 ... 
Stopping allura_mongo_1 ... doneStopping allura_solr_1  ... doneRemoving allura_solr_1  ... 
Removing allura_mongo_1 ... 
Removing allura_solr_1  ... doneRemoving allura_mongo_1 ... doneRemoving network allura_default
Total reclaimed space: 0B
Deleted Volumes:
812455041cf0dac3cafc3e34c09db5bb8cb35ade687c1fd404d86a740e51ab13

Total reclaimed space: 0B
Build step 'Execute shell' marked build as failure
Recording test results
ERROR: Step ?Publish JUnit test result report? failed: No test report files were found. Configuration error?

Jenkins build is back to normal : Allura » Allura-py3.7 #262

Posted by Apache Jenkins Server <je...@builds.apache.org>.
See <https://ci-builds.apache.org/job/Allura/job/Allura-py3.7/262/display/redirect?page=changes>


Build failed in Jenkins: Allura » Allura-py3.7 #261

Posted by Apache Jenkins Server <je...@builds.apache.org>.
See <https://ci-builds.apache.org/job/Allura/job/Allura-py3.7/261/display/redirect>

Changes:


------------------------------------------
[...truncated 151.97 KB...]
#6 41.48 Enabling conf charset.
#6 41.51 Enabling conf localized-error-pages.
#6 41.54 Enabling conf other-vhosts-access-log.
#6 41.56 Enabling conf security.
#6 41.60 Enabling conf serve-cgi-bin.
#6 41.62 Enabling site 000-default.
#6 41.87 invoke-rc.d: could not determine current runlevel
#6 41.88 invoke-rc.d: policy-rc.d denied execution of start.
#6 41.98 Setting up curl (7.58.0-2ubuntu3.24) ...
#6 42.02 Setting up libapache2-mod-python (3.3.1-11ubuntu2) ...
#6 42.15 apache2_invoke: Enable module python
#6 42.19 invoke-rc.d: could not determine current runlevel
#6 42.19 invoke-rc.d: policy-rc.d denied execution of restart.
#6 42.87 Processing triggers for libc-bin (2.27-3ubuntu1.6) ...
#6 42.93 Processing triggers for ca-certificates (20230311ubuntu0.18.04.1) ...
#6 42.95 Updating certificates in /etc/ssl/certs...
#6 43.44 0 added, 0 removed; done.
#6 43.44 Running hooks in /etc/ca-certificates/update.d...
#6 43.44 done.
#6 DONE 44.8s

#7 [ 3/10] RUN a2enmod cgi proxy proxy_http
#7 0.861 Your MPM seems to be threaded. Selecting cgid instead of cgi.
#7 0.861 Enabling module cgid.
#7 0.868 Enabling module proxy.
#7 0.874 Considering dependency proxy for proxy_http:
#7 0.874 Module proxy already enabled
#7 0.874 Enabling module proxy_http.
#7 0.881 To activate the new configuration, you need to run:
#7 0.881   service apache2 restart
#7 DONE 1.0s

#8 [ 4/10] ADD ./git-http.conf /etc/apache2/sites-available/
#8 DONE 0.2s

#9 [ 5/10] RUN a2dissite 000-default.conf
#9 0.594 Site 000-default disabled.
#9 0.594 To activate the new configuration, you need to run:
#9 0.594   service apache2 reload
#9 DONE 0.7s

#10 [ 6/10] RUN a2ensite git-http.conf
#10 0.587 Enabling site git-http.
#10 0.593 To activate the new configuration, you need to run:
#10 0.593   service apache2 reload
#10 DONE 0.7s

#11 [ 7/10] RUN apachectl configtest
#11 0.506 AH00558: apache2: Could not reliably determine the server's fully qualified domain name, using 127.0.0.1. Set the 'ServerName' directive globally to suppress this message
#11 0.507 Syntax OK
#11 DONE 0.6s

#12 [ 8/10] ADD git-http-backend-wrapper.sh /usr/lib/git-core
#12 DONE 0.3s

#13 [ 9/10] RUN adduser www-data sudo
#13 0.425 Adding user `www-data' to group `sudo' ...
#13 0.427 Adding user www-data to group sudo
#13 0.464 Done.
#13 DONE 0.5s

#14 [10/10] RUN echo '%sudo  ALL=(ALL) NOPASSWD:ALL' > /etc/sudoers.d/sudo_group_passwordless
#14 DONE 0.5s

#15 exporting to image
#15 exporting layers
#15 exporting layers 2.7s done
#15 writing image sha256:c1cafb39cd347a25ca3d035ba3742dee5760e14400b9e09177eafed1db5e9c12 done
#15 naming to docker.io/library/allura_http 0.0s done
#15 DONE 2.8s

=============================================================================
Setup: venv, pip, pysvn, ./rebuild-all.sh, npm, etc.
=============================================================================
Creating network "allura_default" with the default driver
Pulling solr (solr:6-alpine)...
6-alpine: Pulling from library/solr
Digest: sha256:4f63093698313437a49b2f945c4b1545c9e3a655f52581bc6e01ea006fae132e
Status: Downloaded newer image for solr:6-alpine
Pulling mongo (mongo:4.2)...
4.2: Pulling from library/mongo
Digest: sha256:699d652ed67423d689258bad7b316cf005dfbb82b334118ec306f049042f3717
Status: Downloaded newer image for mongo:4.2
Creating allura_mongo_1 ... 
Creating allura_solr_1  ... 
Creating allura_mongo_1 ... done
Creating allura_solr_1  ... done
Creating allura_web_run ... 
Creating allura_web_run ... done

Running scripts/init-docker-dev.sh

Creating SCM directories

Creating directory for SOLR data

Changing it's permissions to 777 so that container will have access to it

Creating virtualenv

Requirement already satisfied: pip in /allura-data/virtualenv/lib/python3.7/site-packages (23.0.1)
Collecting pip
  Downloading pip-23.2.1-py3-none-any.whl (2.1 MB)
     ━━━━━━━━━━━━━━━━━━━━━━━━━━━━━━━━━━━━━━━━ 2.1/2.1 MB 16.3 MB/s eta 0:00:00
Installing collected packages: pip
  Attempting uninstall: pip
    Found existing installation: pip 23.0.1
    Uninstalling pip-23.0.1:
      Successfully uninstalled pip-23.0.1
Successfully installed pip-23.2.1
Collecting wheel
  Obtaining dependency information for wheel from https://files.pythonhosted.org/packages/28/f5/6955d7b3a5d71ce6bac104f9cf98c1b0513ad656cdaca8ea7d579196f771/wheel-0.41.1-py3-none-any.whl.metadata
  Downloading wheel-0.41.1-py3-none-any.whl.metadata (2.2 kB)
Downloading wheel-0.41.1-py3-none-any.whl (64 kB)
   ━━━━━━━━━━━━━━━━━━━━━━━━━━━━━━━━━━━━━━━━ 64.8/64.8 kB 1.9 MB/s eta 0:00:00
Installing collected packages: wheel
Successfully installed wheel-0.41.1
  % Total    % Received % Xferd  Average Speed   Time    Time     Time  Current
                                 Dload  Upload   Total   Spent    Left  Speed
  0     0    0     0    0     0      0      0 --:--:-- --:--:-- --:--:--     0100 12741  100 12741    0     0  49980      0 --:--:-- --:--:-- --:--:-- 49964100 12741  100 12741    0     0  49960      0 --:--:-- --:--:-- --:--:-- 49964
Looking up latest PySVN version...
Downloading PySVN 1.9.20...
Building PySVN...
Processing /tmp/tmpuvho7ru9.pysvn-install/pysvn-1.9.20
  Preparing metadata (setup.py): started
  Preparing metadata (setup.py): finished with status 'done'
Building wheels for collected packages: pysvn
  Building wheel for pysvn (setup.py): started
  Building wheel for pysvn (setup.py): finished with status 'done'
  Created wheel for pysvn: filename=pysvn-1.9.20-cp37-cp37m-linux_x86_64.whl size=738992 sha256=d0eecc43d7793b04e5d655a76c5d211fd05a2e48af5efa04e2f3b6858cb04b97
  Stored in directory: /root/.cache/pip/wheels/3e/eb/6e/025a44f6f93925cf9360d22a2b89c40830aced032572f98f40
Successfully built pysvn
Installing collected packages: pysvn
Successfully installed pysvn-1.9.20

PySVN is installed.

Installing python packages

ERROR: Ignored the following versions that require a different python version: 10.0.0 Requires-Python >=3.8; 2.3.0 Requires-Python >=3.8; 2.3.1 Requires-Python >=3.8; 2.3.2 Requires-Python >=3.8; 2.3.3 Requires-Python >=3.8; 2.3.4 Requires-Python >=3.8; 2.3.5 Requires-Python >=3.8; 2.3.6 Requires-Python >=3.8; 2.3.7 Requires-Python >=3.8; 2023.3.22 Requires-Python >=3.8; 2023.3.23 Requires-Python >=3.8; 2023.5.2 Requires-Python >=3.8; 6.8.0 Requires-Python >=3.8
ERROR: Could not find a version that satisfies the requirement werkzeug==2.3.6 (from versions: 0.1, 0.2, 0.3, 0.3.1, 0.4, 0.4.1, 0.5, 0.5.1, 0.6, 0.6.1, 0.6.2, 0.7, 0.7.1, 0.7.2, 0.8, 0.8.1, 0.8.2, 0.8.3, 0.9, 0.9.1, 0.9.2, 0.9.3, 0.9.4, 0.9.5, 0.9.6, 0.10, 0.10.1, 0.10.2, 0.10.4, 0.11, 0.11.1, 0.11.2, 0.11.3, 0.11.4, 0.11.5, 0.11.6, 0.11.7, 0.11.8, 0.11.9, 0.11.10, 0.11.11, 0.11.12, 0.11.13, 0.11.14, 0.11.15, 0.12, 0.12.1, 0.12.2, 0.13, 0.14, 0.14.1, 0.15.0, 0.15.1, 0.15.2, 0.15.3, 0.15.4, 0.15.5, 0.15.6, 0.16.0, 0.16.1, 1.0.0rc1, 1.0.0, 1.0.1, 2.0.0rc1, 2.0.0rc2, 2.0.0rc3, 2.0.0rc4, 2.0.0rc5, 2.0.0, 2.0.1, 2.0.2, 2.0.3, 2.1.0, 2.1.1, 2.1.2, 2.2.0a1, 2.2.0, 2.2.1, 2.2.2, 2.2.3)
ERROR: No matching distribution found for werkzeug==2.3.6
1

=============================================================================
Starting up docker containers
=============================================================================
allura_solr_1 is up-to-date
allura_mongo_1 is up-to-date
Creating allura_web_1 ... 
Creating allura_web_1 ... done

=============================================================================
Docker Container Info:
=============================================================================

=============================================================================
Setup: tests
=============================================================================

=============================================================================
Run: tests
=============================================================================

=============================================================================
Shutdown
=============================================================================
Stopping allura_solr_1  ... 
Stopping allura_mongo_1 ... 
Stopping allura_mongo_1 ... done
Stopping allura_solr_1  ... done
Removing allura_web_1   ... 
Removing allura_solr_1  ... 
Removing allura_mongo_1 ... 
Removing allura_web_1   ... done
Removing allura_mongo_1 ... done
Removing allura_solr_1  ... done
Removing network allura_default
Total reclaimed space: 0B
Deleted Volumes:
1c20d2fe4b4775c73dc75c60923a14f5381f928002b62419a7a59ba3812ed890
676ef1d8bb8192f3e0b90eca608b3dca487b32934fa5335f7728719f1bd89ee5
80952bb88897fe99ad042148fbfaea1b5e0ced2003eb216ac7baede0dd8fc9b9
a4edf768dcdd069f6ca6399a6e4b2323027c49364a6b0b3781938dddee1d93ba
f7e8da6369decb1231d6062e222e012a988683b1da29e2dcf4c4e95f827164ad
050e40a5dfc58ae48d0be94d7c248d5ead18632ded1f4dbf0e0f525bc6550eef
4bc3ed1ce4e89cae159dcbfcf4e8753ad82f4bd3a42904a4ffb9e28a3760d65d
551318c96b7bb45dfa7db4202cbed1406e75d1ec9fad7d10228e34ce45ef1ca4
81144862d1645ac1e0a568320c383a7920cd4deaae0063be161b8867a5179d7f
c0500c8fa7c009905bfdb54cd4506a9ffdf899109d4e60310d11cad19792fd05
0a7f30bc86b10e56e8319c1d226f1e6f958e495f36882bf977967def590bb6d0
5cb1d0fec53799208da644ba6413855b32364172aefbde3b0e42c93467b726eb
6328fffb0df5736c27fdf4e39f24dbf42d6a24b6b931a0c1055563424b4ecbf7
9566d87fa998dc7d5e41102c39511652e99142656744a05836cd3c1c86843de2
a2642e03c5d2cd46515160b5c916c98714ad4e40abb07ca25039694c102fe557
a4bcf3cc8ca7a19c8b9c39fdc69d2280b064895f762ab480f97faaca4621cbd2
aca0d6139c549b70c9ce17781186257ee4bdb381e49f5fcad6231c1e0e0edbfa
009012e2c8613e54144b4f1d0002f0b7e79a302d9121ce84d610d1f8ff46b8f3
a14fcce1bc96912775dbb01e6309fc41246f68f41f70c272a49d86cc189af29a
33865cc3b2e95cdf004fc6d1395ba3ce8a336d990ab32da1f978f99c94ba4aaa
68f844832bce032c2bed3ac126f051e04f94c79195da18c944154e8a5ddf356f
84f103e5b69f266e45a317118b2be3a99b73a90c741e09d9be020ae3f4046173
85a320bb725491b03ec8da45f206463a9e3992ca9d81e14802b6a3108e3c2342
c68cc26f147c16c101bfac45e4d5246a141831e4f0543d8221c297309605d47f
317c33e4f9698bba650e9c1945ba4b048de41f0ddc2ae693559e25d98a54179c
db397837035bae836b574dbd33b0d858c13e07c74491a5dafc83720f98aade11
ebc5d90dda5e558b26b3340c1053728768c9089d7fa53c00aa55f99b3f91cddb
8ebcebef8686aa4051440b98006c9f27b098d17a00c9c199c40ee0d21c8b05ed
81ce8fb51b50726e26784a67e08291232da9a5c5cf8af55ddb4bccc1087b8333
f94276ded07aba1cd687b53a5a44eb901747464d73798d526187a28cf0637e86
64990d3b8fe11d2cb281743b3530b00040549e3b0e53ed690535dceaaff4174c
5c2f46f4265d9f7a784993b6425ae40d490d9080827381461156fc4db6ae4c72
f65641d7a4bc6d930696a809b3dd539ca147c0fd899acf57b5075c44006241f5
3cf8a625b16ae0faed4775b6f996bc2170b92a3a7a296afa4f1f23006c31d87f
acfc2ffcc7a2ed71ca888b6c01a0936c444056bb30ba3419c36eeb69a83479c1
ce6e58bc265c077a38a26446e2afeeac71b4dd86443cc1f927fe61eab1b59dd4
e3ff6d4262e31a052310df667a1ab5b764496b7b01ab742c0b3fab0a6956ec4a
6dd927b27e2314f3155b87ca4133b85ca40629dd7852b2a2b1c5d59d7ca648fb
81152fde3cec55eedd593f8904f510f4816cf2ee923a2200a2c93deeeee9688d
4db5a0b43fc47c703a7a58e9811fe7b500297560f02d5001675b89fd2cfae482
5b23690ac855f0e4b807c6e777a8f7040c25fe2cfadbe0f069d4ca8458751c09
d2d3bd9fc073808a5bfbc45b2506188b6dd2668e30706891c9858d0460026cf2
4be5f608e2beb0be5534f37c25425dd356fdc3b50c7d05edc07a0a1de90c2d60
306b6a6801f4b0cd0543c152cbeb916ee8a331cb5017f8dc9751169a3a12992c
6b88d116d1234826be27f52274450ab322695db7b559d1452d480a47d9a31a4e
7852bb1c21a09cedde2fc2d604d22767d23cd6700469e24e2e446b2183b8977e
8aaa8be7efe58b1b82e467d192fedfe5c837769bf7f95b12350da654f7afb4f5
23dc50e5b14a92429ad8f9e18f8af2ad72a30b1a1846afb1d790377bf414165f
51cca00365c70ddaa34fb89788d2afdd0091177a346a50170b0d548e2153d9e4
5f4c8a34f9c39470cb007bc66ae322e5bf3646bfd0a9c1e414bf931ce556eb30
87f8dcb7cff768539b0765ec0b0de7ea63402f801d7df18314301c766dc4feae
e48e1db68367b0e030f81dea86e50f735d1d1124fe50db4de977c2111ea4eb5f
0e3f57768b7b6471ecdef4cc211d0298295c700efebf61b438cb89eec55ae4d8
314f5c6a0b25ceb7985018dbd74f555aaf8e865d65eb2f3ac72ea16deb6e3757
1e3b43f06d357c1b6828ca87626d9e09e40cdca02c8e2c9f664e1ff4ef52ea9a
24c7bf4ec7bebdbf260eb14c5fca51c2e8ad81ea4941abb9a3e7d17ccdd2e8b4
4b4a544a12542adfbe969586334d9f802ef998d230dd777c7d504d8305d21272
584af47936139271fc6c748cf9e4c60fd385bd06c909aa51cc7c73d0a1019603
ef52ed5382f18fb8dfb4dd62feeaeecf96397251debd54a3fd56eba7b6fb4152
09891a41df585a27205ebc3efeedd166b306e1ef3b30f910217a2cd89af3fab3
d90731d9cdce28b86f8f4c16296b2d9b51f8a5540627c16b27260aa43147bedd
51a65e61af8cbd6e345543618c135ca10c9cc20bbe0fed43cefb8edff8a6660b
e00e8579356f00a9cd144bd583de5c459d7e4d41008ce115eb445d2e3617b401
237df3d8a99e7cf609182f665d2ae50d8ab180041712842655244ea608dff9c0

Total reclaimed space: 11.08GB
Build step 'Execute shell' marked build as failure
Recording test results
ERROR: Step ‘Publish JUnit test result report’ failed: No test report files were found. Configuration error?

Build failed in Jenkins: Allura » Allura-py3.7 #260

Posted by Apache Jenkins Server <je...@builds.apache.org>.
See <https://ci-builds.apache.org/job/Allura/job/Allura-py3.7/260/display/redirect>

Changes:


------------------------------------------
[...truncated 4.41 KB...]
BUILD_TIMESTAMP=2023-08-14 17:29:23 UTC
CI=true
GIT_URL=https://gitbox.apache.org/repos/asf/allura.git/
HUDSON_COOKIE=e268b23c-f7a6-44d4-a65e-c8233f6effc4
XDG_SESSION_ID=2611
USER=jenkins
BUILD_NUMBER=260
WORKSPACE=<https://ci-builds.apache.org/job/Allura/job/Allura-py3.7/ws/>
PWD=<https://ci-builds.apache.org/job/Allura/job/Allura-py3.7/ws/>
HUDSON_URL=https://ci-builds.apache.org/
HOME=/home/jenkins
JENKINSGRADLEPLUGIN_CCUD_PLUGIN_VERSION=1.10
NODE_NAME=builds58
HUDSON_SERVER_COOKIE=9c7f00b5d9bf9427
SSH_CLIENT=95.217.196.215 59128 22
JENKINS_HOME=/home/jenkins/jenkins-home
JOB_NAME=Allura/Allura-py3.7
RUN_TESTS_DISPLAY_URL=https://ci-builds.apache.org/job/Allura/job/Allura-py3.7/260/display/redirect?page=tests
GIT_PREVIOUS_COMMIT=90b07ba2f6d010273068235f31185075d02fd317
HUDSON_HOME=/home/jenkins/jenkins-home
JOB_DISPLAY_URL=https://ci-builds.apache.org/job/Allura/job/Allura-py3.7/display/redirect
JENKINSGRADLEPLUGIN_GRADLE_ENTERPRISE_ENFORCE_URL=true
JENKINSGRADLEPLUGIN_GRADLE_AUTO_INJECTION=true
RUN_ARTIFACTS_DISPLAY_URL=https://ci-builds.apache.org/job/Allura/job/Allura-py3.7/260/display/redirect?page=artifacts
MAIL=/var/mail/jenkins
BUILD_URL=https://ci-builds.apache.org/job/Allura/job/Allura-py3.7/260/
SHELL=/bin/bash
JOB_URL=https://ci-builds.apache.org/job/Allura/job/Allura-py3.7/
BUILD_DISPLAY_NAME=#260
PY_VERSION=3.7
ROOT_BUILD_CAUSE=MANUALTRIGGER
SHLVL=3
GIT_BRANCH=origin/master
JENKINSGRADLEPLUGIN_GRADLE_ENTERPRISE_URL=https://ge.apache.org
ROOT_BUILD_CAUSE_MANUALTRIGGER=true
BUILD_TAG=jenkins-Allura-Allura-py3.7-260
JENKINSGRADLEPLUGIN_GRADLE_ENTERPRISE_GRADLE_INJECTION_ENABLED=false
NODE_LABELS=builds58 ubuntu
LOGNAME=jenkins
DBUS_SESSION_BUS_ADDRESS=unix:path=/run/user/910/bus
XDG_RUNTIME_DIR=/run/user/910
PATH=/usr/local/sbin:/usr/local/bin:/usr/sbin:/usr/bin:/sbin:/bin:/snap/bin
BUILD_CAUSE_MANUALTRIGGER=true
GIT_PREVIOUS_SUCCESSFUL_COMMIT=61ee60cac206a2ef7e705c1e4496cc6a43fd91a1
JENKINS_SERVER_COOKIE=9c7f00b5d9bf9427
_=/usr/bin/env

=============================================================================
Run: cleanup previous runs
=============================================================================
/usr/local/lib/python2.7/dist-packages/paramiko/transport.py:33: CryptographyDeprecationWarning: Python 2 is no longer supported by the Python core team. Support for it is now deprecated in cryptography, and will be removed in the next release.
  from cryptography.hazmat.backends import default_backend
Removing network allura_default
Network allura_default not found.

=============================================================================
Run: build docker image
=============================================================================
/usr/local/lib/python2.7/dist-packages/paramiko/transport.py:33: CryptographyDeprecationWarning: Python 2 is no longer supported by the Python core team. Support for it is now deprecated in cryptography, and will be removed in the next release.
  from cryptography.hazmat.backends import default_backend
--build-arg is only supported when services are specified for API version < 1.25. Please use a Compose file version > 2.2 or specify which services to build.

=============================================================================
Setup: venv, pip, pysvn, ./rebuild-all.sh, npm, etc.
=============================================================================
/usr/local/lib/python2.7/dist-packages/paramiko/transport.py:33: CryptographyDeprecationWarning: Python 2 is no longer supported by the Python core team. Support for it is now deprecated in cryptography, and will be removed in the next release.
  from cryptography.hazmat.backends import default_backend
Creating network "allura_default" with the default driver
Pulling mongo (mongo:4.2)...
4.2: Pulling from library/mongo
Digest: sha256:699d652ed67423d689258bad7b316cf005dfbb82b334118ec306f049042f3717
Status: Downloaded newer image for mongo:4.2
Pulling solr (solr:6-alpine)...
6-alpine: Pulling from library/solr
Digest: sha256:4f63093698313437a49b2f945c4b1545c9e3a655f52581bc6e01ea006fae132e
Status: Downloaded newer image for solr:6-alpine
Creating allura_solr_1 ... 
Creating allura_mongo_1 ... 
Creating allura_mongo_1 ... doneCreating allura_solr_1  ... doneBuilding web
Traceback (most recent call last):
  File "/usr/local/bin/docker-compose", line 8, in <module>
    sys.exit(main())
  File "/usr/local/lib/python2.7/dist-packages/compose/cli/main.py", line 72, in main
    command()
  File "/usr/local/lib/python2.7/dist-packages/compose/cli/main.py", line 128, in perform_command
    handler(command, command_options)
  File "/usr/local/lib/python2.7/dist-packages/compose/cli/main.py", line 866, in run
    self.toplevel_options, self.toplevel_environment
  File "/usr/local/lib/python2.7/dist-packages/compose/cli/main.py", line 1327, in run_one_off_container
    **container_options)
  File "/usr/local/lib/python2.7/dist-packages/compose/service.py", line 331, in create_container
    self.ensure_image_exists()
  File "/usr/local/lib/python2.7/dist-packages/compose/service.py", line 367, in ensure_image_exists
    self.build(cli=cli)
  File "/usr/local/lib/python2.7/dist-packages/compose/service.py", line 1106, in build
    platform=self.platform,
  File "/usr/local/lib/python2.7/dist-packages/docker/api/build.py", line 160, in build
    path, exclude=exclude, dockerfile=dockerfile, gzip=gzip
  File "/usr/local/lib/python2.7/dist-packages/docker/utils/build.py", line 30, in tar
    files=sorted(exclude_paths(root, exclude, dockerfile=dockerfile[0])),
  File "/usr/local/lib/python2.7/dist-packages/docker/utils/build.py", line 49, in exclude_paths
    return set(pm.walk(root))
  File "/usr/local/lib/python2.7/dist-packages/docker/utils/build.py", line 215, in rec_walk
    for sub in rec_walk(cur):
  File "/usr/local/lib/python2.7/dist-packages/docker/utils/build.py", line 215, in rec_walk
    for sub in rec_walk(cur):
  File "/usr/local/lib/python2.7/dist-packages/docker/utils/build.py", line 215, in rec_walk
    for sub in rec_walk(cur):
  File "/usr/local/lib/python2.7/dist-packages/docker/utils/build.py", line 185, in rec_walk
    for f in os.listdir(current_dir):
OSError: [Errno 13] Permission denied: '<https://ci-builds.apache.org/job/Allura/job/Allura-py3.7/ws/allura-data/mongo/journal'>

=============================================================================
Starting up docker containers
=============================================================================
/usr/local/lib/python2.7/dist-packages/paramiko/transport.py:33: CryptographyDeprecationWarning: Python 2 is no longer supported by the Python core team. Support for it is now deprecated in cryptography, and will be removed in the next release.
  from cryptography.hazmat.backends import default_backend
Building web
Traceback (most recent call last):
  File "/usr/local/bin/docker-compose", line 8, in <module>
    sys.exit(main())
  File "/usr/local/lib/python2.7/dist-packages/compose/cli/main.py", line 72, in main
    command()
  File "/usr/local/lib/python2.7/dist-packages/compose/cli/main.py", line 128, in perform_command
    handler(command, command_options)
  File "/usr/local/lib/python2.7/dist-packages/compose/cli/main.py", line 1078, in up
    to_attach = up(False)
  File "/usr/local/lib/python2.7/dist-packages/compose/cli/main.py", line 1074, in up
    cli=native_builder,
  File "/usr/local/lib/python2.7/dist-packages/compose/project.py", line 548, in up
    svc.ensure_image_exists(do_build=do_build, silent=silent, cli=cli)
  File "/usr/local/lib/python2.7/dist-packages/compose/service.py", line 367, in ensure_image_exists
    self.build(cli=cli)
  File "/usr/local/lib/python2.7/dist-packages/compose/service.py", line 1106, in build
    platform=self.platform,
  File "/usr/local/lib/python2.7/dist-packages/docker/api/build.py", line 160, in build
    path, exclude=exclude, dockerfile=dockerfile, gzip=gzip
  File "/usr/local/lib/python2.7/dist-packages/docker/utils/build.py", line 30, in tar
    files=sorted(exclude_paths(root, exclude, dockerfile=dockerfile[0])),
  File "/usr/local/lib/python2.7/dist-packages/docker/utils/build.py", line 49, in exclude_paths
    return set(pm.walk(root))
  File "/usr/local/lib/python2.7/dist-packages/docker/utils/build.py", line 215, in rec_walk
    for sub in rec_walk(cur):
  File "/usr/local/lib/python2.7/dist-packages/docker/utils/build.py", line 215, in rec_walk
    for sub in rec_walk(cur):
  File "/usr/local/lib/python2.7/dist-packages/docker/utils/build.py", line 215, in rec_walk
    for sub in rec_walk(cur):
  File "/usr/local/lib/python2.7/dist-packages/docker/utils/build.py", line 185, in rec_walk
    for f in os.listdir(current_dir):
OSError: [Errno 13] Permission denied: '<https://ci-builds.apache.org/job/Allura/job/Allura-py3.7/ws/allura-data/mongo/journal'>

=============================================================================
Docker Container Info:
=============================================================================
/usr/local/lib/python2.7/dist-packages/paramiko/transport.py:33: CryptographyDeprecationWarning: Python 2 is no longer supported by the Python core team. Support for it is now deprecated in cryptography, and will be removed in the next release.
  from cryptography.hazmat.backends import default_backend
No container found for web_1

=============================================================================
Setup: tests
=============================================================================
/usr/local/lib/python2.7/dist-packages/paramiko/transport.py:33: CryptographyDeprecationWarning: Python 2 is no longer supported by the Python core team. Support for it is now deprecated in cryptography, and will be removed in the next release.
  from cryptography.hazmat.backends import default_backend
No container found for web_1
/usr/local/lib/python2.7/dist-packages/paramiko/transport.py:33: CryptographyDeprecationWarning: Python 2 is no longer supported by the Python core team. Support for it is now deprecated in cryptography, and will be removed in the next release.
  from cryptography.hazmat.backends import default_backend
No container found for web_1

=============================================================================
Run: tests
=============================================================================
/usr/local/lib/python2.7/dist-packages/paramiko/transport.py:33: CryptographyDeprecationWarning: Python 2 is no longer supported by the Python core team. Support for it is now deprecated in cryptography, and will be removed in the next release.
  from cryptography.hazmat.backends import default_backend
No container found for web_1
/usr/local/lib/python2.7/dist-packages/paramiko/transport.py:33: CryptographyDeprecationWarning: Python 2 is no longer supported by the Python core team. Support for it is now deprecated in cryptography, and will be removed in the next release.
  from cryptography.hazmat.backends import default_backend
No container found for web_1
/usr/local/lib/python2.7/dist-packages/paramiko/transport.py:33: CryptographyDeprecationWarning: Python 2 is no longer supported by the Python core team. Support for it is now deprecated in cryptography, and will be removed in the next release.
  from cryptography.hazmat.backends import default_backend
Setting environment for exec is not supported in API < 1.25 (1.24)

=============================================================================
Shutdown
=============================================================================
/usr/local/lib/python2.7/dist-packages/paramiko/transport.py:33: CryptographyDeprecationWarning: Python 2 is no longer supported by the Python core team. Support for it is now deprecated in cryptography, and will be removed in the next release.
  from cryptography.hazmat.backends import default_backend
Stopping allura_solr_1  ... 
Stopping allura_mongo_1 ... 
Stopping allura_mongo_1 ... doneStopping allura_solr_1  ... doneRemoving allura_solr_1  ... 
Removing allura_mongo_1 ... 
Removing allura_mongo_1 ... doneRemoving allura_solr_1  ... doneRemoving network allura_default
Total reclaimed space: 0B
Deleted Volumes:
aa77711e48e5d42ba50dc740ed9ca3f64459449af08050734eeaeb0ea0bd3d34
75cf2c5fa9418ccf6f551413e3938ddf3ecbc974d084896540672d2447ff1f6e
7ec69ee44fe3b7a67d660c02213deca31c82343e86c24a556722cf1eef67ea9c
090c4c8e6f9def28d02888fd5232592ecf919f0a9e1197cb5c14c8abf9594a14
59cca35b87bc2f9f76f84e9d8601802b47ebc503a2578f19cacf18e2bd142dd9
be835e8d52c5fe2472f022b8f125c1e4f4ab420b199746e698cab4300ab50366
7a1ea03ee1a0d9ff2d3b561744446f377b313d3da5f8f409ac6a5c4c62e35adc
7745186b452b1d9292173425381d229cb5a3448468f077d7c1b06eb23b72fd98
e4339382b1e334888fec96d723a2a2bc3c014babc902f3178d0635dae062257c
566dceab33a1845b751a19a7ea3536957e1a4c1e4e9e1bb12f8a6ddd93ff1fc3
230650f59513d7357f1dd63da0d791ca4f390f7406ec71bf88200f844ccd1cff
f6515be6ab1ef96bf12198cc1c73bbc5b9285e13035079452bdc87d64788938e
e4b1ad91a092d315f554be108ce2d6159ef3dc2d97d55ba218b217e1e87e5f34
a25d56f96474e28f954ec58f0504fb3be896ef0414261af8f9c001bc6c38759c
17f91a3e8933e128048b7db0073052d63269b6c7a44a87b645f45ca9249552ee
595fdfb78ef12bb56faa5be2d76c7fd067e348d05eeec0cb4041710975f01fa3
848971e2ee982e1283a1e6b259f282b99cc303bd578c09919133e987742382ab
0517d3b85ad07e5dd347a2c205f404f9f8351c4207b9dc849fdcae520f6424c8
8722151c6624a8a28ed83f73f7b187325e96b1ee0bb59b0b707de527f2a6d921
ee983f4967f4fa0c7817caae4003a73c6c9463ed471227793df791034821cbff
6706073a2156f5b829fc0d681f555b23fa9babb44122b93aac953311a98d55d6
06c5ac5197c24e2965dc9081a71d12d2fcabb1574b4fdd6456ef38739f52b6ed
4a24a2a2cf181eaadfc1d297b6c41a9b5dc6e1e5a3c66fb7138dcd3772f895b4
70a06e22143f69451387be8315374a2ee035fd3cb70251ddfd7d91aa4036e985
4f041ce60f0e3f40e51a582acb9285ea4be78a26f5b32d6df94f88c9143240e4
e84c71e2df1f18523d4bfcf38e46a8a013df3a14628267fbc8e9aac857428b34
f2d4d9cb98628068379eac11990bc525e93b2cba407f2ee5ce09fc6a9eed1ad7
3be1fd013050f502ff364ab98b963dfb6f85027974f57c81e7916ffc55b129ad
7fbf54a3a5d742a4f54649b079918dbb86b1d36452b76b8dc630bd011f275f7b
d7e1c675ed0c2835331ef88309aa64eb671274d669c6d533fcfeee8346557564
f92b3b8022fa02021a849a4825f79bdfcda4ccc7cdf2be42c25129db25e52b38
c4e75fc82146bce8598b40151ec1e536fdac514cbc56f38ac527da5b87d6a793
c4b7dc824f797c9fc312b6ef3db884d72e82e3770fcc22e3c2da967f9f1f67e6
8b0467dc2638b04fca4ed22502624c04bc070ec1fb3b529a0cf8014fdfec67b6
dbe10c592f45e066bb0638157eaf7e5351569e5c62742bbde08e112248419d5b
7d33db582c58d6b4649f65286346876d88dc5b6f5ac350dc58738471b5ff55a8
5025e370c45550622cf9905a87e18384621fa79a15fc93bd42cdc05c13efa367
3bec7d71ca8fb8398d0978b4dbb5af7280a78aa8074db532ee9904e3370f37be
7964ebfa1fc82f716fff5a292ec14e5a2eaeb3a4cfed2617cba8354c335bbbdc
6820c5b7737a644945fe2eede0ed9ae8337ebcc6202529d08207f27002fc9505
d2d88f65e982476902337d092a320f78cb8e528c7f802640a8b1a2e401c6b124
0866cc1f34e0d2a94a1700b3b4136711421199d9f08de235ada3469c89bb9cf2
042ad93ef7baa61cd957a530d38bd828054f001c512efaa0db9509064911dbac
be872cd9b7986bdee1b23e74309268f76fd449d39388cbe7574d31d55d5ec595
9cd9f99514b4af81ccdaae9e80e96ee77ae05185bac0294351574635f0266760
220a83ca9e0ca2c2a2295dadf6d3b872f983339b7ece868897e3e9a871ac9891
2a91744c7ca899142e597d1abafb9144ef57521153004c0be98f74c2900ea2fc
3dd2bdb050d59dd54bfd3f7d418b8780fa056696a06c114502b8498236d0d90a
abc9d596fa2301ac184f9507f4984eb16b5a50fc2d1e651944248883fd9ec562
ac811939117a8188fb410d6fb7beb9d57a86347765691e5c8e6dc5ab3a4f3da5
13c963040f1a95f4b130819846ffbc2f4e836adbb56b09f61e43b5127c1bb2b3

Total reclaimed space: 8.595GB
Build step 'Execute shell' marked build as failure
Recording test results
ERROR: Step ?Publish JUnit test result report? failed: No test report files were found. Configuration error?

Build failed in Jenkins: Allura » Allura-py3.7 #259

Posted by Apache Jenkins Server <je...@builds.apache.org>.
See <https://ci-builds.apache.org/job/Allura/job/Allura-py3.7/259/display/redirect>

Changes:


------------------------------------------
[...truncated 3.53 KB...]
workspace: <https://ci-builds.apache.org/job/Allura/job/Allura-py3.7/ws/>
jenkins_home: /home/jenkins/jenkins-home
home: /home/jenkins
pwd: <https://ci-builds.apache.org/job/Allura/job/Allura-py3.7/ws/>
GIT_COMMIT=90b07ba2f6d010273068235f31185075d02fd317
RUN_DISPLAY_URL=https://ci-builds.apache.org/job/Allura/job/Allura-py3.7/259/display/redirect
JENKINS_URL=https://ci-builds.apache.org/
EXECUTOR_NUMBER=0
SSH_CONNECTION=95.217.196.215 57886 67.195.81.182 22
LANG=en_US
BUILD_ID=259
BUILD_CAUSE=MANUALTRIGGER
OLDPWD=/home/jenkins
RUN_CHANGES_DISPLAY_URL=https://ci-builds.apache.org/job/Allura/job/Allura-py3.7/259/display/redirect?page=changes
GRADLE_ENTERPRISE_ACCESS_KEY=ge.apache.org=etlwjhwel56ybdijfxymbj5bb6fwydcy3sj2oe6rlwjzotgalrea
JENKINSGRADLEPLUGIN_GRADLE_ENTERPRISE_PLUGIN_VERSION=3.13.1
JOB_BASE_NAME=Allura-py3.7
WORKSPACE_TMP=<ht...@tmp>
BUILD_TIMESTAMP=2023-08-14 17:25:48 UTC
CI=true
GIT_URL=https://gitbox.apache.org/repos/asf/allura.git/
HUDSON_COOKIE=64267e7c-ea87-4742-9246-a27912b00f6e
XDG_SESSION_ID=2577
USER=jenkins
BUILD_NUMBER=259
WORKSPACE=<https://ci-builds.apache.org/job/Allura/job/Allura-py3.7/ws/>
PWD=<https://ci-builds.apache.org/job/Allura/job/Allura-py3.7/ws/>
HUDSON_URL=https://ci-builds.apache.org/
HOME=/home/jenkins
JENKINSGRADLEPLUGIN_CCUD_PLUGIN_VERSION=1.10
NODE_NAME=builds56
HUDSON_SERVER_COOKIE=9c7f00b5d9bf9427
SSH_CLIENT=95.217.196.215 57886 22
JENKINS_HOME=/home/jenkins/jenkins-home
JOB_NAME=Allura/Allura-py3.7
RUN_TESTS_DISPLAY_URL=https://ci-builds.apache.org/job/Allura/job/Allura-py3.7/259/display/redirect?page=tests
GIT_PREVIOUS_COMMIT=90b07ba2f6d010273068235f31185075d02fd317
HUDSON_HOME=/home/jenkins/jenkins-home
JOB_DISPLAY_URL=https://ci-builds.apache.org/job/Allura/job/Allura-py3.7/display/redirect
JENKINSGRADLEPLUGIN_GRADLE_ENTERPRISE_ENFORCE_URL=true
JENKINSGRADLEPLUGIN_GRADLE_AUTO_INJECTION=true
RUN_ARTIFACTS_DISPLAY_URL=https://ci-builds.apache.org/job/Allura/job/Allura-py3.7/259/display/redirect?page=artifacts
MAIL=/var/mail/jenkins
BUILD_URL=https://ci-builds.apache.org/job/Allura/job/Allura-py3.7/259/
SHELL=/bin/bash
JOB_URL=https://ci-builds.apache.org/job/Allura/job/Allura-py3.7/
BUILD_DISPLAY_NAME=#259
PY_VERSION=3.7
ROOT_BUILD_CAUSE=MANUALTRIGGER
SHLVL=3
GIT_BRANCH=origin/master
JENKINSGRADLEPLUGIN_GRADLE_ENTERPRISE_URL=https://ge.apache.org
ROOT_BUILD_CAUSE_MANUALTRIGGER=true
BUILD_TAG=jenkins-Allura-Allura-py3.7-259
JENKINSGRADLEPLUGIN_GRADLE_ENTERPRISE_GRADLE_INJECTION_ENABLED=false
NODE_LABELS=builds56 ubuntu
LOGNAME=jenkins
DBUS_SESSION_BUS_ADDRESS=unix:path=/run/user/910/bus
XDG_RUNTIME_DIR=/run/user/910
PATH=/usr/local/sbin:/usr/local/bin:/usr/sbin:/usr/bin:/sbin:/bin:/snap/bin
BUILD_CAUSE_MANUALTRIGGER=true
GIT_PREVIOUS_SUCCESSFUL_COMMIT=61ee60cac206a2ef7e705c1e4496cc6a43fd91a1
JENKINS_SERVER_COOKIE=9c7f00b5d9bf9427
_=/usr/bin/env

=============================================================================
Run: cleanup previous runs
=============================================================================
/usr/local/lib/python2.7/dist-packages/paramiko/transport.py:33: CryptographyDeprecationWarning: Python 2 is no longer supported by the Python core team. Support for it is now deprecated in cryptography, and will be removed in the next release.
  from cryptography.hazmat.backends import default_backend
Removing network allura_default
Network allura_default not found.

=============================================================================
Run: build docker image
=============================================================================
/usr/local/lib/python2.7/dist-packages/paramiko/transport.py:33: CryptographyDeprecationWarning: Python 2 is no longer supported by the Python core team. Support for it is now deprecated in cryptography, and will be removed in the next release.
  from cryptography.hazmat.backends import default_backend
--build-arg is only supported when services are specified for API version < 1.25. Please use a Compose file version > 2.2 or specify which services to build.

=============================================================================
Setup: venv, pip, pysvn, ./rebuild-all.sh, npm, etc.
=============================================================================
/usr/local/lib/python2.7/dist-packages/paramiko/transport.py:33: CryptographyDeprecationWarning: Python 2 is no longer supported by the Python core team. Support for it is now deprecated in cryptography, and will be removed in the next release.
  from cryptography.hazmat.backends import default_backend
Creating network "allura_default" with the default driver
Pulling mongo (mongo:4.2)...
4.2: Pulling from library/mongo
Digest: sha256:699d652ed67423d689258bad7b316cf005dfbb82b334118ec306f049042f3717
Status: Downloaded newer image for mongo:4.2
Pulling solr (solr:6-alpine)...
6-alpine: Pulling from library/solr
Digest: sha256:4f63093698313437a49b2f945c4b1545c9e3a655f52581bc6e01ea006fae132e
Status: Downloaded newer image for solr:6-alpine
Creating allura_mongo_1 ... 
Creating allura_solr_1  ... 
Creating allura_mongo_1 ... doneCreating allura_solr_1  ... doneBuilding web
Traceback (most recent call last):
  File "/usr/local/bin/docker-compose", line 8, in <module>
    sys.exit(main())
  File "/usr/local/lib/python2.7/dist-packages/compose/cli/main.py", line 72, in main
    command()
  File "/usr/local/lib/python2.7/dist-packages/compose/cli/main.py", line 128, in perform_command
    handler(command, command_options)
  File "/usr/local/lib/python2.7/dist-packages/compose/cli/main.py", line 866, in run
    self.toplevel_options, self.toplevel_environment
  File "/usr/local/lib/python2.7/dist-packages/compose/cli/main.py", line 1327, in run_one_off_container
    **container_options)
  File "/usr/local/lib/python2.7/dist-packages/compose/service.py", line 331, in create_container
    self.ensure_image_exists()
  File "/usr/local/lib/python2.7/dist-packages/compose/service.py", line 367, in ensure_image_exists
    self.build(cli=cli)
  File "/usr/local/lib/python2.7/dist-packages/compose/service.py", line 1106, in build
    platform=self.platform,
  File "/usr/local/lib/python2.7/dist-packages/docker/api/build.py", line 160, in build
    path, exclude=exclude, dockerfile=dockerfile, gzip=gzip
  File "/usr/local/lib/python2.7/dist-packages/docker/utils/build.py", line 30, in tar
    files=sorted(exclude_paths(root, exclude, dockerfile=dockerfile[0])),
  File "/usr/local/lib/python2.7/dist-packages/docker/utils/build.py", line 49, in exclude_paths
    return set(pm.walk(root))
  File "/usr/local/lib/python2.7/dist-packages/docker/utils/build.py", line 215, in rec_walk
    for sub in rec_walk(cur):
  File "/usr/local/lib/python2.7/dist-packages/docker/utils/build.py", line 215, in rec_walk
    for sub in rec_walk(cur):
  File "/usr/local/lib/python2.7/dist-packages/docker/utils/build.py", line 215, in rec_walk
    for sub in rec_walk(cur):
  File "/usr/local/lib/python2.7/dist-packages/docker/utils/build.py", line 185, in rec_walk
    for f in os.listdir(current_dir):
OSError: [Errno 13] Permission denied: '<https://ci-builds.apache.org/job/Allura/job/Allura-py3.7/ws/allura-data/mongo/journal'>

=============================================================================
Starting up docker containers
=============================================================================
/usr/local/lib/python2.7/dist-packages/paramiko/transport.py:33: CryptographyDeprecationWarning: Python 2 is no longer supported by the Python core team. Support for it is now deprecated in cryptography, and will be removed in the next release.
  from cryptography.hazmat.backends import default_backend
Building web
Traceback (most recent call last):
  File "/usr/local/bin/docker-compose", line 8, in <module>
    sys.exit(main())
  File "/usr/local/lib/python2.7/dist-packages/compose/cli/main.py", line 72, in main
    command()
  File "/usr/local/lib/python2.7/dist-packages/compose/cli/main.py", line 128, in perform_command
    handler(command, command_options)
  File "/usr/local/lib/python2.7/dist-packages/compose/cli/main.py", line 1078, in up
    to_attach = up(False)
  File "/usr/local/lib/python2.7/dist-packages/compose/cli/main.py", line 1074, in up
    cli=native_builder,
  File "/usr/local/lib/python2.7/dist-packages/compose/project.py", line 548, in up
    svc.ensure_image_exists(do_build=do_build, silent=silent, cli=cli)
  File "/usr/local/lib/python2.7/dist-packages/compose/service.py", line 367, in ensure_image_exists
    self.build(cli=cli)
  File "/usr/local/lib/python2.7/dist-packages/compose/service.py", line 1106, in build
    platform=self.platform,
  File "/usr/local/lib/python2.7/dist-packages/docker/api/build.py", line 160, in build
    path, exclude=exclude, dockerfile=dockerfile, gzip=gzip
  File "/usr/local/lib/python2.7/dist-packages/docker/utils/build.py", line 30, in tar
    files=sorted(exclude_paths(root, exclude, dockerfile=dockerfile[0])),
  File "/usr/local/lib/python2.7/dist-packages/docker/utils/build.py", line 49, in exclude_paths
    return set(pm.walk(root))
  File "/usr/local/lib/python2.7/dist-packages/docker/utils/build.py", line 215, in rec_walk
    for sub in rec_walk(cur):
  File "/usr/local/lib/python2.7/dist-packages/docker/utils/build.py", line 215, in rec_walk
    for sub in rec_walk(cur):
  File "/usr/local/lib/python2.7/dist-packages/docker/utils/build.py", line 215, in rec_walk
    for sub in rec_walk(cur):
  File "/usr/local/lib/python2.7/dist-packages/docker/utils/build.py", line 185, in rec_walk
    for f in os.listdir(current_dir):
OSError: [Errno 13] Permission denied: '<https://ci-builds.apache.org/job/Allura/job/Allura-py3.7/ws/allura-data/mongo/diagnostic.data'>

=============================================================================
Docker Container Info:
=============================================================================
/usr/local/lib/python2.7/dist-packages/paramiko/transport.py:33: CryptographyDeprecationWarning: Python 2 is no longer supported by the Python core team. Support for it is now deprecated in cryptography, and will be removed in the next release.
  from cryptography.hazmat.backends import default_backend
No container found for web_1

=============================================================================
Setup: tests
=============================================================================
/usr/local/lib/python2.7/dist-packages/paramiko/transport.py:33: CryptographyDeprecationWarning: Python 2 is no longer supported by the Python core team. Support for it is now deprecated in cryptography, and will be removed in the next release.
  from cryptography.hazmat.backends import default_backend
No container found for web_1
/usr/local/lib/python2.7/dist-packages/paramiko/transport.py:33: CryptographyDeprecationWarning: Python 2 is no longer supported by the Python core team. Support for it is now deprecated in cryptography, and will be removed in the next release.
  from cryptography.hazmat.backends import default_backend
No container found for web_1

=============================================================================
Run: tests
=============================================================================
/usr/local/lib/python2.7/dist-packages/paramiko/transport.py:33: CryptographyDeprecationWarning: Python 2 is no longer supported by the Python core team. Support for it is now deprecated in cryptography, and will be removed in the next release.
  from cryptography.hazmat.backends import default_backend
No container found for web_1
/usr/local/lib/python2.7/dist-packages/paramiko/transport.py:33: CryptographyDeprecationWarning: Python 2 is no longer supported by the Python core team. Support for it is now deprecated in cryptography, and will be removed in the next release.
  from cryptography.hazmat.backends import default_backend
No container found for web_1
/usr/local/lib/python2.7/dist-packages/paramiko/transport.py:33: CryptographyDeprecationWarning: Python 2 is no longer supported by the Python core team. Support for it is now deprecated in cryptography, and will be removed in the next release.
  from cryptography.hazmat.backends import default_backend
Setting environment for exec is not supported in API < 1.25 (1.24)

=============================================================================
Shutdown
=============================================================================
/usr/local/lib/python2.7/dist-packages/paramiko/transport.py:33: CryptographyDeprecationWarning: Python 2 is no longer supported by the Python core team. Support for it is now deprecated in cryptography, and will be removed in the next release.
  from cryptography.hazmat.backends import default_backend
Stopping allura_solr_1  ... 
Stopping allura_mongo_1 ... 
Stopping allura_mongo_1 ... doneStopping allura_solr_1  ... doneRemoving allura_solr_1  ... 
Removing allura_mongo_1 ... 
Removing allura_mongo_1 ... doneRemoving allura_solr_1  ... doneRemoving network allura_default
Total reclaimed space: 0B
Deleted Volumes:
4a23909d8858b8d8ae0cb5e3c1887a73a90b95fc267be75744dc908b0d5853ec
90140afe8445df7064c57f0b93064717be0d89fe12f2137f39b36690b9af0191
330753ef0844dadcd456e3ad00f2d0e67d393c96cdc575761507bddd8aa96f30
db6893ab2a443ab25e5477598a2630e307a9eafe7ec8e56ebc824b5a63ef0890
27246149f5ae2cce1d0691054e6e53f8009fecfcbc1edf46f641a33004814602
003a4cd5af9d1127b9a08d783099ac06c85025f68a2928fa241446058ce55f3d
1cd2dd47097c4d4313cc2801aeb9d6f14f5357bb75119c54c802da89a00abd7a
536e90fe3391a3505314e7c811b3a837fd5bbda19de6d3ccf0354b0bf4b99d5a
8345fd35218c9ebb997520006fb1f60d60e310c26d1b2646ec8ce3df093a44a4
5d0bee0db8de3e216abba6c8fa6133a824e2e8537d38d2e714c375287d153b2b
74fb61389011b9cef09e8954cfc4ae323fb542078a2d68c4397326fd4e08e7b5
b30ca294e982360326c1e32119b92ec2a710366ae8f232a3107db3e0722f70e9
508f34239095e80ef432e43974399aa069da0c8da62c9247a2ef94390fb44e6e
6ac6fae3078d15d0fde38f62473f44496f4f8c4ddcd9dacd1fc5807f6e1b6a20
a61756aa6250f79959eb53439810b21107fd334749da1ff488a7936c04ac2f96
404f2067c819936a46cb807d675a8bd05290a98b65e188b97cc2dca8e98cd378
aa38120353795d1a529f53e7676f60147674221d06d12a2e2bb6a0965bfa1343
95bd0a2f84518379520c5b01632ea6f5aa46d2fb0eba09dafc0fb8e02a3fe579
7f74a5edd93a72dcf279d574f674efcede4dbd5312904d79105e7394d2002693
ae42ae372afe78b6ab207a11979fd48836318c548aa45d0dc71da5cf8cc0cad3
6b52f38d1f129b3eb75c480f778271cab4ff6f1905bfcc14463fb3dc63585045
28fedcf6bd03f5fcce668985f805f24fd032116d6826d44827f24ca33f084291
07ece4096b252a065cd8094e2168af167a519456575348ed5f9213c28bdee709
518c54c8ca395b47a007f66c2dc60ee2dfb51ec872d9e4e88fc7bb3a7f4d2b6b
d45ed4e3f9c73081df4effd3243ea52751da471f9620a3a372b230e954a741c5
6d8c41941fcc755980c4cf9b6c677c584d86c67d1d734ea0f493663efd96aba7
cc119fddca2e89dcbbe9ce43dd6f0395f783dd28fa36e596e5fea329da32d826
057ac2938fda02f2064f00ddb1c142b6a8fc1b4d99d2647c5754505ea24a2ff6
a0c1ae2a41fcb0b8d1c6ffdcb22b24b4194da82b842580974ba5aadd45b872fe
c2cc04b6ec6f16dc69de855a3828b41f3bf5ac29445819f44b2984562b8cd997
33eca9b9adc401381e8ee0b63d6484ca5a523dbd5617dc9b33c55265a9479009
c72f34b4dc4a5cf925251faabf6879ed5247a440dbccf606f9a3477b2fa76ba7
bd0965031d2515d4d0199d2d08cb91fb59c04410f49ee09eeffed65753ef6dfa

Total reclaimed space: 5.272GB
Build step 'Execute shell' marked build as failure
Recording test results
ERROR: Step ?Publish JUnit test result report? failed: No test report files were found. Configuration error?