You are viewing a plain text version of this content. The canonical link for it is here.
Posted to dev@zookeeper.apache.org by Apache Jenkins Server <je...@builds.apache.org> on 2016/10/30 23:31:30 UTC

ZooKeeper-trunk - Build # 3138 - Still Failing

See https://builds.apache.org/job/ZooKeeper-trunk/3138/

###################################################################################
########################## LAST 60 LINES OF THE CONSOLE ###########################
[...truncated 425368 lines...]
    [junit] 	at org.jboss.netty.util.ThreadRenamingRunnable.run(ThreadRenamingRunnable.java:108)
    [junit] 	at org.jboss.netty.util.internal.DeadLockProofWorker$1.run(DeadLockProofWorker.java:42)
    [junit] 	at java.util.concurrent.ThreadPoolExecutor.runWorker(ThreadPoolExecutor.java:1145)
    [junit] 	at java.util.concurrent.ThreadPoolExecutor$Worker.run(ThreadPoolExecutor.java:615)
    [junit] 	at java.lang.Thread.run(Thread.java:745)
    [junit] 2016-10-30 23:30:07,430 [myid:] - INFO  [SyncThread:0:MBeanRegistry@128] - Unregister MBean [org.apache.ZooKeeperService:name0=StandaloneServer_port19545,name1=Connections,name2=127.0.0.1,name3=0x100a85f02740000]
    [junit] 2016-10-30 23:30:07,530 [myid:] - INFO  [main:ZooKeeper@1315] - Session: 0x100a85f02740000 closed
    [junit] 2016-10-30 23:30:07,530 [myid:] - INFO  [main:JUnit4ZKTestRunner$LoggedInvokeMethod@82] - Memory used 176041
    [junit] 2016-10-30 23:30:07,530 [myid:] - INFO  [main:JUnit4ZKTestRunner$LoggedInvokeMethod@87] - Number of threads 1643
    [junit] 2016-10-30 23:30:07,530 [myid:] - INFO  [main:JUnit4ZKTestRunner$LoggedInvokeMethod@102] - FINISHED TEST METHOD testWatcherAutoResetWithLocal
    [junit] 2016-10-30 23:30:07,531 [myid:] - INFO  [main:ClientBase@543] - tearDown starting
    [junit] 2016-10-30 23:30:07,531 [myid:] - INFO  [main:ClientBase@513] - STOPPING server
    [junit] 2016-10-30 23:30:07,531 [myid:] - INFO  [main:NettyServerCnxnFactory@464] - shutdown called 0.0.0.0/0.0.0.0:19545
    [junit] 2016-10-30 23:30:07,530 [myid:] - INFO  [main-EventThread:ClientCnxn$EventThread@513] - EventThread shut down for session: 0x100a85f02740000
    [junit] 2016-10-30 23:30:07,536 [myid:] - INFO  [main:ZooKeeperServer@529] - shutting down
    [junit] 2016-10-30 23:30:07,536 [myid:] - ERROR [main:ZooKeeperServer@501] - ZKShutdownHandler is not registered, so ZooKeeper server won't take any action on ERROR or SHUTDOWN server state changes
    [junit] 2016-10-30 23:30:07,537 [myid:] - INFO  [main:SessionTrackerImpl@232] - Shutting down
    [junit] 2016-10-30 23:30:07,537 [myid:] - INFO  [main:PrepRequestProcessor@996] - Shutting down
    [junit] 2016-10-30 23:30:07,537 [myid:] - INFO  [main:SyncRequestProcessor@191] - Shutting down
    [junit] 2016-10-30 23:30:07,537 [myid:] - INFO  [ProcessThread(sid:0 cport:19545)::PrepRequestProcessor@156] - PrepRequestProcessor exited loop!
    [junit] 2016-10-30 23:30:07,537 [myid:] - INFO  [SyncThread:0:SyncRequestProcessor@169] - SyncRequestProcessor exited!
    [junit] 2016-10-30 23:30:07,538 [myid:] - INFO  [main:FinalRequestProcessor@481] - shutdown of request processor complete
    [junit] 2016-10-30 23:30:07,539 [myid:] - INFO  [main:MBeanRegistry@128] - Unregister MBean [org.apache.ZooKeeperService:name0=StandaloneServer_port19545,name1=InMemoryDataTree]
    [junit] 2016-10-30 23:30:07,539 [myid:] - INFO  [main:MBeanRegistry@128] - Unregister MBean [org.apache.ZooKeeperService:name0=StandaloneServer_port19545]
    [junit] 2016-10-30 23:30:07,539 [myid:] - INFO  [main:FourLetterWordMain@85] - connecting to 127.0.0.1 19545
    [junit] 2016-10-30 23:30:07,541 [myid:] - INFO  [main:JMXEnv@146] - ensureOnly:[]
    [junit] 2016-10-30 23:30:07,546 [myid:] - INFO  [main:ClientBase@568] - fdcount after test is: 4823 at start it was 4823
    [junit] 2016-10-30 23:30:07,547 [myid:] - INFO  [main:ZKTestCase$1@65] - SUCCEEDED testWatcherAutoResetWithLocal
    [junit] 2016-10-30 23:30:07,547 [myid:] - INFO  [main:ZKTestCase$1@60] - FINISHED testWatcherAutoResetWithLocal
    [junit] Tests run: 101, Failures: 0, Errors: 0, Skipped: 0, Time elapsed: 505.274 sec, Thread: 4, Class: org.apache.zookeeper.test.NioNettySuiteTest
    [junit] 2016-10-30 23:30:07,682 [myid:127.0.0.1:19301] - INFO  [main-SendThread(127.0.0.1:19301):ClientCnxn$SendThread@1113] - Opening socket connection to server 127.0.0.1/127.0.0.1:19301. Will not attempt to authenticate using SASL (unknown error)
    [junit] 2016-10-30 23:30:07,682 [myid:127.0.0.1:19301] - WARN  [main-SendThread(127.0.0.1:19301):ClientCnxn$SendThread@1235] - Session 0x100a85765140000 for server 127.0.0.1/127.0.0.1:19301, unexpected error, closing socket connection and attempting reconnect
    [junit] java.net.ConnectException: Connection refused
    [junit] 	at sun.nio.ch.SocketChannelImpl.checkConnect(Native Method)
    [junit] 	at sun.nio.ch.SocketChannelImpl.finishConnect(SocketChannelImpl.java:744)
    [junit] 	at org.apache.zookeeper.ClientCnxnSocketNIO.doTransport(ClientCnxnSocketNIO.java:357)
    [junit] 	at org.apache.zookeeper.ClientCnxn$SendThread.run(ClientCnxn.java:1214)

BUILD FAILED
/home/jenkins/jenkins-slave/workspace/ZooKeeper-trunk/build.xml:1322: The following error occurred while executing this line:
/home/jenkins/jenkins-slave/workspace/ZooKeeper-trunk/build.xml:1207: Tests failed!

Total time: 13 minutes 19 seconds
Build step 'Execute shell' marked build as failure
[FINDBUGS] Skipping publisher since build result is FAILURE
[WARNINGS] Skipping publisher since build result is FAILURE
Archiving artifacts
Setting JDK_1_7_LATEST__HOME=/home/jenkins/tools/java/latest1.7
Recording fingerprints
Setting JDK_1_7_LATEST__HOME=/home/jenkins/tools/java/latest1.7
Recording test results
Setting JDK_1_7_LATEST__HOME=/home/jenkins/tools/java/latest1.7
Publishing Javadoc
Setting JDK_1_7_LATEST__HOME=/home/jenkins/tools/java/latest1.7
Setting JDK_1_7_LATEST__HOME=/home/jenkins/tools/java/latest1.7
Email was triggered for: Failure - Any
Sending email for trigger: Failure - Any
Setting JDK_1_7_LATEST__HOME=/home/jenkins/tools/java/latest1.7
Setting JDK_1_7_LATEST__HOME=/home/jenkins/tools/java/latest1.7



###################################################################################
############################## FAILED TESTS (if any) ##############################
1 tests failed.
FAILED:  org.apache.zookeeper.test.LETest.testLE

Error Message:
Threads didn't join

Stack Trace:
junit.framework.AssertionFailedError: Threads didn't join
	at org.apache.zookeeper.test.LETest.testLE(LETest.java:123)
	at org.apache.zookeeper.JUnit4ZKTestRunner$LoggedInvokeMethod.evaluate(JUnit4ZKTestRunner.java:79)



ZooKeeper-trunk - Build # 3139 - Still Failing

Posted by Apache Jenkins Server <je...@builds.apache.org>.
See https://builds.apache.org/job/ZooKeeper-trunk/3139/

###################################################################################
########################## LAST 60 LINES OF THE CONSOLE ###########################
[...truncated 455418 lines...]
    [junit] 2016-10-31 23:40:23,329 [myid:] - INFO  [main:JUnit4ZKTestRunner$LoggedInvokeMethod@102] - FINISHED TEST METHOD testWatcherAutoResetWithLocal
    [junit] 2016-10-31 23:40:23,329 [myid:] - INFO  [main:ClientBase@543] - tearDown starting
    [junit] 2016-10-31 23:40:23,329 [myid:] - INFO  [main:ClientBase@513] - STOPPING server
    [junit] 2016-10-31 23:40:23,329 [myid:] - INFO  [main:NettyServerCnxnFactory@464] - shutdown called 0.0.0.0/0.0.0.0:24931
    [junit] 2016-10-31 23:40:23,332 [myid:] - INFO  [main:ZooKeeperServer@529] - shutting down
    [junit] 2016-10-31 23:40:23,332 [myid:] - ERROR [main:ZooKeeperServer@501] - ZKShutdownHandler is not registered, so ZooKeeper server won't take any action on ERROR or SHUTDOWN server state changes
    [junit] 2016-10-31 23:40:23,332 [myid:] - INFO  [main:SessionTrackerImpl@232] - Shutting down
    [junit] 2016-10-31 23:40:23,332 [myid:] - INFO  [main:PrepRequestProcessor@996] - Shutting down
    [junit] 2016-10-31 23:40:23,332 [myid:] - INFO  [main:SyncRequestProcessor@191] - Shutting down
    [junit] 2016-10-31 23:40:23,333 [myid:] - INFO  [ProcessThread(sid:0 cport:24931)::PrepRequestProcessor@156] - PrepRequestProcessor exited loop!
    [junit] 2016-10-31 23:40:23,335 [myid:] - INFO  [SyncThread:0:SyncRequestProcessor@169] - SyncRequestProcessor exited!
    [junit] 2016-10-31 23:40:23,335 [myid:] - INFO  [main:FinalRequestProcessor@481] - shutdown of request processor complete
    [junit] 2016-10-31 23:40:23,335 [myid:] - INFO  [main:MBeanRegistry@128] - Unregister MBean [org.apache.ZooKeeperService:name0=StandaloneServer_port24931,name1=InMemoryDataTree]
    [junit] 2016-10-31 23:40:23,335 [myid:] - INFO  [main:MBeanRegistry@128] - Unregister MBean [org.apache.ZooKeeperService:name0=StandaloneServer_port24931]
    [junit] 2016-10-31 23:40:23,336 [myid:] - INFO  [main:FourLetterWordMain@85] - connecting to 127.0.0.1 24931
    [junit] 2016-10-31 23:40:23,336 [myid:] - INFO  [main:JMXEnv@146] - ensureOnly:[]
    [junit] 2016-10-31 23:40:23,343 [myid:] - INFO  [main:ClientBase@568] - fdcount after test is: 4823 at start it was 4828
    [junit] 2016-10-31 23:40:23,343 [myid:] - INFO  [main:ZKTestCase$1@65] - SUCCEEDED testWatcherAutoResetWithLocal
    [junit] 2016-10-31 23:40:23,343 [myid:] - INFO  [main:ZKTestCase$1@60] - FINISHED testWatcherAutoResetWithLocal
    [junit] Tests run: 101, Failures: 0, Errors: 0, Skipped: 0, Time elapsed: 418.076 sec, Thread: 6, Class: org.apache.zookeeper.test.NioNettySuiteTest
    [junit] 2016-10-31 23:40:23,506 [myid:127.0.0.1:24811] - INFO  [main-SendThread(127.0.0.1:24811):ClientCnxn$SendThread@1113] - Opening socket connection to server 127.0.0.1/127.0.0.1:24811. Will not attempt to authenticate using SASL (unknown error)
    [junit] 2016-10-31 23:40:23,507 [myid:127.0.0.1:24811] - WARN  [main-SendThread(127.0.0.1:24811):ClientCnxn$SendThread@1235] - Session 0x201f7052da00000 for server 127.0.0.1/127.0.0.1:24811, unexpected error, closing socket connection and attempting reconnect
    [junit] java.net.ConnectException: Connection refused
    [junit] 	at sun.nio.ch.SocketChannelImpl.checkConnect(Native Method)
    [junit] 	at sun.nio.ch.SocketChannelImpl.finishConnect(SocketChannelImpl.java:744)
    [junit] 	at org.apache.zookeeper.ClientCnxnSocketNIO.doTransport(ClientCnxnSocketNIO.java:357)
    [junit] 	at org.apache.zookeeper.ClientCnxn$SendThread.run(ClientCnxn.java:1214)
    [junit] 2016-10-31 23:40:23,519 [myid:127.0.0.1:24687] - INFO  [main-SendThread(127.0.0.1:24687):ClientCnxn$SendThread@1113] - Opening socket connection to server 127.0.0.1/127.0.0.1:24687. Will not attempt to authenticate using SASL (unknown error)
    [junit] 2016-10-31 23:40:23,519 [myid:127.0.0.1:24687] - WARN  [main-SendThread(127.0.0.1:24687):ClientCnxn$SendThread@1235] - Session 0x101f701b2d90000 for server 127.0.0.1/127.0.0.1:24687, unexpected error, closing socket connection and attempting reconnect
    [junit] java.net.ConnectException: Connection refused
    [junit] 	at sun.nio.ch.SocketChannelImpl.checkConnect(Native Method)
    [junit] 	at sun.nio.ch.SocketChannelImpl.finishConnect(SocketChannelImpl.java:744)
    [junit] 	at org.apache.zookeeper.ClientCnxnSocketNIO.doTransport(ClientCnxnSocketNIO.java:357)
    [junit] 	at org.apache.zookeeper.ClientCnxn$SendThread.run(ClientCnxn.java:1214)
    [junit] Running org.apache.zookeeper.server.quorum.Zab1_0Test in thread 3
    [junit] Tests run: 1, Failures: 0, Errors: 1, Skipped: 0, Time elapsed: 0 sec, Thread: 3, Class: org.apache.zookeeper.server.quorum.Zab1_0Test
    [junit] Test org.apache.zookeeper.server.quorum.Zab1_0Test FAILED (timeout)

BUILD FAILED
/home/jenkins/jenkins-slave/workspace/ZooKeeper-trunk/build.xml:1322: The following error occurred while executing this line:
/home/jenkins/jenkins-slave/workspace/ZooKeeper-trunk/build.xml:1207: Tests failed!

Total time: 16 minutes 22 seconds
Build step 'Execute shell' marked build as failure
[FINDBUGS] Skipping publisher since build result is FAILURE
[WARNINGS] Skipping publisher since build result is FAILURE
Archiving artifacts
Setting JDK_1_7_LATEST__HOME=/home/jenkins/tools/java/latest1.7
Recording fingerprints
Setting JDK_1_7_LATEST__HOME=/home/jenkins/tools/java/latest1.7
Recording test results
Setting JDK_1_7_LATEST__HOME=/home/jenkins/tools/java/latest1.7
Publishing Javadoc
Setting JDK_1_7_LATEST__HOME=/home/jenkins/tools/java/latest1.7
Setting JDK_1_7_LATEST__HOME=/home/jenkins/tools/java/latest1.7
Email was triggered for: Failure - Any
Sending email for trigger: Failure - Any
Setting JDK_1_7_LATEST__HOME=/home/jenkins/tools/java/latest1.7
Setting JDK_1_7_LATEST__HOME=/home/jenkins/tools/java/latest1.7



###################################################################################
############################## FAILED TESTS (if any) ##############################
2 tests failed.
FAILED:  org.apache.zookeeper.server.quorum.Zab1_0Test.testNormalObserverRun

Error Message:
Timeout occurred. Please note the time in the report does not reflect the time until the timeout.

Stack Trace:
junit.framework.AssertionFailedError: Timeout occurred. Please note the time in the report does not reflect the time until the timeout.
	at java.lang.Thread.run(Thread.java:745)


FAILED:  org.apache.zookeeper.test.SSLTest.testSecureQuorumServer

Error Message:
waiting for server 0 being up

Stack Trace:
junit.framework.AssertionFailedError: waiting for server 0 being up
	at org.apache.zookeeper.test.SSLTest.testSecureQuorumServer(SSLTest.java:96)
	at org.apache.zookeeper.JUnit4ZKTestRunner$LoggedInvokeMethod.evaluate(JUnit4ZKTestRunner.java:79)