You are viewing a plain text version of this content. The canonical link for it is here.
Posted to dev@lucene.apache.org by Apache Jenkins Server <je...@builds.apache.org> on 2016/02/08 08:57:52 UTC
[JENKINS] Lucene-Solr-Tests-5.x-Java7 - Build # 3956 - Failure
Build: https://builds.apache.org/job/Lucene-Solr-Tests-5.x-Java7/3956/
1 tests failed.
FAILED: junit.framework.TestSuite.org.apache.solr.handler.TestSolrConfigHandlerCloud
Error Message:
ObjectTracker found 2 object(s) that were not released!!! [MockDirectoryWrapper, MockDirectoryWrapper]
Stack Trace:
java.lang.AssertionError: ObjectTracker found 2 object(s) that were not released!!! [MockDirectoryWrapper, MockDirectoryWrapper]
at __randomizedtesting.SeedInfo.seed([BD1D5E7E34E09615]:0)
at org.junit.Assert.fail(Assert.java:93)
at org.junit.Assert.assertTrue(Assert.java:43)
at org.junit.Assert.assertNull(Assert.java:551)
at org.apache.solr.SolrTestCaseJ4.afterClass(SolrTestCaseJ4.java:228)
at sun.reflect.GeneratedMethodAccessor21.invoke(Unknown Source)
at sun.reflect.DelegatingMethodAccessorImpl.invoke(DelegatingMethodAccessorImpl.java:43)
at java.lang.reflect.Method.invoke(Method.java:606)
at com.carrotsearch.randomizedtesting.RandomizedRunner.invoke(RandomizedRunner.java:1764)
at com.carrotsearch.randomizedtesting.RandomizedRunner$7.evaluate(RandomizedRunner.java:834)
at com.carrotsearch.randomizedtesting.rules.StatementAdapter.evaluate(StatementAdapter.java:36)
at com.carrotsearch.randomizedtesting.rules.SystemPropertiesRestoreRule$1.evaluate(SystemPropertiesRestoreRule.java:57)
at org.apache.lucene.util.AbstractBeforeAfterRule$1.evaluate(AbstractBeforeAfterRule.java:45)
at com.carrotsearch.randomizedtesting.rules.StatementAdapter.evaluate(StatementAdapter.java:36)
at org.apache.lucene.util.TestRuleStoreClassName$1.evaluate(TestRuleStoreClassName.java:41)
at com.carrotsearch.randomizedtesting.rules.NoShadowingOrOverridesOnMethodsRule$1.evaluate(NoShadowingOrOverridesOnMethodsRule.java:40)
at com.carrotsearch.randomizedtesting.rules.NoShadowingOrOverridesOnMethodsRule$1.evaluate(NoShadowingOrOverridesOnMethodsRule.java:40)
at com.carrotsearch.randomizedtesting.rules.StatementAdapter.evaluate(StatementAdapter.java:36)
at com.carrotsearch.randomizedtesting.rules.StatementAdapter.evaluate(StatementAdapter.java:36)
at com.carrotsearch.randomizedtesting.rules.StatementAdapter.evaluate(StatementAdapter.java:36)
at org.apache.lucene.util.TestRuleAssertionsRequired$1.evaluate(TestRuleAssertionsRequired.java:53)
at org.apache.lucene.util.TestRuleMarkFailure$1.evaluate(TestRuleMarkFailure.java:47)
at org.apache.lucene.util.TestRuleIgnoreAfterMaxFailures$1.evaluate(TestRuleIgnoreAfterMaxFailures.java:64)
at org.apache.lucene.util.TestRuleIgnoreTestSuites$1.evaluate(TestRuleIgnoreTestSuites.java:54)
at com.carrotsearch.randomizedtesting.rules.StatementAdapter.evaluate(StatementAdapter.java:36)
at com.carrotsearch.randomizedtesting.ThreadLeakControl$StatementRunner.run(ThreadLeakControl.java:367)
at java.lang.Thread.run(Thread.java:745)
Build Log:
[...truncated 12064 lines...]
[junit4] Suite: org.apache.solr.handler.TestSolrConfigHandlerCloud
[junit4] 2> Creating dataDir: /x1/jenkins/jenkins-slave/workspace/Lucene-Solr-Tests-5.x-Java7/solr/build/solr-core/test/J0/temp/solr.handler.TestSolrConfigHandlerCloud_BD1D5E7E34E09615-001/init-core-data-001
[junit4] 2> 1711376 INFO (SUITE-TestSolrConfigHandlerCloud-seed#[BD1D5E7E34E09615]-worker) [ ] o.a.s.SolrTestCaseJ4 Randomized ssl (true) and clientAuth (false)
[junit4] 2> 1711376 INFO (SUITE-TestSolrConfigHandlerCloud-seed#[BD1D5E7E34E09615]-worker) [ ] o.a.s.BaseDistributedSearchTestCase Setting hostContext system property: /q_uxm/kx
[junit4] 2> 1711381 INFO (TEST-TestSolrConfigHandlerCloud.test-seed#[BD1D5E7E34E09615]) [ ] o.a.s.c.ZkTestServer STARTING ZK TEST SERVER
[junit4] 2> 1711382 INFO (Thread-6941) [ ] o.a.s.c.ZkTestServer client port:0.0.0.0/0.0.0.0:0
[junit4] 2> 1711382 INFO (Thread-6941) [ ] o.a.s.c.ZkTestServer Starting server
[junit4] 2> 1711482 INFO (TEST-TestSolrConfigHandlerCloud.test-seed#[BD1D5E7E34E09615]) [ ] o.a.s.c.ZkTestServer start zk server on port:39206
[junit4] 2> 1711482 INFO (TEST-TestSolrConfigHandlerCloud.test-seed#[BD1D5E7E34E09615]) [ ] o.a.s.c.c.SolrZkClient Using default ZkCredentialsProvider
[junit4] 2> 1711482 INFO (TEST-TestSolrConfigHandlerCloud.test-seed#[BD1D5E7E34E09615]) [ ] o.a.s.c.c.ConnectionManager Waiting for client to connect to ZooKeeper
[junit4] 2> 1711485 INFO (zkCallback-1256-thread-1) [ ] o.a.s.c.c.ConnectionManager Watcher org.apache.solr.common.cloud.ConnectionManager@66aaf1ce name:ZooKeeperConnection Watcher:127.0.0.1:39206 got event WatchedEvent state:SyncConnected type:None path:null path:null type:None
[junit4] 2> 1711485 INFO (TEST-TestSolrConfigHandlerCloud.test-seed#[BD1D5E7E34E09615]) [ ] o.a.s.c.c.ConnectionManager Client is connected to ZooKeeper
[junit4] 2> 1711486 INFO (TEST-TestSolrConfigHandlerCloud.test-seed#[BD1D5E7E34E09615]) [ ] o.a.s.c.c.SolrZkClient Using default ZkACLProvider
[junit4] 2> 1711486 INFO (TEST-TestSolrConfigHandlerCloud.test-seed#[BD1D5E7E34E09615]) [ ] o.a.s.c.c.SolrZkClient makePath: /solr
[junit4] 2> 1711489 INFO (TEST-TestSolrConfigHandlerCloud.test-seed#[BD1D5E7E34E09615]) [ ] o.a.s.c.c.SolrZkClient Using default ZkCredentialsProvider
[junit4] 2> 1711490 INFO (TEST-TestSolrConfigHandlerCloud.test-seed#[BD1D5E7E34E09615]) [ ] o.a.s.c.c.ConnectionManager Waiting for client to connect to ZooKeeper
[junit4] 2> 1711491 INFO (zkCallback-1257-thread-1) [ ] o.a.s.c.c.ConnectionManager Watcher org.apache.solr.common.cloud.ConnectionManager@75b466d1 name:ZooKeeperConnection Watcher:127.0.0.1:39206/solr got event WatchedEvent state:SyncConnected type:None path:null path:null type:None
[junit4] 2> 1711491 INFO (TEST-TestSolrConfigHandlerCloud.test-seed#[BD1D5E7E34E09615]) [ ] o.a.s.c.c.ConnectionManager Client is connected to ZooKeeper
[junit4] 2> 1711491 INFO (TEST-TestSolrConfigHandlerCloud.test-seed#[BD1D5E7E34E09615]) [ ] o.a.s.c.c.SolrZkClient Using default ZkACLProvider
[junit4] 2> 1711491 INFO (TEST-TestSolrConfigHandlerCloud.test-seed#[BD1D5E7E34E09615]) [ ] o.a.s.c.c.SolrZkClient makePath: /collections/collection1
[junit4] 2> 1711493 INFO (TEST-TestSolrConfigHandlerCloud.test-seed#[BD1D5E7E34E09615]) [ ] o.a.s.c.c.SolrZkClient makePath: /collections/collection1/shards
[junit4] 2> 1711495 INFO (TEST-TestSolrConfigHandlerCloud.test-seed#[BD1D5E7E34E09615]) [ ] o.a.s.c.c.SolrZkClient makePath: /collections/control_collection
[junit4] 2> 1711496 INFO (TEST-TestSolrConfigHandlerCloud.test-seed#[BD1D5E7E34E09615]) [ ] o.a.s.c.c.SolrZkClient makePath: /collections/control_collection/shards
[junit4] 2> 1711498 INFO (TEST-TestSolrConfigHandlerCloud.test-seed#[BD1D5E7E34E09615]) [ ] o.a.s.c.AbstractZkTestCase put /x1/jenkins/jenkins-slave/workspace/Lucene-Solr-Tests-5.x-Java7/solr/core/src/test-files/solr/collection1/conf/solrconfig-tlog.xml to /configs/conf1/solrconfig.xml
[junit4] 2> 1711498 INFO (TEST-TestSolrConfigHandlerCloud.test-seed#[BD1D5E7E34E09615]) [ ] o.a.s.c.c.SolrZkClient makePath: /configs/conf1/solrconfig.xml
[junit4] 2> 1711501 INFO (TEST-TestSolrConfigHandlerCloud.test-seed#[BD1D5E7E34E09615]) [ ] o.a.s.c.AbstractZkTestCase put /x1/jenkins/jenkins-slave/workspace/Lucene-Solr-Tests-5.x-Java7/solr/core/src/test-files/solr/collection1/conf/schema.xml to /configs/conf1/schema.xml
[junit4] 2> 1711501 INFO (TEST-TestSolrConfigHandlerCloud.test-seed#[BD1D5E7E34E09615]) [ ] o.a.s.c.c.SolrZkClient makePath: /configs/conf1/schema.xml
[junit4] 2> 1711503 INFO (TEST-TestSolrConfigHandlerCloud.test-seed#[BD1D5E7E34E09615]) [ ] o.a.s.c.AbstractZkTestCase put /x1/jenkins/jenkins-slave/workspace/Lucene-Solr-Tests-5.x-Java7/solr/core/src/test-files/solr/collection1/conf/solrconfig.snippet.randomindexconfig.xml to /configs/conf1/solrconfig.snippet.randomindexconfig.xml
[junit4] 2> 1711503 INFO (TEST-TestSolrConfigHandlerCloud.test-seed#[BD1D5E7E34E09615]) [ ] o.a.s.c.c.SolrZkClient makePath: /configs/conf1/solrconfig.snippet.randomindexconfig.xml
[junit4] 2> 1711505 INFO (TEST-TestSolrConfigHandlerCloud.test-seed#[BD1D5E7E34E09615]) [ ] o.a.s.c.AbstractZkTestCase put /x1/jenkins/jenkins-slave/workspace/Lucene-Solr-Tests-5.x-Java7/solr/core/src/test-files/solr/collection1/conf/stopwords.txt to /configs/conf1/stopwords.txt
[junit4] 2> 1711505 INFO (TEST-TestSolrConfigHandlerCloud.test-seed#[BD1D5E7E34E09615]) [ ] o.a.s.c.c.SolrZkClient makePath: /configs/conf1/stopwords.txt
[junit4] 2> 1711507 INFO (TEST-TestSolrConfigHandlerCloud.test-seed#[BD1D5E7E34E09615]) [ ] o.a.s.c.AbstractZkTestCase put /x1/jenkins/jenkins-slave/workspace/Lucene-Solr-Tests-5.x-Java7/solr/core/src/test-files/solr/collection1/conf/protwords.txt to /configs/conf1/protwords.txt
[junit4] 2> 1711507 INFO (TEST-TestSolrConfigHandlerCloud.test-seed#[BD1D5E7E34E09615]) [ ] o.a.s.c.c.SolrZkClient makePath: /configs/conf1/protwords.txt
[junit4] 2> 1711509 INFO (TEST-TestSolrConfigHandlerCloud.test-seed#[BD1D5E7E34E09615]) [ ] o.a.s.c.AbstractZkTestCase put /x1/jenkins/jenkins-slave/workspace/Lucene-Solr-Tests-5.x-Java7/solr/core/src/test-files/solr/collection1/conf/currency.xml to /configs/conf1/currency.xml
[junit4] 2> 1711509 INFO (TEST-TestSolrConfigHandlerCloud.test-seed#[BD1D5E7E34E09615]) [ ] o.a.s.c.c.SolrZkClient makePath: /configs/conf1/currency.xml
[junit4] 2> 1711511 INFO (TEST-TestSolrConfigHandlerCloud.test-seed#[BD1D5E7E34E09615]) [ ] o.a.s.c.AbstractZkTestCase put /x1/jenkins/jenkins-slave/workspace/Lucene-Solr-Tests-5.x-Java7/solr/core/src/test-files/solr/collection1/conf/enumsConfig.xml to /configs/conf1/enumsConfig.xml
[junit4] 2> 1711511 INFO (TEST-TestSolrConfigHandlerCloud.test-seed#[BD1D5E7E34E09615]) [ ] o.a.s.c.c.SolrZkClient makePath: /configs/conf1/enumsConfig.xml
[junit4] 2> 1711513 INFO (TEST-TestSolrConfigHandlerCloud.test-seed#[BD1D5E7E34E09615]) [ ] o.a.s.c.AbstractZkTestCase put /x1/jenkins/jenkins-slave/workspace/Lucene-Solr-Tests-5.x-Java7/solr/core/src/test-files/solr/collection1/conf/open-exchange-rates.json to /configs/conf1/open-exchange-rates.json
[junit4] 2> 1711513 INFO (TEST-TestSolrConfigHandlerCloud.test-seed#[BD1D5E7E34E09615]) [ ] o.a.s.c.c.SolrZkClient makePath: /configs/conf1/open-exchange-rates.json
[junit4] 2> 1711514 INFO (TEST-TestSolrConfigHandlerCloud.test-seed#[BD1D5E7E34E09615]) [ ] o.a.s.c.AbstractZkTestCase put /x1/jenkins/jenkins-slave/workspace/Lucene-Solr-Tests-5.x-Java7/solr/core/src/test-files/solr/collection1/conf/mapping-ISOLatin1Accent.txt to /configs/conf1/mapping-ISOLatin1Accent.txt
[junit4] 2> 1711515 INFO (TEST-TestSolrConfigHandlerCloud.test-seed#[BD1D5E7E34E09615]) [ ] o.a.s.c.c.SolrZkClient makePath: /configs/conf1/mapping-ISOLatin1Accent.txt
[junit4] 2> 1711516 INFO (TEST-TestSolrConfigHandlerCloud.test-seed#[BD1D5E7E34E09615]) [ ] o.a.s.c.AbstractZkTestCase put /x1/jenkins/jenkins-slave/workspace/Lucene-Solr-Tests-5.x-Java7/solr/core/src/test-files/solr/collection1/conf/old_synonyms.txt to /configs/conf1/old_synonyms.txt
[junit4] 2> 1711517 INFO (TEST-TestSolrConfigHandlerCloud.test-seed#[BD1D5E7E34E09615]) [ ] o.a.s.c.c.SolrZkClient makePath: /configs/conf1/old_synonyms.txt
[junit4] 2> 1711518 INFO (TEST-TestSolrConfigHandlerCloud.test-seed#[BD1D5E7E34E09615]) [ ] o.a.s.c.AbstractZkTestCase put /x1/jenkins/jenkins-slave/workspace/Lucene-Solr-Tests-5.x-Java7/solr/core/src/test-files/solr/collection1/conf/synonyms.txt to /configs/conf1/synonyms.txt
[junit4] 2> 1711518 INFO (TEST-TestSolrConfigHandlerCloud.test-seed#[BD1D5E7E34E09615]) [ ] o.a.s.c.c.SolrZkClient makePath: /configs/conf1/synonyms.txt
[junit4] 2> 1711521 INFO (TEST-TestSolrConfigHandlerCloud.test-seed#[BD1D5E7E34E09615]) [ ] o.a.s.c.c.SolrZkClient Using default ZkCredentialsProvider
[junit4] 2> 1711522 INFO (TEST-TestSolrConfigHandlerCloud.test-seed#[BD1D5E7E34E09615]) [ ] o.a.s.c.c.ConnectionManager Waiting for client to connect to ZooKeeper
[junit4] 2> 1711525 INFO (zkCallback-1258-thread-1) [ ] o.a.s.c.c.ConnectionManager Watcher org.apache.solr.common.cloud.ConnectionManager@65754d21 name:ZooKeeperConnection Watcher:127.0.0.1:39206/solr got event WatchedEvent state:SyncConnected type:None path:null path:null type:None
[junit4] 2> 1711525 INFO (TEST-TestSolrConfigHandlerCloud.test-seed#[BD1D5E7E34E09615]) [ ] o.a.s.c.c.ConnectionManager Client is connected to ZooKeeper
[junit4] 2> 1711525 INFO (TEST-TestSolrConfigHandlerCloud.test-seed#[BD1D5E7E34E09615]) [ ] o.a.s.c.c.SolrZkClient Using default ZkACLProvider
[junit4] 2> 1711620 INFO (TEST-TestSolrConfigHandlerCloud.test-seed#[BD1D5E7E34E09615]) [ ] o.a.s.SolrTestCaseJ4 Writing core.properties file to /x1/jenkins/jenkins-slave/workspace/Lucene-Solr-Tests-5.x-Java7/solr/build/solr-core/test/J0/temp/solr.handler.TestSolrConfigHandlerCloud_BD1D5E7E34E09615-001/control-001/cores/collection1
[junit4] 2> 1711623 INFO (TEST-TestSolrConfigHandlerCloud.test-seed#[BD1D5E7E34E09615]) [ ] o.e.j.s.Server jetty-9.2.13.v20150730
[junit4] 2> 1711624 INFO (TEST-TestSolrConfigHandlerCloud.test-seed#[BD1D5E7E34E09615]) [ ] o.e.j.s.h.ContextHandler Started o.e.j.s.ServletContextHandler@677f30f2{/q_uxm/kx,null,AVAILABLE}
[junit4] 2> 1711631 INFO (TEST-TestSolrConfigHandlerCloud.test-seed#[BD1D5E7E34E09615]) [ ] o.e.j.s.ServerConnector Started ServerConnector@3a7b8a1{SSL-http/1.1}{127.0.0.1:34480}
[junit4] 2> 1711631 INFO (TEST-TestSolrConfigHandlerCloud.test-seed#[BD1D5E7E34E09615]) [ ] o.e.j.s.Server Started @1714863ms
[junit4] 2> 1711631 INFO (TEST-TestSolrConfigHandlerCloud.test-seed#[BD1D5E7E34E09615]) [ ] o.a.s.c.s.e.JettySolrRunner Jetty properties: {hostPort=34480, coreRootDirectory=/x1/jenkins/jenkins-slave/workspace/Lucene-Solr-Tests-5.x-Java7/solr/build/solr-core/test/J0/temp/solr.handler.TestSolrConfigHandlerCloud_BD1D5E7E34E09615-001/control-001/cores, solr.data.dir=/x1/jenkins/jenkins-slave/workspace/Lucene-Solr-Tests-5.x-Java7/solr/build/solr-core/test/J0/temp/solr.handler.TestSolrConfigHandlerCloud_BD1D5E7E34E09615-001/tempDir-001/control/data, hostContext=/q_uxm/kx}
[junit4] 2> 1711631 INFO (TEST-TestSolrConfigHandlerCloud.test-seed#[BD1D5E7E34E09615]) [ ] o.a.s.s.SolrDispatchFilter SolrDispatchFilter.init(): sun.misc.Launcher$AppClassLoader@4f6de641
[junit4] 2> 1711632 INFO (TEST-TestSolrConfigHandlerCloud.test-seed#[BD1D5E7E34E09615]) [ ] o.a.s.c.SolrResourceLoader new SolrResourceLoader for directory: '/x1/jenkins/jenkins-slave/workspace/Lucene-Solr-Tests-5.x-Java7/solr/build/solr-core/test/J0/temp/solr.handler.TestSolrConfigHandlerCloud_BD1D5E7E34E09615-001/control-001'
[junit4] 2> 1711632 INFO (TEST-TestSolrConfigHandlerCloud.test-seed#[BD1D5E7E34E09615]) [ ] o.a.s.c.SolrResourceLoader JNDI not configured for solr (NoInitialContextEx)
[junit4] 2> 1711632 INFO (TEST-TestSolrConfigHandlerCloud.test-seed#[BD1D5E7E34E09615]) [ ] o.a.s.c.SolrResourceLoader solr home defaulted to 'solr/' (could not find system property or JNDI)
[junit4] 2> 1711632 INFO (TEST-TestSolrConfigHandlerCloud.test-seed#[BD1D5E7E34E09615]) [ ] o.a.s.c.c.SolrZkClient Using default ZkCredentialsProvider
[junit4] 2> 1711633 INFO (TEST-TestSolrConfigHandlerCloud.test-seed#[BD1D5E7E34E09615]) [ ] o.a.s.c.c.ConnectionManager Waiting for client to connect to ZooKeeper
[junit4] 2> 1711634 INFO (zkCallback-1259-thread-1) [ ] o.a.s.c.c.ConnectionManager Watcher org.apache.solr.common.cloud.ConnectionManager@758971b1 name:ZooKeeperConnection Watcher:127.0.0.1:39206/solr got event WatchedEvent state:SyncConnected type:None path:null path:null type:None
[junit4] 2> 1711635 INFO (TEST-TestSolrConfigHandlerCloud.test-seed#[BD1D5E7E34E09615]) [ ] o.a.s.c.c.ConnectionManager Client is connected to ZooKeeper
[junit4] 2> 1711635 INFO (TEST-TestSolrConfigHandlerCloud.test-seed#[BD1D5E7E34E09615]) [ ] o.a.s.c.c.SolrZkClient Using default ZkACLProvider
[junit4] 2> 1711636 INFO (TEST-TestSolrConfigHandlerCloud.test-seed#[BD1D5E7E34E09615]) [ ] o.a.s.s.SolrDispatchFilter Loading solr.xml from SolrHome (not found in ZooKeeper)
[junit4] 2> 1711637 INFO (TEST-TestSolrConfigHandlerCloud.test-seed#[BD1D5E7E34E09615]) [ ] o.a.s.c.SolrXmlConfig Loading container configuration from /x1/jenkins/jenkins-slave/workspace/Lucene-Solr-Tests-5.x-Java7/solr/build/solr-core/test/J0/temp/solr.handler.TestSolrConfigHandlerCloud_BD1D5E7E34E09615-001/control-001/solr.xml
[junit4] 2> 1711651 INFO (TEST-TestSolrConfigHandlerCloud.test-seed#[BD1D5E7E34E09615]) [ ] o.a.s.c.CorePropertiesLocator Config-defined core root directory: /x1/jenkins/jenkins-slave/workspace/Lucene-Solr-Tests-5.x-Java7/solr/build/solr-core/test/J0/temp/solr.handler.TestSolrConfigHandlerCloud_BD1D5E7E34E09615-001/control-001/cores
[junit4] 2> 1711651 INFO (TEST-TestSolrConfigHandlerCloud.test-seed#[BD1D5E7E34E09615]) [ ] o.a.s.c.CoreContainer New CoreContainer 1780541399
[junit4] 2> 1711652 INFO (TEST-TestSolrConfigHandlerCloud.test-seed#[BD1D5E7E34E09615]) [ ] o.a.s.c.CoreContainer Loading cores into CoreContainer [instanceDir=/x1/jenkins/jenkins-slave/workspace/Lucene-Solr-Tests-5.x-Java7/solr/build/solr-core/test/J0/temp/solr.handler.TestSolrConfigHandlerCloud_BD1D5E7E34E09615-001/control-001]
[junit4] 2> 1711652 WARN (TEST-TestSolrConfigHandlerCloud.test-seed#[BD1D5E7E34E09615]) [ ] o.a.s.c.CoreContainer Couldn't add files from /x1/jenkins/jenkins-slave/workspace/Lucene-Solr-Tests-5.x-Java7/solr/build/solr-core/test/J0/temp/solr.handler.TestSolrConfigHandlerCloud_BD1D5E7E34E09615-001/control-001/lib to classpath: /x1/jenkins/jenkins-slave/workspace/Lucene-Solr-Tests-5.x-Java7/solr/build/solr-core/test/J0/temp/solr.handler.TestSolrConfigHandlerCloud_BD1D5E7E34E09615-001/control-001/lib
[junit4] 2> 1711652 INFO (TEST-TestSolrConfigHandlerCloud.test-seed#[BD1D5E7E34E09615]) [ ] o.a.s.h.c.HttpShardHandlerFactory created with socketTimeout : 90000,urlScheme : ,connTimeout : 15000,maxConnectionsPerHost : 20,maxConnections : 10000,corePoolSize : 0,maximumPoolSize : 2147483647,maxThreadIdleTime : 5,sizeOfQueue : -1,fairnessPolicy : false,useRetries : false,
[junit4] 2> 1711654 INFO (TEST-TestSolrConfigHandlerCloud.test-seed#[BD1D5E7E34E09615]) [ ] o.a.s.u.UpdateShardHandler Creating UpdateShardHandler HTTP client with params: socketTimeout=340000&connTimeout=45000&retry=true
[junit4] 2> 1711656 INFO (TEST-TestSolrConfigHandlerCloud.test-seed#[BD1D5E7E34E09615]) [ ] o.a.s.l.LogWatcher SLF4J impl is org.slf4j.impl.Log4jLoggerFactory
[junit4] 2> 1711656 INFO (TEST-TestSolrConfigHandlerCloud.test-seed#[BD1D5E7E34E09615]) [ ] o.a.s.l.LogWatcher Registering Log Listener [Log4j (org.slf4j.impl.Log4jLoggerFactory)]
[junit4] 2> 1711656 INFO (TEST-TestSolrConfigHandlerCloud.test-seed#[BD1D5E7E34E09615]) [ ] o.a.s.c.ZkContainer Zookeeper client=127.0.0.1:39206/solr
[junit4] 2> 1711656 INFO (TEST-TestSolrConfigHandlerCloud.test-seed#[BD1D5E7E34E09615]) [ ] o.a.s.c.ZkController zkHost includes chroot
[junit4] 2> 1711656 INFO (TEST-TestSolrConfigHandlerCloud.test-seed#[BD1D5E7E34E09615]) [ ] o.a.s.c.c.SolrZkClient Using default ZkCredentialsProvider
[junit4] 2> 1711656 INFO (TEST-TestSolrConfigHandlerCloud.test-seed#[BD1D5E7E34E09615]) [ ] o.a.s.c.c.ConnectionManager Waiting for client to connect to ZooKeeper
[junit4] 2> 1711658 INFO (zkCallback-1262-thread-1) [ ] o.a.s.c.c.ConnectionManager Watcher org.apache.solr.common.cloud.ConnectionManager@d426957 name:ZooKeeperConnection Watcher:127.0.0.1:39206 got event WatchedEvent state:SyncConnected type:None path:null path:null type:None
[junit4] 2> 1711658 INFO (TEST-TestSolrConfigHandlerCloud.test-seed#[BD1D5E7E34E09615]) [ ] o.a.s.c.c.ConnectionManager Client is connected to ZooKeeper
[junit4] 2> 1711658 INFO (TEST-TestSolrConfigHandlerCloud.test-seed#[BD1D5E7E34E09615]) [ ] o.a.s.c.c.SolrZkClient Using default ZkACLProvider
[junit4] 2> 1711667 INFO (TEST-TestSolrConfigHandlerCloud.test-seed#[BD1D5E7E34E09615]) [n:127.0.0.1:34480_q_uxm%2Fkx ] o.a.s.c.c.ConnectionManager Waiting for client to connect to ZooKeeper
[junit4] 2> 1711668 INFO (zkCallback-1263-thread-1-processing-n:127.0.0.1:34480_q_uxm%2Fkx) [n:127.0.0.1:34480_q_uxm%2Fkx ] o.a.s.c.c.ConnectionManager Watcher org.apache.solr.common.cloud.ConnectionManager@51e7c5e8 name:ZooKeeperConnection Watcher:127.0.0.1:39206/solr got event WatchedEvent state:SyncConnected type:None path:null path:null type:None
[junit4] 2> 1711668 INFO (TEST-TestSolrConfigHandlerCloud.test-seed#[BD1D5E7E34E09615]) [n:127.0.0.1:34480_q_uxm%2Fkx ] o.a.s.c.c.ConnectionManager Client is connected to ZooKeeper
[junit4] 2> 1711669 INFO (TEST-TestSolrConfigHandlerCloud.test-seed#[BD1D5E7E34E09615]) [n:127.0.0.1:34480_q_uxm%2Fkx ] o.a.s.c.c.SolrZkClient makePath: /overseer/queue
[junit4] 2> 1711671 INFO (TEST-TestSolrConfigHandlerCloud.test-seed#[BD1D5E7E34E09615]) [n:127.0.0.1:34480_q_uxm%2Fkx ] o.a.s.c.c.SolrZkClient makePath: /overseer/collection-queue-work
[junit4] 2> 1711675 INFO (TEST-TestSolrConfigHandlerCloud.test-seed#[BD1D5E7E34E09615]) [n:127.0.0.1:34480_q_uxm%2Fkx ] o.a.s.c.c.SolrZkClient makePath: /overseer/collection-map-running
[junit4] 2> 1711679 INFO (TEST-TestSolrConfigHandlerCloud.test-seed#[BD1D5E7E34E09615]) [n:127.0.0.1:34480_q_uxm%2Fkx ] o.a.s.c.c.SolrZkClient makePath: /overseer/collection-map-completed
[junit4] 2> 1711681 INFO (TEST-TestSolrConfigHandlerCloud.test-seed#[BD1D5E7E34E09615]) [n:127.0.0.1:34480_q_uxm%2Fkx ] o.a.s.c.c.SolrZkClient makePath: /overseer/collection-map-failure
[junit4] 2> 1711684 INFO (TEST-TestSolrConfigHandlerCloud.test-seed#[BD1D5E7E34E09615]) [n:127.0.0.1:34480_q_uxm%2Fkx ] o.a.s.c.c.SolrZkClient makePath: /live_nodes
[junit4] 2> 1711686 INFO (TEST-TestSolrConfigHandlerCloud.test-seed#[BD1D5E7E34E09615]) [n:127.0.0.1:34480_q_uxm%2Fkx ] o.a.s.c.c.SolrZkClient makePath: /aliases.json
[junit4] 2> 1711687 INFO (TEST-TestSolrConfigHandlerCloud.test-seed#[BD1D5E7E34E09615]) [n:127.0.0.1:34480_q_uxm%2Fkx ] o.a.s.c.c.SolrZkClient makePath: /clusterstate.json
[junit4] 2> 1711689 INFO (TEST-TestSolrConfigHandlerCloud.test-seed#[BD1D5E7E34E09615]) [n:127.0.0.1:34480_q_uxm%2Fkx ] o.a.s.c.c.SolrZkClient makePath: /security.json
[junit4] 2> 1711690 INFO (TEST-TestSolrConfigHandlerCloud.test-seed#[BD1D5E7E34E09615]) [n:127.0.0.1:34480_q_uxm%2Fkx ] o.a.s.c.ZkController Register node as live in ZooKeeper:/live_nodes/127.0.0.1:34480_q_uxm%2Fkx
[junit4] 2> 1711690 INFO (TEST-TestSolrConfigHandlerCloud.test-seed#[BD1D5E7E34E09615]) [n:127.0.0.1:34480_q_uxm%2Fkx ] o.a.s.c.c.SolrZkClient makePath: /live_nodes/127.0.0.1:34480_q_uxm%2Fkx
[junit4] 2> 1711692 INFO (TEST-TestSolrConfigHandlerCloud.test-seed#[BD1D5E7E34E09615]) [n:127.0.0.1:34480_q_uxm%2Fkx ] o.a.s.c.c.SolrZkClient makePath: /overseer_elect
[junit4] 2> 1711693 INFO (TEST-TestSolrConfigHandlerCloud.test-seed#[BD1D5E7E34E09615]) [n:127.0.0.1:34480_q_uxm%2Fkx ] o.a.s.c.c.SolrZkClient makePath: /overseer_elect/election
[junit4] 2> 1711695 INFO (TEST-TestSolrConfigHandlerCloud.test-seed#[BD1D5E7E34E09615]) [n:127.0.0.1:34480_q_uxm%2Fkx ] o.a.s.c.Overseer Overseer (id=null) closing
[junit4] 2> 1711696 INFO (TEST-TestSolrConfigHandlerCloud.test-seed#[BD1D5E7E34E09615]) [n:127.0.0.1:34480_q_uxm%2Fkx ] o.a.s.c.LeaderElector Joined leadership election with path: /overseer_elect/election/95349488939368453-127.0.0.1:34480_q_uxm%2Fkx-n_0000000000
[junit4] 2> 1711696 INFO (TEST-TestSolrConfigHandlerCloud.test-seed#[BD1D5E7E34E09615]) [n:127.0.0.1:34480_q_uxm%2Fkx ] o.a.s.c.OverseerElectionContext I am going to be the leader 127.0.0.1:34480_q_uxm%2Fkx
[junit4] 2> 1711696 INFO (TEST-TestSolrConfigHandlerCloud.test-seed#[BD1D5E7E34E09615]) [n:127.0.0.1:34480_q_uxm%2Fkx ] o.a.s.c.c.SolrZkClient makePath: /overseer_elect/leader
[junit4] 2> 1711698 INFO (TEST-TestSolrConfigHandlerCloud.test-seed#[BD1D5E7E34E09615]) [n:127.0.0.1:34480_q_uxm%2Fkx ] o.a.s.c.Overseer Overseer (id=95349488939368453-127.0.0.1:34480_q_uxm%2Fkx-n_0000000000) starting
[junit4] 2> 1711700 INFO (TEST-TestSolrConfigHandlerCloud.test-seed#[BD1D5E7E34E09615]) [n:127.0.0.1:34480_q_uxm%2Fkx ] o.a.s.c.c.SolrZkClient makePath: /overseer/queue-work
[junit4] 2> 1711707 INFO (TEST-TestSolrConfigHandlerCloud.test-seed#[BD1D5E7E34E09615]) [n:127.0.0.1:34480_q_uxm%2Fkx ] o.a.s.c.OverseerAutoReplicaFailoverThread Starting OverseerAutoReplicaFailoverThread autoReplicaFailoverWorkLoopDelay=10000 autoReplicaFailoverWaitAfterExpiration=30000 autoReplicaFailoverBadNodeExpiration=60000
[junit4] 2> 1711707 INFO (TEST-TestSolrConfigHandlerCloud.test-seed#[BD1D5E7E34E09615]) [n:127.0.0.1:34480_q_uxm%2Fkx ] o.a.s.c.c.ZkStateReader Updating cluster state from ZooKeeper...
[junit4] 2> 1711707 INFO (OverseerCollectionConfigSetProcessor-95349488939368453-127.0.0.1:34480_q_uxm%2Fkx-n_0000000000) [n:127.0.0.1:34480_q_uxm%2Fkx ] o.a.s.c.OverseerTaskProcessor Process current queue of overseer operations
[junit4] 2> 1711707 INFO (OverseerStateUpdate-95349488939368453-127.0.0.1:34480_q_uxm%2Fkx-n_0000000000) [n:127.0.0.1:34480_q_uxm%2Fkx ] o.a.s.c.Overseer Starting to work on the main queue
[junit4] 2> 1711747 INFO (TEST-TestSolrConfigHandlerCloud.test-seed#[BD1D5E7E34E09615]) [n:127.0.0.1:34480_q_uxm%2Fkx ] o.a.s.c.CoreContainer Security conf doesn't exist. Skipping setup for authorization module.
[junit4] 2> 1711747 INFO (TEST-TestSolrConfigHandlerCloud.test-seed#[BD1D5E7E34E09615]) [n:127.0.0.1:34480_q_uxm%2Fkx ] o.a.s.c.CoreContainer No authentication plugin used.
[junit4] 2> 1711748 INFO (TEST-TestSolrConfigHandlerCloud.test-seed#[BD1D5E7E34E09615]) [n:127.0.0.1:34480_q_uxm%2Fkx ] o.a.s.c.CorePropertiesLocator Looking for core definitions underneath /x1/jenkins/jenkins-slave/workspace/Lucene-Solr-Tests-5.x-Java7/solr/build/solr-core/test/J0/temp/solr.handler.TestSolrConfigHandlerCloud_BD1D5E7E34E09615-001/control-001/cores
[junit4] 2> 1711749 INFO (TEST-TestSolrConfigHandlerCloud.test-seed#[BD1D5E7E34E09615]) [n:127.0.0.1:34480_q_uxm%2Fkx ] o.a.s.c.CoreDescriptor Created CoreDescriptor: {name=collection1, loadOnStartup=true, dataDir=data/, coreNodeName=, configSetProperties=configsetprops.json, shard=, config=solrconfig.xml, collection=control_collection, transient=false, schema=schema.xml}
[junit4] 2> 1711749 INFO (TEST-TestSolrConfigHandlerCloud.test-seed#[BD1D5E7E34E09615]) [n:127.0.0.1:34480_q_uxm%2Fkx ] o.a.s.c.CorePropertiesLocator Found core collection1 in /x1/jenkins/jenkins-slave/workspace/Lucene-Solr-Tests-5.x-Java7/solr/build/solr-core/test/J0/temp/solr.handler.TestSolrConfigHandlerCloud_BD1D5E7E34E09615-001/control-001/cores/collection1
[junit4] 2> 1711749 INFO (TEST-TestSolrConfigHandlerCloud.test-seed#[BD1D5E7E34E09615]) [n:127.0.0.1:34480_q_uxm%2Fkx ] o.a.s.c.CorePropertiesLocator Found 1 core definitions
[junit4] 2> 1711751 INFO (TEST-TestSolrConfigHandlerCloud.test-seed#[BD1D5E7E34E09615]) [n:127.0.0.1:34480_q_uxm%2Fkx ] o.a.s.s.SolrDispatchFilter user.dir=/x1/jenkins/jenkins-slave/workspace/Lucene-Solr-Tests-5.x-Java7/solr/build/solr-core/test/J0
[junit4] 2> 1711751 INFO (TEST-TestSolrConfigHandlerCloud.test-seed#[BD1D5E7E34E09615]) [n:127.0.0.1:34480_q_uxm%2Fkx ] o.a.s.s.SolrDispatchFilter SolrDispatchFilter.init() done
[junit4] 2> 1711752 INFO (coreLoadExecutor-4595-thread-1-processing-n:127.0.0.1:34480_q_uxm%2Fkx) [n:127.0.0.1:34480_q_uxm%2Fkx c:control_collection x:collection1] o.a.s.c.ZkController publishing state=down
[junit4] 2> 1711752 INFO (coreLoadExecutor-4595-thread-1-processing-n:127.0.0.1:34480_q_uxm%2Fkx) [n:127.0.0.1:34480_q_uxm%2Fkx c:control_collection x:collection1] o.a.s.c.ZkController numShards not found on descriptor - reading it from system property
[junit4] 2> 1711756 INFO (coreLoadExecutor-4595-thread-1-processing-n:127.0.0.1:34480_q_uxm%2Fkx) [n:127.0.0.1:34480_q_uxm%2Fkx c:control_collection x:collection1] o.a.s.c.ZkController look for our core node name
[junit4] 2> 1711756 INFO (OverseerStateUpdate-95349488939368453-127.0.0.1:34480_q_uxm%2Fkx-n_0000000000) [n:127.0.0.1:34480_q_uxm%2Fkx ] o.a.s.c.Overseer processMessage: queueSize: 1, message = {
[junit4] 2> "collection":"control_collection",
[junit4] 2> "node_name":"127.0.0.1:34480_q_uxm%2Fkx",
[junit4] 2> "shard":null,
[junit4] 2> "numShards":"1",
[junit4] 2> "roles":null,
[junit4] 2> "state":"down",
[junit4] 2> "operation":"state",
[junit4] 2> "base_url":"https://127.0.0.1:34480/q_uxm/kx",
[junit4] 2> "core":"collection1"} current state version: 0
[junit4] 2> 1711757 INFO (OverseerStateUpdate-95349488939368453-127.0.0.1:34480_q_uxm%2Fkx-n_0000000000) [n:127.0.0.1:34480_q_uxm%2Fkx ] o.a.s.c.o.ReplicaMutator Update state numShards=1 message={
[junit4] 2> "collection":"control_collection",
[junit4] 2> "node_name":"127.0.0.1:34480_q_uxm%2Fkx",
[junit4] 2> "shard":null,
[junit4] 2> "numShards":"1",
[junit4] 2> "roles":null,
[junit4] 2> "state":"down",
[junit4] 2> "operation":"state",
[junit4] 2> "base_url":"https://127.0.0.1:34480/q_uxm/kx",
[junit4] 2> "core":"collection1"}
[junit4] 2> 1711757 INFO (OverseerStateUpdate-95349488939368453-127.0.0.1:34480_q_uxm%2Fkx-n_0000000000) [n:127.0.0.1:34480_q_uxm%2Fkx ] o.a.s.c.o.ClusterStateMutator building a new cName: control_collection
[junit4] 2> 1711758 INFO (OverseerStateUpdate-95349488939368453-127.0.0.1:34480_q_uxm%2Fkx-n_0000000000) [n:127.0.0.1:34480_q_uxm%2Fkx ] o.a.s.c.o.ReplicaMutator Assigning new node to shard shard=shard1
[junit4] 2> 1711762 INFO (zkCallback-1263-thread-1-processing-n:127.0.0.1:34480_q_uxm%2Fkx) [n:127.0.0.1:34480_q_uxm%2Fkx ] o.a.s.c.c.ZkStateReader A cluster state change: [WatchedEvent state:SyncConnected type:NodeDataChanged path:/clusterstate.json], has occurred - updating... (live nodes size: [1])
[junit4] 2> 1712757 INFO (coreLoadExecutor-4595-thread-1-processing-n:127.0.0.1:34480_q_uxm%2Fkx) [n:127.0.0.1:34480_q_uxm%2Fkx c:control_collection x:collection1] o.a.s.c.ZkController waiting to find shard id in clusterstate for collection1
[junit4] 2> 1712757 INFO (coreLoadExecutor-4595-thread-1-processing-n:127.0.0.1:34480_q_uxm%2Fkx) [n:127.0.0.1:34480_q_uxm%2Fkx c:control_collection x:collection1] o.a.s.c.ZkController Check for collection zkNode:control_collection
[junit4] 2> 1712757 INFO (coreLoadExecutor-4595-thread-1-processing-n:127.0.0.1:34480_q_uxm%2Fkx) [n:127.0.0.1:34480_q_uxm%2Fkx c:control_collection x:collection1] o.a.s.c.ZkController Collection zkNode exists
[junit4] 2> 1712757 INFO (coreLoadExecutor-4595-thread-1-processing-n:127.0.0.1:34480_q_uxm%2Fkx) [n:127.0.0.1:34480_q_uxm%2Fkx c:control_collection x:collection1] o.a.s.c.c.ZkStateReader Load collection config from: [/collections/control_collection]
[junit4] 2> 1712758 INFO (coreLoadExecutor-4595-thread-1-processing-n:127.0.0.1:34480_q_uxm%2Fkx) [n:127.0.0.1:34480_q_uxm%2Fkx c:control_collection x:collection1] o.a.s.c.c.ZkStateReader path=[/collections/control_collection] [configName]=[conf1] specified config exists in ZooKeeper
[junit4] 2> 1712758 INFO (coreLoadExecutor-4595-thread-1-processing-n:127.0.0.1:34480_q_uxm%2Fkx) [n:127.0.0.1:34480_q_uxm%2Fkx c:control_collection x:collection1] o.a.s.c.SolrResourceLoader new SolrResourceLoader for directory: '/x1/jenkins/jenkins-slave/workspace/Lucene-Solr-Tests-5.x-Java7/solr/build/solr-core/test/J0/temp/solr.handler.TestSolrConfigHandlerCloud_BD1D5E7E34E09615-001/control-001/cores/collection1'
[junit4] 2> 1712758 INFO (coreLoadExecutor-4595-thread-1-processing-n:127.0.0.1:34480_q_uxm%2Fkx) [n:127.0.0.1:34480_q_uxm%2Fkx c:control_collection x:collection1] o.a.s.c.SolrResourceLoader JNDI not configured for solr (NoInitialContextEx)
[junit4] 2> 1712758 INFO (coreLoadExecutor-4595-thread-1-processing-n:127.0.0.1:34480_q_uxm%2Fkx) [n:127.0.0.1:34480_q_uxm%2Fkx c:control_collection x:collection1] o.a.s.c.SolrResourceLoader solr home defaulted to 'solr/' (could not find system property or JNDI)
[junit4] 2> 1712760 INFO (coreLoadExecutor-4595-thread-1-processing-n:127.0.0.1:34480_q_uxm%2Fkx) [n:127.0.0.1:34480_q_uxm%2Fkx c:control_collection x:collection1] o.a.s.c.Config loaded config solrconfig.xml with version 0
[junit4] 2> 1712766 INFO (coreLoadExecutor-4595-thread-1-processing-n:127.0.0.1:34480_q_uxm%2Fkx) [n:127.0.0.1:34480_q_uxm%2Fkx c:control_collection x:collection1] o.a.s.c.SolrConfig current version of requestparams : -1
[junit4] 2> 1712780 INFO (coreLoadExecutor-4595-thread-1-processing-n:127.0.0.1:34480_q_uxm%2Fkx) [n:127.0.0.1:34480_q_uxm%2Fkx c:control_collection x:collection1] o.a.s.c.SolrConfig Using Lucene MatchVersion: 5.5.0
[junit4] 2> 1712808 INFO (coreLoadExecutor-4595-thread-1-processing-n:127.0.0.1:34480_q_uxm%2Fkx) [n:127.0.0.1:34480_q_uxm%2Fkx c:control_collection x:collection1] o.a.s.c.SolrConfig Loaded SolrConfig: solrconfig.xml
[junit4] 2> 1712816 INFO (coreLoadExecutor-4595-thread-1-processing-n:127.0.0.1:34480_q_uxm%2Fkx) [n:127.0.0.1:34480_q_uxm%2Fkx c:control_collection x:collection1] o.a.s.s.IndexSchema [collection1] Schema name=test
[junit4] 2> 1713081 INFO (coreLoadExecutor-4595-thread-1-processing-n:127.0.0.1:34480_q_uxm%2Fkx) [n:127.0.0.1:34480_q_uxm%2Fkx c:control_collection x:collection1] o.a.s.s.OpenExchangeRatesOrgProvider Initialized with rates=open-exchange-rates.json, refreshInterval=1440.
[junit4] 2> 1713089 INFO (coreLoadExecutor-4595-thread-1-processing-n:127.0.0.1:34480_q_uxm%2Fkx) [n:127.0.0.1:34480_q_uxm%2Fkx c:control_collection x:collection1] o.a.s.s.IndexSchema default search field in schema is text
[junit4] 2> 1713091 INFO (coreLoadExecutor-4595-thread-1-processing-n:127.0.0.1:34480_q_uxm%2Fkx) [n:127.0.0.1:34480_q_uxm%2Fkx c:control_collection x:collection1] o.a.s.s.IndexSchema unique key field: id
[junit4] 2> 1713099 INFO (coreLoadExecutor-4595-thread-1-processing-n:127.0.0.1:34480_q_uxm%2Fkx) [n:127.0.0.1:34480_q_uxm%2Fkx c:control_collection x:collection1] o.a.s.s.FileExchangeRateProvider Reloading exchange rates from file currency.xml
[junit4] 2> 1713102 INFO (coreLoadExecutor-4595-thread-1-processing-n:127.0.0.1:34480_q_uxm%2Fkx) [n:127.0.0.1:34480_q_uxm%2Fkx c:control_collection x:collection1] o.a.s.s.FileExchangeRateProvider Reloading exchange rates from file currency.xml
[junit4] 2> 1713105 INFO (coreLoadExecutor-4595-thread-1-processing-n:127.0.0.1:34480_q_uxm%2Fkx) [n:127.0.0.1:34480_q_uxm%2Fkx c:control_collection x:collection1] o.a.s.s.OpenExchangeRatesOrgProvider Reloading exchange rates from open-exchange-rates.json
[junit4] 2> 1713105 INFO (coreLoadExecutor-4595-thread-1-processing-n:127.0.0.1:34480_q_uxm%2Fkx) [n:127.0.0.1:34480_q_uxm%2Fkx c:control_collection x:collection1] o.a.s.s.OpenExchangeRatesOrgProvider Reloading exchange rates from open-exchange-rates.json
[junit4] 2> 1713107 INFO (coreLoadExecutor-4595-thread-1-processing-n:127.0.0.1:34480_q_uxm%2Fkx) [n:127.0.0.1:34480_q_uxm%2Fkx c:control_collection x:collection1] o.a.s.c.ConfigSetProperties Did not find ConfigSet properties, assuming default properties: Can't find resource 'configsetprops.json' in classpath or '/configs/conf1', cwd=/x1/jenkins/jenkins-slave/workspace/Lucene-Solr-Tests-5.x-Java7/solr/build/solr-core/test/J0
[junit4] 2> 1713107 INFO (coreLoadExecutor-4595-thread-1-processing-n:127.0.0.1:34480_q_uxm%2Fkx) [n:127.0.0.1:34480_q_uxm%2Fkx c:control_collection x:collection1] o.a.s.c.CoreContainer Creating SolrCore 'collection1' using configuration from collection control_collection
[junit4] 2> 1713107 INFO (coreLoadExecutor-4595-thread-1-processing-n:127.0.0.1:34480_q_uxm%2Fkx) [n:127.0.0.1:34480_q_uxm%2Fkx c:control_collection s:shard1 r:core_node1 x:collection1] o.a.s.c.SolrCore org.apache.solr.core.MockDirectoryFactory
[junit4] 2> 1713108 INFO (coreLoadExecutor-4595-thread-1-processing-n:127.0.0.1:34480_q_uxm%2Fkx) [n:127.0.0.1:34480_q_uxm%2Fkx c:control_collection s:shard1 r:core_node1 x:collection1] o.a.s.c.SolrCore [[collection1] ] Opening new SolrCore at [/x1/jenkins/jenkins-slave/workspace/Lucene-Solr-Tests-5.x-Java7/solr/build/solr-core/test/J0/temp/solr.handler.TestSolrConfigHandlerCloud_BD1D5E7E34E09615-001/control-001/cores/collection1], dataDir=[/x1/jenkins/jenkins-slave/workspace/Lucene-Solr-Tests-5.x-Java7/solr/build/solr-core/test/J0/temp/solr.handler.TestSolrConfigHandlerCloud_BD1D5E7E34E09615-001/control-001/cores/collection1/data/]
[junit4] 2> 1713108 INFO (coreLoadExecutor-4595-thread-1-processing-n:127.0.0.1:34480_q_uxm%2Fkx) [n:127.0.0.1:34480_q_uxm%2Fkx c:control_collection s:shard1 r:core_node1 x:collection1] o.a.s.c.JmxMonitoredMap JMX monitoring is enabled. Adding Solr mbeans to JMX Server: com.sun.jmx.mbeanserver.JmxMBeanServer@1fcac3a3
[junit4] 2> 1713108 INFO (coreLoadExecutor-4595-thread-1-processing-n:127.0.0.1:34480_q_uxm%2Fkx) [n:127.0.0.1:34480_q_uxm%2Fkx c:control_collection s:shard1 r:core_node1 x:collection1] o.a.s.c.CachingDirectoryFactory return new directory for /x1/jenkins/jenkins-slave/workspace/Lucene-Solr-Tests-5.x-Java7/solr/build/solr-core/test/J0/temp/solr.handler.TestSolrConfigHandlerCloud_BD1D5E7E34E09615-001/control-001/cores/collection1/data
[junit4] 2> 1713108 INFO (coreLoadExecutor-4595-thread-1-processing-n:127.0.0.1:34480_q_uxm%2Fkx) [n:127.0.0.1:34480_q_uxm%2Fkx c:control_collection s:shard1 r:core_node1 x:collection1] o.a.s.c.SolrCore New index directory detected: old=null new=/x1/jenkins/jenkins-slave/workspace/Lucene-Solr-Tests-5.x-Java7/solr/build/solr-core/test/J0/temp/solr.handler.TestSolrConfigHandlerCloud_BD1D5E7E34E09615-001/control-001/cores/collection1/data/index/
[junit4] 2> 1713108 WARN (coreLoadExecutor-4595-thread-1-processing-n:127.0.0.1:34480_q_uxm%2Fkx) [n:127.0.0.1:34480_q_uxm%2Fkx c:control_collection s:shard1 r:core_node1 x:collection1] o.a.s.c.SolrCore [collection1] Solr index directory '/x1/jenkins/jenkins-slave/workspace/Lucene-Solr-Tests-5.x-Java7/solr/build/solr-core/test/J0/temp/solr.handler.TestSolrConfigHandlerCloud_BD1D5E7E34E09615-001/control-001/cores/collection1/data/index' doesn't exist. Creating new index...
[junit4] 2> 1713109 INFO (coreLoadExecutor-4595-thread-1-processing-n:127.0.0.1:34480_q_uxm%2Fkx) [n:127.0.0.1:34480_q_uxm%2Fkx c:control_collection s:shard1 r:core_node1 x:collection1] o.a.s.c.CachingDirectoryFactory return new directory for /x1/jenkins/jenkins-slave/workspace/Lucene-Solr-Tests-5.x-Java7/solr/build/solr-core/test/J0/temp/solr.handler.TestSolrConfigHandlerCloud_BD1D5E7E34E09615-001/control-001/cores/collection1/data/index
[junit4] 2> 1713109 INFO (coreLoadExecutor-4595-thread-1-processing-n:127.0.0.1:34480_q_uxm%2Fkx) [n:127.0.0.1:34480_q_uxm%2Fkx c:control_collection s:shard1 r:core_node1 x:collection1] o.a.s.u.RandomMergePolicy RandomMergePolicy wrapping class org.apache.lucene.index.LogByteSizeMergePolicy: [LogByteSizeMergePolicy: minMergeSize=1677721, mergeFactor=31, maxMergeSize=2147483648, maxMergeSizeForForcedMerge=9223372036854775807, calibrateSizeByDeletes=true, maxMergeDocs=2147483647, maxCFSSegmentSizeMB=8.796093022207999E12, noCFSRatio=1.0]
[junit4] 2> 1713109 INFO (coreLoadExecutor-4595-thread-1-processing-n:127.0.0.1:34480_q_uxm%2Fkx) [n:127.0.0.1:34480_q_uxm%2Fkx c:control_collection s:shard1 r:core_node1 x:collection1] o.a.s.c.SolrDeletionPolicy SolrDeletionPolicy.onCommit: commits: num=1
[junit4] 2> commit{dir=MockDirectoryWrapper(RAMDirectory@36bbbef6 lockFactory=org.apache.lucene.store.SingleInstanceLockFactory@5ff6248c),segFN=segments_1,generation=1}
[junit4] 2> 1713109 INFO (coreLoadExecutor-4595-thread-1-processing-n:127.0.0.1:34480_q_uxm%2Fkx) [n:127.0.0.1:34480_q_uxm%2Fkx c:control_collection s:shard1 r:core_node1 x:collection1] o.a.s.c.SolrDeletionPolicy newest commit generation = 1
[junit4] 2> 1713110 INFO (OldIndexDirectoryCleanupThreadForCore-collection1) [n:127.0.0.1:34480_q_uxm%2Fkx c:control_collection s:shard1 r:core_node1 x:collection1] o.a.s.c.SolrCore Looking for old index directories to cleanup for core collection1 in /x1/jenkins/jenkins-slave/workspace/Lucene-Solr-Tests-5.x-Java7/solr/build/solr-core/test/J0/temp/solr.handler.TestSolrConfigHandlerCloud_BD1D5E7E34E09615-001/control-001/cores/collection1/data/
[junit4] 2> 1713110 WARN (OldIndexDirectoryCleanupThreadForCore-collection1) [n:127.0.0.1:34480_q_uxm%2Fkx c:control_collection s:shard1 r:core_node1 x:collection1] o.a.s.c.DirectoryFactory /x1/jenkins/jenkins-slave/workspace/Lucene-Solr-Tests-5.x-Java7/solr/build/solr-core/test/J0/temp/solr.handler.TestSolrConfigHandlerCloud_BD1D5E7E34E09615-001/control-001/cores/collection1/data/ does not point to a valid data directory; skipping clean-up of old index directories.
[junit4] 2> 1713114 INFO (coreLoadExecutor-4595-thread-1-processing-n:127.0.0.1:34480_q_uxm%2Fkx) [n:127.0.0.1:34480_q_uxm%2Fkx c:control_collection s:shard1 r:core_node1 x:collection1] o.a.s.u.p.UpdateRequestProcessorChain creating updateRequestProcessorChain "nodistrib"
[junit4] 2> 1713115 INFO (coreLoadExecutor-4595-thread-1-processing-n:127.0.0.1:34480_q_uxm%2Fkx) [n:127.0.0.1:34480_q_uxm%2Fkx c:control_collection s:shard1 r:core_node1 x:collection1] o.a.s.u.p.UpdateRequestProcessorChain creating updateRequestProcessorChain "dedupe"
[junit4] 2> 1713115 INFO (coreLoadExecutor-4595-thread-1-processing-n:127.0.0.1:34480_q_uxm%2Fkx) [n:127.0.0.1:34480_q_uxm%2Fkx c:control_collection s:shard1 r:core_node1 x:collection1] o.a.s.u.p.UpdateRequestProcessorChain inserting DistributedUpdateProcessorFactory into updateRequestProcessorChain "dedupe"
[junit4] 2> 1713115 INFO (coreLoadExecutor-4595-thread-1-processing-n:127.0.0.1:34480_q_uxm%2Fkx) [n:127.0.0.1:34480_q_uxm%2Fkx c:control_collection s:shard1 r:core_node1 x:collection1] o.a.s.u.p.UpdateRequestProcessorChain creating updateRequestProcessorChain "stored_sig"
[junit4] 2> 1713115 INFO (coreLoadExecutor-4595-thread-1-processing-n:127.0.0.1:34480_q_uxm%2Fkx) [n:127.0.0.1:34480_q_uxm%2Fkx c:control_collection s:shard1 r:core_node1 x:collection1] o.a.s.u.p.UpdateRequestProcessorChain inserting DistributedUpdateProcessorFactory into updateRequestProcessorChain "stored_sig"
[junit4] 2> 1713115 INFO (coreLoadExecutor-4595-thread-1-processing-n:127.0.0.1:34480_q_uxm%2Fkx) [n:127.0.0.1:34480_q_uxm%2Fkx c:control_collection s:shard1 r:core_node1 x:collection1] o.a.s.u.p.UpdateRequestProcessorChain creating updateRequestProcessorChain "distrib-dup-test-chain-explicit"
[junit4] 2> 1713115 INFO (coreLoadExecutor-4595-thread-1-processing-n:127.0.0.1:34480_q_uxm%2Fkx) [n:127.0.0.1:34480_q_uxm%2Fkx c:control_collection s:shard1 r:core_node1 x:collection1] o.a.s.u.p.UpdateRequestProcessorChain creating updateRequestProcessorChain "distrib-dup-test-chain-implicit"
[junit4] 2> 1713115 INFO (coreLoadExecutor-4595-thread-1-processing-n:127.0.0.1:34480_q_uxm%2Fkx) [n:127.0.0.1:34480_q_uxm%2Fkx c:control_collection s:shard1 r:core_node1 x:collection1] o.a.s.u.p.UpdateRequestProcessorChain inserting DistributedUpdateProcessorFactory into updateRequestProcessorChain "distrib-dup-test-chain-implicit"
[junit4] 2> 1713116 INFO (coreLoadExecutor-4595-thread-1-processing-n:127.0.0.1:34480_q_uxm%2Fkx) [n:127.0.0.1:34480_q_uxm%2Fkx c:control_collection s:shard1 r:core_node1 x:collection1] o.a.s.c.SolrCore no updateRequestProcessorChain defined as default, creating implicit default
[junit4] 2> 1713116 WARN (coreLoadExecutor-4595-thread-1-processing-n:127.0.0.1:34480_q_uxm%2Fkx) [n:127.0.0.1:34480_q_uxm%2Fkx c:control_collection s:shard1 r:core_node1 x:collection1] o.a.s.c.RequestHandlers INVALID paramSet a in requestHandler {type = requestHandler,name = /dump,class = DumpRequestHandler,args = {defaults={a=A,b=B}}}
[junit4] 2> 1713119 INFO (coreLoadExecutor-4595-thread-1-processing-n:127.0.0.1:34480_q_uxm%2Fkx) [n:127.0.0.1:34480_q_uxm%2Fkx c:control_collection s:shard1 r:core_node1 x:collection1] o.a.s.h.l.XMLLoader xsltCacheLifetimeSeconds=60
[junit4] 2> 1713120 INFO (coreLoadExecutor-4595-thread-1-processing-n:127.0.0.1:34480_q_uxm%2Fkx) [n:127.0.0.1:34480_q_uxm%2Fkx c:control_collection s:shard1 r:core_node1 x:collection1] o.a.s.h.l.XMLLoader xsltCacheLifetimeSeconds=60
[junit4] 2> 1713121 INFO (coreLoadExecutor-4595-thread-1-processing-n:127.0.0.1:34480_q_uxm%2Fkx) [n:127.0.0.1:34480_q_uxm%2Fkx c:control_collection s:shard1 r:core_node1 x:collection1] o.a.s.h.l.XMLLoader xsltCacheLifetimeSeconds=60
[junit4] 2> 1713122 INFO (coreLoadExecutor-4595-thread-1-processing-n:127.0.0.1:34480_q_uxm%2Fkx) [n:127.0.0.1:34480_q_uxm%2Fkx c:control_collection s:shard1 r:core_node1 x:collection1] o.a.s.h.l.XMLLoader xsltCacheLifetimeSeconds=60
[junit4] 2> 1713127 INFO (coreLoadExecutor-4595-thread-1-processing-n:127.0.0.1:34480_q_uxm%2Fkx) [n:127.0.0.1:34480_q_uxm%2Fkx c:control_collection s:shard1 r:core_node1 x:collection1] o.a.s.c.RequestHandlers Registered paths: standard,/config,/admin/luke,/admin/ping,/admin/threads,/admin/system,/admin/file,/schema,/update,/admin/mbeans,/replication,/dump,/admin/properties,/admin/segments,/update/csv,/get,/update/json/docs,/admin/plugins,/admin/logging,/update/json
[junit4] 2> 1713128 INFO (coreLoadExecutor-4595-thread-1-processing-n:127.0.0.1:34480_q_uxm%2Fkx) [n:127.0.0.1:34480_q_uxm%2Fkx c:control_collection s:shard1 r:core_node1 x:collection1] o.a.s.c.SolrCore Using default statsCache cache: org.apache.solr.search.stats.LocalStatsCache
[junit4] 2> 1713128 INFO (coreLoadExecutor-4595-thread-1-processing-n:127.0.0.1:34480_q_uxm%2Fkx) [n:127.0.0.1:34480_q_uxm%2Fkx c:control_collection s:shard1 r:core_node1 x:collection1] o.a.s.u.UpdateHandler Using UpdateLog implementation: org.apache.solr.update.UpdateLog
[junit4] 2> 1713128 INFO (coreLoadExecutor-4595-thread-1-processing-n:127.0.0.1:34480_q_uxm%2Fkx) [n:127.0.0.1:34480_q_uxm%2Fkx c:control_collection s:shard1 r:core_node1 x:collection1] o.a.s.u.UpdateLog Initializing UpdateLog: dataDir= defaultSyncLevel=FLUSH numRecordsToKeep=100 maxNumLogsToKeep=10 numVersionBuckets=65536
[junit4] 2> 1713129 INFO (coreLoadExecutor-4595-thread-1-processing-n:127.0.0.1:34480_q_uxm%2Fkx) [n:127.0.0.1:34480_q_uxm%2Fkx c:control_collection s:shard1 r:core_node1 x:collection1] o.a.s.u.CommitTracker Hard AutoCommit: disabled
[junit4] 2> 1713129 INFO (coreLoadExecutor-4595-thread-1-processing-n:127.0.0.1:34480_q_uxm%2Fkx) [n:127.0.0.1:34480_q_uxm%2Fkx c:control_collection s:shard1 r:core_node1 x:collection1] o.a.s.u.CommitTracker Soft AutoCommit: disabled
[junit4] 2> 1713130 INFO (coreLoadExecutor-4595-thread-1-processing-n:127.0.0.1:34480_q_uxm%2Fkx) [n:127.0.0.1:34480_q_uxm%2Fkx c:control_collection s:shard1 r:core_node1 x:collection1] o.a.s.u.RandomMergePolicy RandomMergePolicy wrapping class org.apache.lucene.index.LogDocMergePolicy: [LogDocMergePolicy: minMergeSize=1000, mergeFactor=17, maxMergeSize=9223372036854775807, maxMergeSizeForForcedMerge=9223372036854775807, calibrateSizeByDeletes=false, maxMergeDocs=2147483647, maxCFSSegmentSizeMB=8.796093022207999E12, noCFSRatio=1.0]
[junit4] 2> 1713130 INFO (coreLoadExecutor-4595-thread-1-processing-n:127.0.0.1:34480_q_uxm%2Fkx) [n:127.0.0.1:34480_q_uxm%2Fkx c:control_collection s:shard1 r:core_node1 x:collection1] o.a.s.c.SolrDeletionPolicy SolrDeletionPolicy.onInit: commits: num=1
[junit4] 2> commit{dir=MockDirectoryWrapper(RAMDirectory@36bbbef6 lockFactory=org.apache.lucene.store.SingleInstanceLockFactory@5ff6248c),segFN=segments_1,generation=1}
[junit4] 2> 1713130 INFO (coreLoadExecutor-4595-thread-1-processing-n:127.0.0.1:34480_q_uxm%2Fkx) [n:127.0.0.1:34480_q_uxm%2Fkx c:control_collection s:shard1 r:core_node1 x:collection1] o.a.s.c.SolrDeletionPolicy newest commit generation = 1
[junit4] 2> 1713130 INFO (coreLoadExecutor-4595-thread-1-processing-n:127.0.0.1:34480_q_uxm%2Fkx) [n:127.0.0.1:34480_q_uxm%2Fkx c:control_collection s:shard1 r:core_node1 x:collection1] o.a.s.s.SolrIndexSearcher Opening Searcher@7a11e2d5[collection1] main
[junit4] 2> 1713130 INFO (coreLoadExecutor-4595-thread-1-processing-n:127.0.0.1:34480_q_uxm%2Fkx) [n:127.0.0.1:34480_q_uxm%2Fkx c:control_collection s:shard1 r:core_node1 x:collection1] o.a.s.c.c.ZkStateReader Load collection config from: [/collections/control_collection]
[junit4] 2> 1713131 INFO (coreLoadExecutor-4595-thread-1-processing-n:127.0.0.1:34480_q_uxm%2Fkx) [n:127.0.0.1:34480_q_uxm%2Fkx c:control_collection s:shard1 r:core_node1 x:collection1] o.a.s.c.c.ZkStateReader path=[/collections/control_collection] [configName]=[conf1] specified config exists in ZooKeeper
[junit4] 2> 1713131 INFO (coreLoadExecutor-4595-thread-1-processing-n:127.0.0.1:34480_q_uxm%2Fkx) [n:127.0.0.1:34480_q_uxm%2Fkx c:control_collection s:shard1 r:core_node1 x:collection1] o.a.s.r.ManagedResourceStorage Setting up ZooKeeper-based storage for the RestManager with znodeBase: /configs/conf1
[junit4] 2> 1713131 INFO (coreLoadExecutor-4595-thread-1-processing-n:127.0.0.1:34480_q_uxm%2Fkx) [n:127.0.0.1:34480_q_uxm%2Fkx c:control_collection s:shard1 r:core_node1 x:collection1] o.a.s.r.ManagedResourceStorage Configured ZooKeeperStorageIO with znodeBase: /configs/conf1
[junit4] 2> 1713132 INFO (coreLoadExecutor-4595-thread-1-processing-n:127.0.0.1:34480_q_uxm%2Fkx) [n:127.0.0.1:34480_q_uxm%2Fkx c:control_collection s:shard1 r:core_node1 x:collection1] o.a.s.r.RestManager Initializing RestManager with initArgs: {}
[junit4] 2> 1713132 INFO (coreLoadExecutor-4595-thread-1-processing-n:127.0.0.1:34480_q_uxm%2Fkx) [n:127.0.0.1:34480_q_uxm%2Fkx c:control_collection s:shard1 r:core_node1 x:collection1] o.a.s.r.ManagedResourceStorage Reading _rest_managed.json using ZooKeeperStorageIO:path=/configs/conf1
[junit4] 2> 1713132 INFO (coreLoadExecutor-4595-thread-1-processing-n:127.0.0.1:34480_q_uxm%2Fkx) [n:127.0.0.1:34480_q_uxm%2Fkx c:control_collection s:shard1 r:core_node1 x:collection1] o.a.s.r.ManagedResourceStorage No data found for znode /configs/conf1/_rest_managed.json
[junit4] 2> 1713132 INFO (coreLoadExecutor-4595-thread-1-processing-n:127.0.0.1:34480_q_uxm%2Fkx) [n:127.0.0.1:34480_q_uxm%2Fkx c:control_collection s:shard1 r:core_node1 x:collection1] o.a.s.r.ManagedResourceStorage Loaded null at path _rest_managed.json using ZooKeeperStorageIO:path=/configs/conf1
[junit4] 2> 1713132 INFO (coreLoadExecutor-4595-thread-1-processing-n:127.0.0.1:34480_q_uxm%2Fkx) [n:127.0.0.1:34480_q_uxm%2Fkx c:control_collection s:shard1 r:core_node1 x:collection1] o.a.s.r.RestManager Initializing 0 registered ManagedResources
[junit4] 2> 1713132 INFO (coreLoadExecutor-4595-thread-1-processing-n:127.0.0.1:34480_q_uxm%2Fkx) [n:127.0.0.1:34480_q_uxm%2Fkx c:control_collection s:shard1 r:core_node1 x:collection1] o.a.s.h.ReplicationHandler Commits will be reserved for 10000
[junit4] 2> 1713133 INFO (searcherExecutor-4596-thread-1-processing-c:control_collection n:127.0.0.1:34480_q_uxm%2Fkx s:shard1 r:core_node1 x:collection1) [n:127.0.0.1:34480_q_uxm%2Fkx c:control_collection s:shard1 r:core_node1 x:collection1] o.a.s.c.SolrCore [collection1] Registered new searcher Searcher@7a11e2d5[collection1] main{ExitableDirectoryReader(UninvertingDirectoryReader())}
[junit4] 2> 1713133 INFO (coreLoadExecutor-4595-thread-1-processing-n:127.0.0.1:34480_q_uxm%2Fkx) [n:127.0.0.1:34480_q_uxm%2Fkx c:control_collection s:shard1 r:core_node1 x:collection1] o.a.s.u.UpdateLog Looking up max value of version field to seed version buckets
[junit4] 2> 1713133 INFO (coreLoadExecutor-4595-thread-1-processing-n:127.0.0.1:34480_q_uxm%2Fkx) [n:127.0.0.1:34480_q_uxm%2Fkx c:control_collection s:shard1 r:core_node1 x:collection1] o.a.s.u.VersionInfo Refreshing highest value of _version_ for 65536 version buckets from index
[junit4] 2> 1713134 INFO (coreLoadExecutor-4595-thread-1-processing-n:127.0.0.1:34480_q_uxm%2Fkx) [n:127.0.0.1:34480_q_uxm%2Fkx c:control_collection s:shard1 r:core_node1 x:collection1] o.a.s.u.VersionInfo No terms found for _version_, cannot seed version bucket highest value from index
[junit4] 2> 1713134 INFO (coreLoadExecutor-4595-thread-1-processing-n:127.0.0.1:34480_q_uxm%2Fkx) [n:127.0.0.1:34480_q_uxm%2Fkx c:control_collection s:shard1 r:core_node1 x:collection1] o.a.s.u.UpdateLog Could not find max version in index or recent updates, using new clock 1525591824865951744
[junit4] 2> 1713136 INFO (coreLoadExecutor-4595-thread-1-processing-n:127.0.0.1:34480_q_uxm%2Fkx) [n:127.0.0.1:34480_q_uxm%2Fkx c:control_collection s:shard1 r:core_node1 x:collection1] o.a.s.u.UpdateLog Took 2.0ms to seed version buckets with highest version 1525591824865951744
[junit4] 2> 1713136 INFO (coreLoadExecutor-4595-thread-1-processing-n:127.0.0.1:34480_q_uxm%2Fkx) [n:127.0.0.1:34480_q_uxm%2Fkx c:control_collection s:shard1 r:core_node1 x:collection1] o.a.s.c.ZkController watch zkdir /configs/conf1
[junit4] 2> 1713136 INFO (coreLoadExecutor-4595-thread-1-processing-n:127.0.0.1:34480_q_uxm%2Fkx) [n:127.0.0.1:34480_q_uxm%2Fkx c:control_collection s:shard1 r:core_node1 x:collection1] o.a.s.c.CoreContainer registering core: collection1
[junit4] 2> 1713137 INFO (coreZkRegister-4589-thread-1-processing-c:control_collection n:127.0.0.1:34480_q_uxm%2Fkx s:shard1 r:core_node1 x:collection1) [n:127.0.0.1:34480_q_uxm%2Fkx c:control_collection s:shard1 r:core_node1 x:collection1] o.a.s.c.ZkController Register replica - core:collection1 address:https://127.0.0.1:34480/q_uxm/kx collection:control_collection shard:shard1
[junit4] 2> 1713137 INFO (coreZkRegister-4589-thread-1-processing-c:control_collection n:127.0.0.1:34480_q_uxm%2Fkx s:shard1 r:core_node1 x:collection1) [n:127.0.0.1:34480_q_uxm%2Fkx c:control_collection s:shard1 r:core_node1 x:collection1] o.a.s.c.c.SolrZkClient makePath: /collections/control_collection/leader_elect/shard1/election
[junit4] 2> 1713140 INFO (coreZkRegister-4589-thread-1-processing-c:control_collection n:127.0.0.1:34480_q_uxm%2Fkx s:shard1 r:core_node1 x:collection1) [n:127.0.0.1:34480_q_uxm%2Fkx c:control_collection s:shard1 r:core_node1 x:collection1] o.a.s.c.LeaderElector Joined leadership election with path: /collections/control_collection/leader_elect/shard1/election/95349488939368453-core_node1-n_0000000000
[junit4] 2> 1713141 INFO (coreZkRegister-4589-thread-1-processing-c:control_collection n:127.0.0.1:34480_q_uxm%2Fkx s:shard1 r:core_node1 x:collection1) [n:127.0.0.1:34480_q_uxm%2Fkx c:control_collection s:shard1 r:core_node1 x:collection1] o.a.s.c.ShardLeaderElectionContext Running the leader process for shard=shard1 and weAreReplacement=false and leaderVoteWait=10000
[junit4] 2> 1713142 INFO (coreZkRegister-4589-thread-1-processing-c:control_collection n:127.0.0.1:34480_q_uxm%2Fkx s:shard1 r:core_node1 x:collection1) [n:127.0.0.1:34480_q_uxm%2Fkx c:control_collection s:shard1 r:core_node1 x:collection1] o.a.s.c.ShardLeaderElectionContext Enough replicas found to continue.
[junit4] 2> 1713143 INFO (coreZkRegister-4589-thread-1-processing-c:control_collection n:127.0.0.1:34480_q_uxm%2Fkx s:shard1 r:core_node1 x:collection1) [n:127.0.0.1:34480_q_uxm%2Fkx c:control_collection s:shard1 r:core_node1 x:collection1] o.a.s.c.ShardLeaderElectionContext I may be the new leader - try and sync
[junit4] 2> 1713143 INFO (coreZkRegister-4589-thread-1-processing-c:control_collection n:127.0.0.1:34480_q_uxm%2Fkx s:shard1 r:core_node1 x:collection1) [n:127.0.0.1:34480_q_uxm%2Fkx c:control_collection s:shard1 r:core_node1 x:collection1] o.a.s.c.SyncStrategy Sync replicas to https://127.0.0.1:34480/q_uxm/kx/collection1/
[junit4] 2> 1713143 INFO (coreZkRegister-4589-thread-1-processing-c:control_collection n:127.0.0.1:34480_q_uxm%2Fkx s:shard1 r:core_node1 x:collection1) [n:127.0.0.1:34480_q_uxm%2Fkx c:control_collection s:shard1 r:core_node1 x:collection1] o.a.s.c.SyncStrategy Sync Success - now sync replicas to me
[junit4] 2> 1713143 INFO (OverseerStateUpdate-95349488939368453-127.0.0.1:34480_q_uxm%2Fkx-n_0000000000) [n:127.0.0.1:34480_q_uxm%2Fkx ] o.a.s.c.Overseer processMessage: queueSize: 1, message = {
[junit4] 2> "operation":"leader",
[junit4] 2> "shard":"shard1",
[junit4] 2> "collection":"control_collection"} current state version: 1
[junit4] 2> 1713143 INFO (coreZkRegister-4589-thread-1-processing-c:control_collection n:127.0.0.1:34480_q_uxm%2Fkx s:shard1 r:core_node1 x:collection1) [n:127.0.0.1:34480_q_uxm%2Fkx c:control_collection s:shard1 r:core_node1 x:collection1] o.a.s.c.SyncStrategy https://127.0.0.1:34480/q_uxm/kx/collection1/ has no replicas
[junit4] 2> 1713144 INFO (coreZkRegister-4589-thread-1-processing-c:control_collection n:127.0.0.1:34480_q_uxm%2Fkx s:shard1 r:core_node1 x:collection1) [n:127.0.0.1:34480_q_uxm%2Fkx c:control_collection s:shard1 r:core_node1 x:collection1] o.a.s.c.c.SolrZkClient makePath: /collections/control_collection/leaders/shard1
[junit4] 2> 1713146 INFO (coreZkRegister-4589-thread-1-processing-c:control_collection n:127.0.0.1:34480_q_uxm%2Fkx s:shard1 r:core_node1 x:collection1) [n:127.0.0.1:34480_q_uxm%2Fkx c:control_collection s:shard1 r:core_node1 x:collection1] o.a.s.c.ShardLeaderElectionContextBase Creating leader registration node
[junit4] 2> 1713148 INFO (coreZkRegister-4589-thread-1-processing-c:control_collection n:127.0.0.1:34480_q_uxm%2Fkx s:shard1 r:core_node1 x:collection1) [n:127.0.0.1:34480_q_uxm%2Fkx c:control_collection s:shard1 r:core_node1 x:collection1] o.a.s.c.ShardLeaderElectionContext I am the new leader: https://127.0.0.1:34480/q_uxm/kx/collection1/ shard1
[junit4] 2> 1713149 INFO (OverseerStateUpdate-95349488939368453-127.0.0.1:34480_q_uxm%2Fkx-n_0000000000) [n:127.0.0.1:34480_q_uxm%2Fkx ] o.a.s.c.Overseer processMessage: queueSize: 1, message = {
[junit4] 2> "operation":"leader",
[junit4] 2> "shard":"shard1",
[junit4] 2> "collection":"control_collection",
[junit4] 2> "base_url":"https://127.0.0.1:34480/q_uxm/kx",
[junit4] 2> "core":"collection1",
[junit4] 2> "state":"active"} current state version: 1
[junit4] 2> 1713251 INFO (zkCallback-1263-thread-1-processing-n:127.0.0.1:34480_q_uxm%2Fkx) [n:127.0.0.1:34480_q_uxm%2Fkx ] o.a.s.c.c.ZkStateReader A cluster state change: [WatchedEvent state:SyncConnected type:NodeDataChanged path:/clusterstate.json], has occurred - updating... (live nodes size: [1])
[junit4] 2> 1713255 INFO (TEST-TestSolrConfigHandlerCloud.test-seed#[BD1D5E7E34E09615]) [ ] o.a.s.c.c.SolrZkClient Using default ZkCredentialsProvider
[junit4] 2> 1713256 INFO (TEST-TestSolrConfigHandlerCloud.test-seed#[BD1D5E7E34E09615]) [ ] o.a.s.c.c.ConnectionManager Waiting for client to connect to ZooKeeper
[junit4] 2> 1713257 INFO (zkCallback-1265-thread-1) [ ] o.a.s.c.c.ConnectionManager Watcher org.apache.solr.common.cloud.ConnectionManager@78b6bb8f name:ZooKeeperConnection Watcher:127.0.0.1:39206/solr got event WatchedEvent state:SyncConnected type:None path:null path:null type:None
[junit4] 2> 1713257 INFO (TEST-TestSolrConfigHandlerCloud.test-seed#[BD1D5E7E34E09615]) [ ] o.a.s.c.c.ConnectionManager Client is connected to ZooKeeper
[junit4] 2> 1713257 INFO (TEST-TestSolrConfigHandlerCloud.test-seed#[BD1D5E7E34E09615]) [ ] o.a.s.c.c.SolrZkClient Using default ZkACLProvider
[junit4] 2> 1713257 INFO (TEST-TestSolrConfigHandlerCloud.test-seed#[BD1D5E7E34E09615]) [ ] o.a.s.c.c.ZkStateReader Updating cluster state from ZooKeeper...
[junit4] 2> 1713259 INFO (TEST-TestSolrConfigHandlerCloud.test-seed#[BD1D5E7E34E09615]) [ ] o.a.s.c.ChaosMonkey monkey: init - expire sessions:false cause connection loss:false
[junit4] 2> 1713259 INFO (TEST-TestSolrConfigHandlerCloud.test-seed#[BD1D5E7E34E09615]) [ ] o.a.s.c.AbstractFullDistribZkTestBase Creating collection1 with stateFormat=2
[junit4] 2> 1713259 INFO (TEST-TestSolrConfigHandlerCloud.test-seed#[BD1D5E7E34E09615]) [ ] o.a.s.c.c.SolrZkClient Using default ZkCredentialsProvider
[junit4] 2> 1713260 INFO (TEST-TestSolrConfigHandlerCloud.test-seed#[BD1D5E7E34E09615]) [ ] o.a.s.c.c.ConnectionManager Waiting for client to connect to ZooKeeper
[junit4] 2> 1713261 INFO (zkCallback-1266-thread-1) [ ] o.a.s.c.c.ConnectionManager Watcher org.apache.solr.common.cloud.ConnectionManager@4dca0a71 name:ZooKeeperConnection Watcher:127.0.0.1:39206/solr got event WatchedEvent state:SyncConnected type:None path:null path:null type:None
[junit4] 2> 1713261 INFO (TEST-TestSolrConfigHandlerCloud.test-seed#[BD1D5E7E34E09615]) [ ] o.a.s.c.c.ConnectionManager Client is connected to ZooKeeper
[junit4] 2> 1713261 INFO (TEST-TestSolrConfigHandlerCloud.test-seed#[BD1D5E7E34E09615]) [ ] o.a.s.c.c.SolrZkClient Using default ZkACLProvider
[junit4] 2> 1713272 INFO (OverseerStateUpdate-95349488939368453-127.0.0.1:34480_q_uxm%2Fkx-n_0000000000) [n:127.0.0.1:34480_q_uxm%2Fkx ] o.a.s.c.Overseer processMessage: queueSize: 1, message = {
[junit4] 2> "operation":"create",
[junit4] 2> "name":"collection1",
[junit4] 2> "numShards":"2",
[junit4] 2> "stateFormat":"2"} current state version: 2
[junit4] 2> 1713272 INFO (OverseerStateUpdate-95349488939368453-127.0.0.1:34480_q_uxm%2Fkx-n_0000000000) [n:127.0.0.1:34480_q_uxm%2Fkx ] o.a.s.c.o.ClusterStateMutator building a new cName: collection1
[junit4] 2> 1713299 INFO (coreZkRegister-4589-thread-1-processing-c:control_collection n:127.0.0.1:34480_q_uxm%2Fkx s:shard1 r:core_node1 x:collection1) [n:127.0.0.1:34480_q_uxm%2Fkx c:control_collection s:shard1 r:core_node1 x:collection1] o.a.s.c.ZkController We are https://127.0.0.1:34480/q_uxm/kx/collection1/ and leader is https://127.0.0.1:34480/q_uxm/kx/collection1/
[junit4] 2> 1713299 INFO (coreZkRegister-4589-thread-1-processing-c:control_collection n:127.0.0.1:34480_q_uxm%2Fkx s:shard1 r:core_node1 x:collection1) [n:127.0.0.1:34480_q_uxm%2Fkx c:control_collection s:shard1 r:core_node1 x:collection1] o.a.s.c.ZkController No LogReplay needed for core=collection1 baseURL=https://127.0.0.1:34480/q_uxm/kx
[junit4] 2> 1713299 INFO (coreZkRegister-4589-thread-1-processing-c:control_collection n:127.0.0.1:34480_q_uxm%2Fkx s:shard1 r:core_node1 x:collection1) [n:127.0.0.1:34480_q_uxm%2Fkx c:control_collection s:shard1 r:core_node1 x:collection1] o.a.s.c.ZkController I am the leader, no recovery necessary
[junit4] 2> 1713299 INFO (coreZkRegister-4589-thread-1-processing-c:control_collection n:127.0.0.1:34480_q_uxm%2Fkx s:shard1 r:core_node1 x:collection1) [n:127.0.0.1:34480_q_uxm%2Fkx c:control_collection s:shard1 r:core_node1 x:collection1] o.a.s.c.ZkController publishing state=active
[junit4] 2> 1713299 INFO (coreZkRegister-4589-thread-1-processing-c:control_collection n:127.0.0.1:34480_q_uxm%2Fkx s:shard1 r:core_node1 x:collection1) [n:127.0.0.1:34480_q_uxm%2Fkx c:control_collection s:shard1 r:core_node1 x:collection1] o.a.s.c.ZkController numShards not found on descriptor - reading it from system property
[junit4] 2> 1713301 INFO (OverseerStateUpdate-95349488939368453-127.0.0.1:34480_q_uxm%2Fkx-n_0000000000) [n:127.0.0.1:34480_q_uxm%2Fkx ] o.a.s.c.Overseer processMessage: queueSize: 1, message = {
[junit4] 2> "collection":"control_collection",
[junit4] 2> "node_name":"127.0.0.1:34480_q_uxm%2Fkx",
[junit4] 2> "shard":"shard1",
[junit4] 2> "numShards":"2",
[junit4] 2> "roles":null,
[junit4] 2> "state":"active",
[junit4] 2> "operation":"state",
[junit4] 2> "core_node_name":"core_node1",
[junit4] 2> "base_url":"https://127.0.0.1:34480/q_uxm/kx",
[junit4] 2> "core":"collection1"} current state version: 2
[junit4] 2> 1713302 INFO (OverseerStateUpdate-95349488939368453-127.0.0.1:34480_q_uxm%2Fkx-n_0000000000) [n:127.0.0.1:34480_q_uxm%2Fkx ] o.a.s.c.o.ReplicaMutator Update state numShards=2 message={
[junit4] 2> "collection":"control_collection",
[junit4] 2> "node_name":"127.0.0.1:34480_q_uxm%2Fkx",
[junit4] 2> "shard":"shard1",
[junit4] 2> "numShards":"2",
[junit4] 2> "roles":null,
[junit4] 2> "state":"active",
[junit4] 2> "operation":"state",
[junit4] 2> "core_node_name":"core_node1",
[junit4] 2> "base_url":"https://127.0.0.1:34480/q_uxm/kx",
[junit4] 2> "core":"collection1"}
[junit4] 2> 1713303 INFO (OverseerStateUpdate-95349488939368453-127.0.0.1:34480_q_uxm%2Fkx-n_0000000000) [n:127.0.0.1:34480_q_uxm%2Fkx ] o.a.s.c.o.ZkStateWriter going to create_collection /collections/collection1/state.json
[junit4] 2> 1713356 INFO (TEST-TestSolrConfigHandlerCloud.test-seed#[BD1D5E7E34E09615]) [ ] o.a.s.SolrTestCaseJ4 Writing core.properties file to /x1/jenkins/jenkins-slave/workspace/Lucene-Solr-Tests-5.x-Java7/solr/build/solr-core/test/J0/temp/solr.handler.TestSolrConfigHandlerCloud_BD1D5E7E34E09615-001/shard-1-001/cores/collection1
[junit4] 2> 1713357 INFO (TEST-TestSolrConfigHandlerCloud.test-seed#[BD1D5E7E34E09615]) [ ] o.a.s.c.AbstractFullDistribZkTestBase create jetty 1 in directory /x1/jenkins/jenkins-slave/workspace/Lucene-Solr-Tests-5.x-Java7/solr/build/solr-core/test/J0/temp/solr.handler.TestSolrConfigHandlerCloud_BD1D5E7E34E09615-001/shard-1-001
[junit4] 2> 1713358 INFO (TEST-TestSolrConfigHandlerCloud.test-seed#[BD1D5E7E34E09615]) [ ] o.e.j.s.Server jetty-9.2.13.v20150730
[junit4] 2> 1713360 INFO (TEST-TestSolrConfigHandlerCloud.test-seed#[BD1D5E7E34E09615]) [ ] o.e.j.s.h.ContextHandler Started o.e.j.s.ServletContextHandler@5ca20b56{/q_uxm/kx,null,AVAILABLE}
[junit4] 2> 1713371 INFO (TEST-TestSolrConfigHandlerCloud.test-seed#[BD1D5E7E34E09615]) [ ] o.e.j.s.ServerConnector Started ServerConnector@571d92a{SSL-http/1.1}{127.0.0.1:32918}
[junit4] 2> 1713371 INFO (TEST-TestSolrConfigHandlerCloud.test-seed#[BD1D5E7E34E09615]) [ ] o.e.j.s.Server Started @1716603ms
[junit4] 2> 1713371 INFO (TEST-TestSolrConfigHandlerCloud.test-seed#[BD1D5E7E34E09615]) [ ] o.a.s.c.s.e.JettySolrRunner Jetty properties: {solr.data.dir=/x1/jenkins/jenkins-slave/workspace/Lucene-Solr-Tests-5.x-Java7/solr/build/solr-core/test/J0/temp/solr.handler.TestSolrConfigHandlerCloud_BD1D5E7E34E09615-001/tempDir-001/jetty1, hostContext=/q_uxm/kx, solrconfig=solrconfig.xml, hostPort=32918, coreRootDirectory=/x1/jenkins/jenkins-slave/workspace/Lucene-Solr-Tests-5.x-Java7/solr/build/solr-core/test/J0/../../../../../../../../../../x1/jenkins/jenkins-slave/workspace/Lucene-Solr-Tests-5.x-Java7/solr/build/solr-core/test/J0/temp/solr.handler.TestSolrConfigHandlerCloud_BD1D5E7E34E09615-001/shard-1-001/cores}
[junit4] 2> 1713372 INFO (TEST-TestSolrConfigHandlerCloud.test-seed#[BD1D5E7E34E09615]) [ ] o.a.s.s.SolrDispatchFilter SolrDispatchFilter.init(): sun.misc.Launcher$AppClassLoader@4f6de641
[junit4] 2> 1713372 INFO (TEST-TestSolrConfigHandlerCloud.test-seed#[BD1D5E7E34E09615]) [ ] o.a.s.c.SolrResourceLoader new SolrResourceLoader for directory: '/x1/jenkins/jenkins-slave/workspace/Lucene-Solr-Tests-5.x-Java7/solr/build/solr-core/test/J0/temp/solr.handler.TestSolrConfigHandlerCloud_BD1D5E7E34E09615-001/shard-1-001'
[junit4] 2> 1713372 INFO (TEST-TestSolrConfigHandlerCloud.test-seed#[BD1D5E7E34E09615]) [ ] o.a.s.c.SolrResourceLoader JNDI not configured for solr (NoInitialContextEx)
[junit4] 2> 1713372 INFO (TEST-TestSolrConfigHandlerCloud.test-seed#[BD1D5E7E34E09615]) [ ] o.a.s.c.SolrResourceLoader solr home defaulted to 'solr/' (could not find system property or JNDI)
[junit4] 2> 1713372 INFO (TEST-TestSolrConfigHandlerCloud.test-seed#[BD1D5E7E34E09615]) [ ] o.a.s.c.c.SolrZkClient Using default ZkCredentialsProvider
[junit4] 2> 1713373 INFO (TEST-TestSolrConfigHandlerCloud.test-seed#[BD1D5E7E34E09615]) [ ] o.a.s.c.c.ConnectionManager Waiting for client to connect to ZooKeeper
[junit4] 2> 1713374 INFO (zkCallback-1267-thread-1) [ ] o.a.s.c.c.ConnectionManager Watcher org.apache.solr.common.cloud.ConnectionManager@7930d546 name:ZooKeeperConnection Watcher:127.0.0.1:39206/solr got event WatchedEvent state:SyncConnected type:None path:null path:null type:None
[junit4] 2> 1713376 INFO (TEST-TestSolrConfigHandlerCloud.test-seed#[BD1D5E7E34E09615]) [ ] o.a.s.c.c.ConnectionManager Client is connected to ZooKeeper
[junit4] 2> 1713376 INFO (TEST-TestSolrConfigHandlerCloud.test-seed#[BD1D5E7E34E09615]) [ ] o.a.s.c.c.SolrZkClient Using default ZkACLProvider
[junit4] 2> 1713377 INFO (TEST-TestSolrConfigHandlerCloud.test-seed#[BD1D5E7E34E09615]) [ ] o.a.s.s.SolrDispatchFilter Loading solr.xml from SolrHome (not found in ZooKeeper)
[junit4] 2> 1713378 INFO (TEST-TestSolrConfigHandlerCloud.test-seed#[BD1D5E7E34E09615]) [ ] o.a.s.c.SolrXmlConfig Loading container configuration from /x1/jenkins/jenkins-slave/workspace/Lucene-Solr-Tests-5.x-Java7/solr/build/solr-core/test/J0/temp/solr.handler.TestSolrConfigHandlerCloud_BD1D5E7E34E09615-001/shard-1-001/solr.xml
[junit4] 2> 1713394 INFO (TEST-TestSolrConfigHandlerCloud.test-seed#[BD1D5E7E34E09615]) [ ] o.a.s.c.CorePropertiesLocator Config-defined core root directory: /x1/jenkins/jenkins-slave/workspace/Lucene-Solr-Tests-5.x-Java7/solr/build/solr-core/test/J0/../../../../../../../../../../x1/jenkins/jenkins-slave/workspace/Lucene-Solr-Tests-5.x-Java7/solr/build/solr-core/test/J0/temp/solr.handler.TestSolrConfigHandlerCloud_BD1D5E7E34E09615-001/shard-1-001/cores
[junit4] 2> 1713394 INFO (TEST-TestSolrConfigHandlerCloud.test-seed#[BD1D5E7E34E09615]) [ ] o.a.s.c.CoreContainer New CoreContainer 282467825
[junit4] 2> 1713394 INFO (TEST-TestSolrConfigHandlerCloud.test-seed#[BD1D5E7E34E09615]) [ ] o.a.s.c.CoreContainer Loading cores into CoreContainer [instanceDir=/x1/jenkins/jenkins-slave/workspace/Lucene-Solr-Tests-5.x-Java7/solr/build/solr-core/test/J0/temp/solr.handler.TestSolrConfigHandlerCloud_BD1D5E7E34E09615-001/shard-1-001]
[junit4] 2> 1713394 WARN (TEST-TestSolrConfigHandlerCloud.test-seed#[BD1D5E7E34E09615]) [ ] o.a.s.c.CoreContainer Couldn't add files from /x1/jenkins/jenkins-slave/workspace/Lucene-Solr-Tests-5.x-Java7/solr/build/solr-core/test/J0/temp/solr.handler.TestSolrConfigHandlerCloud_BD1D5E7E34E09615-001/shard-1-001/lib to classpath: /x1/jenkins/jenkins-slave/workspace/Lucene-Solr-Tests-5.x-Java7/solr/build/solr-core/test/J0/temp/solr.handler.TestSolrConfigHandlerCloud_BD1D5E7E34E09615-001/shard-1-001/lib
[junit4] 2> 1713395 INFO (TEST-TestSolrConfigHandlerCloud.test-seed#[BD1D5E7E34E09615]) [ ] o.a.s.h.c.HttpShardHandlerFactory created with socketTimeout : 90000,urlScheme : ,connTimeout : 15000,maxConnectionsPerHost : 20,maxConnections : 10000,corePoolSize : 0,maximumPoolSize : 2147483647,maxThreadIdleTime : 5,sizeOfQueue : -1,fairnessPolicy : false,useRetries : false,
[junit4] 2> 1713397 INFO (TEST-TestSolrConfigHandlerCloud.test-seed#[BD1D5E7E34E09615]) [ ] o.a.s.u.UpdateShardHandler Creating UpdateShardHandler HTTP client with params: socketTimeout=340000&connTimeout=45000&retry=true
[junit4] 2> 1713398 INFO (TEST-TestSolrConfigHandlerCloud.test-seed#[BD1D5E7E34E09615]) [ ] o.a.s.l.LogWatcher SLF4J impl is org.slf4j.impl.Log4jLoggerFactory
[junit4] 2> 1713399 INFO (TEST-TestSolrConfigHandlerCloud.test-seed#[BD1D5E7E34E09615]) [ ] o.a.s.l.LogWatcher Registering Log Listener [Log4j (org.slf4j.impl.Log4jLoggerFactory)]
[junit4] 2> 1713399 INFO (TEST-TestSolrConfigHandlerCloud.test-seed#[BD1D5E7E34E09615]) [ ] o.a.s.c.ZkContainer Zookeeper client=127.0.0.1:39206/solr
[junit4] 2> 1713399 INFO (TEST-TestSolrConfigHandlerCloud.test-seed#[BD1D5E7E34E09615]) [ ] o.a.s.c.ZkController zkHost includes chroot
[junit4] 2> 1713399 INFO (TEST-TestSolrConfigHandlerCloud.test-seed#[BD1D5E7E34E09615]) [ ] o.a.s.c.c.SolrZkClient Using default ZkCredentialsProvider
[junit4] 2> 1713399 INFO (TEST-TestSolrConfigHandlerCloud.test-seed#[BD1D5E7E34E09615]) [ ] o.a.s.c.c.ConnectionManager Waiting for client to connect to ZooKeeper
[junit4] 2> 1713401 INFO (zkCallback-1270-thread-1) [ ] o.a.s.c.c.ConnectionManager Watcher org.apache.solr.common.cloud.ConnectionManager@3999a521 name:ZooKeeperConnection Watcher:127.0.0.1:39206 got event WatchedEvent state:SyncConnected type:None path:null path:null type:None
[junit4] 2> 1713401 INFO (TEST-TestSolrConfigHandlerCloud.test-seed#[BD1D5E7E34E09615]) [ ] o.a.s.c.c.ConnectionManager Client is connected to ZooKeeper
[junit4] 2> 1713401 INFO (TEST-TestSolrConfigHandlerCloud.test-seed#[BD1D5E7E34E09615]) [ ] o.a.s.c.c.SolrZkClient Using default ZkACLProvider
[junit4] 2> 1713403 INFO (TEST-TestSolrConfigHandlerCloud.test-seed#[BD1D5E7E34E09615]) [n:127.0.0.1:32918_q_uxm%2Fkx ] o.a.s.c.c.ConnectionManager Waiting for client to connect to ZooKeeper
[junit4] 2> 1713404 INFO (zkCallback-1271-thread-1-processing-n:127.0.0.1:32918_q_uxm%2Fkx) [n:127.0.0.1:32918_q_uxm%2Fkx ] o.a.s.c.c.ConnectionManager Watcher org.apache.solr.common.cloud.ConnectionManager@79d0cbe0 name:ZooKeeperConnection Watcher:127.0.0.1:39206/solr got event WatchedEvent state:SyncConnected type:None path:null path:null type:None
[junit4] 2> 1713404 INFO (TEST-TestSolrConfigHandlerCloud.test-seed#[BD1D5E7E34E09615]) [n:127.0.0.1:32918_q_uxm%2Fkx ] o.a.s.c.c.ConnectionManager Client is connected to ZooKeeper
[junit4] 2> 1713407 INFO (zkCallback-1265-thread-1) [ ] o.a.s.c.c.ZkStateReader A cluster state change: [WatchedEvent state:SyncConnected type:NodeDataChanged path:/clusterstate.json], has occurred - updating... (live nodes size: [1])
[junit4] 2> 1713408 INFO (zkCallback-1263-thread-1-processing-n:127.0.0.1:34480_q_uxm%2Fkx) [n:127.0.0.1:34480_q_uxm%2Fkx ] o.a.s.c.c.ZkStateReader A cluster state change: [WatchedEvent state:SyncConnected type:NodeDataChanged path:/clusterstate.json], has occurred - updating... (live nodes size: [1])
[junit4] 2> 1713412 INFO (TEST-TestSolrConfigHandlerCloud.test-seed#[BD1D5E7E34E09615]) [n:127.0.0.1:32918_q_uxm%2Fkx ] o.a.s.c.c.ZkStateReader Updating cluster state from ZooKeeper...
[junit4] 2> 1714418 INFO (TEST-TestSolrConfigHandlerCloud.test-seed#[BD1D5E7E34E09615]) [n:127.0.0.1:32918_q_uxm%2Fkx ] o.a.s.c.ZkController Register node as live in ZooKeeper:/live_nodes/127.0.0.1:32918_q_uxm%2Fkx
[junit4] 2> 1714419 INFO (TEST-TestSolrConfigHandlerCloud.test-seed#[BD1D5E7E34E09615]) [n:127.0.0.1:32918_q_uxm%2Fkx ] o.a.s.c.c.SolrZkClient makePath: /live_nodes/127.0.0.1:32918_q_uxm%2Fkx
[junit4] 2> 1714420 INFO (zkCallback-1263-thread-1-processing-n:127.0.0.1:34480_q_uxm%2Fkx) [n:127.0.0.1:34480_q_uxm%2Fkx ] o.a.s.c.c.ZkStateReader A live node change: [WatchedEvent state:SyncConnected type:NodeChildrenChanged path:/live_nodes], has occurred - updating... (live nodes size: [1])
[junit4] 2> 1714420 INFO (zkCallback-1265-thread-1) [ ] o.a.s.c.c.ZkStateReader A live node change: [WatchedEvent state:SyncConnected type:NodeChildrenChanged path:/live_nodes], has occurred - updating... (live nodes size: [1])
[junit4] 2> 1714420 INFO (zkCallback-1271-thread-1-processing-n:127.0.0.1:32918_q_uxm%2Fkx) [n:127.0.0.1:32918_q_uxm%2Fkx ] o.a.s.c.c.ZkStateReader A live node change: [WatchedEvent state:SyncConnected type:NodeChildrenChanged path:/live_nodes], has occurred - updating... (live nodes size: [1])
[junit4] 2> 1714422 INFO (TEST-TestSolrConfigHandlerCloud.test-seed#[BD1D5E7E34E09615]) [n:127.0.0.1:32918_q_uxm%2Fkx ] o.a.s.c.Overseer Overseer (id=null) closing
[junit4] 2> 1714423 INFO (TEST-TestSolrConfigHandlerCloud.test-seed#[BD1D5E7E34E09615]) [n:127.0.0.1:32918_q_uxm%2Fkx ] o.a.s.c.LeaderElector Joined leadership election with path: /overseer_elect/election/95349488939368458-127.0.0.1:32918_q_uxm%2Fkx-n_0000000001
[junit4] 2> 1714424 INFO (TEST-TestSolrConfigHandlerCloud.test-seed#[BD1D5E7E34E09615]) [n:127.0.0.1:32918_q_uxm%2Fkx ] o.a.s.c.LeaderElector Watching path /overseer_elect/election/95349488939368453-127.0.0.1:34480_q_uxm%2Fkx-n_0000000000 to know if I could be the leader
[junit4] 2> 1714436 INFO (TEST-TestSolrConfigHandlerCloud.test-seed#[BD1D5E7E34E09615]) [n:127.0.0.1:32918_q_uxm%2Fkx ] o.a.s.c.CoreContainer Security conf doesn't exist. Skipping setup for authorization module.
[junit4] 2> 1714436 INFO (TEST-TestSolrConfigHandlerCloud.test-seed#[BD1D5E7E34E09615]) [n:127.0.0.1:32918_q_uxm%2Fkx ] o.a.s.c.CoreContainer No authentication plugin used.
[junit4] 2> 1714437 INFO (TEST-TestSolrConfigHandlerCloud.test-seed#[BD1D5E7E34E09615]) [n:127.0.0.1:32918_q_uxm%2Fkx ] o.a.s.c.CorePropertiesLocator Looking for core definitions underneath /x1/jenkins/jenkins-slave/workspace/Lucene-Solr-Tests-5.x-Java7/solr/build/solr-core/test/J0/../../../../../../../../../../x1/jenkins/jenkins-slave/workspace/Lucene-Solr-Tests-5.x-Java7/solr/build/solr-core/test/J0/temp/solr.handler.TestSolrConfigHandlerCloud_BD1D5E7E34E09615-001/shard-1-001/cores
[junit4] 2> 1714438 INFO (TEST-TestSolrConfigHandlerCloud.test-seed#[BD1D5E7E34E09615]) [n:127.0.0.1:32918_q_uxm%2Fkx ] o.a.s.c.CoreDescriptor Created CoreDescriptor: {transient=false, name=collection1, config=solrconfig.xml, schema=schema.xml, shard=, coreNodeName=, dataDir=data/, loadOnStartup=true, collection=collection1, configSetProperties=configsetprops.json}
[junit4] 2> 1714438 INFO (TEST-TestSolrConfigHandlerCloud.test-seed#[BD1D5E7E34E09615]) [n:127.0.0.1:32918_q_uxm%2Fkx ] o.a.s.c.CorePropertiesLocator Found core collection1 in /x1/jenkins/jenkins-slave/workspace/Lucene-Solr-Tests-5.x-Java7/solr/build/solr-core/test/J0/../../../../../../../../../../x1/jenkins/jenkins-slave/workspace/Lucene-Solr-Tests-5.x-Java7/solr/build/solr-core/test/J0/temp/solr.handler.TestSolrConfigHandlerCloud_BD1D5E7E34E09615-001/shard-1-001/cores/collection1
[junit4] 2> 1714438 INFO (TEST-TestSolrConfigHandlerCloud.test-seed#[BD1D5E7E34E09615]) [n:127.0.0.1:32918_q_uxm%2Fkx ] o.a.s.c.CorePropertiesLocator Found 1 core definitions
[junit4] 2> 1714439 INFO (TEST-TestSolrConfigHandlerCloud.test-seed#[BD1D5E7E34E09615]) [n:127.0.0.1:32918_q_uxm%2Fkx ] o.a.s.s.SolrDispatchFilter user.dir=/x1/jenkins/jenkins-slave/workspace/Lucene-Solr-Tests-5.x-Java7/solr/build/solr-core/test/J0
[junit4] 2> 1714439 INFO (TEST-TestSolrConfigHandlerCloud.test-seed#[BD1D5E7E34E09615]) [n:127.0.0.1:32918_q_uxm%2Fkx ] o.a.s.s.SolrDispatchFilter SolrDispatchFilter.init() done
[junit4] 2> 1714440 INFO (coreLoadExecutor-4606-thread-1-processing-n:127.0.0.1:32918_q_uxm%2Fkx) [n:127.0.0.1:32918_q_uxm%2Fkx c:collection1 x:collection1] o.a.s.c.ZkController publishing state=down
[junit4] 2> 1714440 INFO (coreLoadExecutor-4606-thread-1-processing-n:127.0.0.1:32918_q_uxm%2Fkx) [n:127.0.0.1:32918_q_uxm%2Fkx c:collection1 x:collection1] o.a.s.c.ZkController numShards not found on descriptor - reading it from system property
[junit4] 2> 1714442 INFO (coreLoadExecutor-4606-thread-1-processing-n:127.0.0.1:32918_q_uxm%2Fkx) [n:127.0.0.1:32918_q_uxm%2Fkx c:collection1 x:collection1] o.a.s.c.ZkController Registering watch for collection collection1
[junit4] 2> 1714442 INFO (coreLoadExecutor-4606-thread-1-processing-n:127.0.0.1:32918_q_uxm%2Fkx) [n:127.0.0.1:32918_q_uxm%2Fkx c:collection1 x:collection1] o.a.s.c.c.ZkStateReader addZkWatch [collection1]
[junit4] 2> 1714442 INFO (OverseerStateUpdate-95349488939368453-127.0.0.1:34480_q_uxm%2Fkx-n_0000000000) [n:127.0.0.1:34480_q_uxm%2Fkx ] o.a.s.c.Overseer processMessage: queueSize: 1, message = {
[junit4] 2> "collection":"collection1",
[junit4] 2> "node_name":"127.0.0.1:32918_q_uxm%2Fkx",
[junit4] 2> "shard":null,
[junit4] 2> "numShards":"2",
[junit4] 2> "roles":null,
[junit4] 2> "state":"down",
[junit4] 2> "operation":"state",
[junit4] 2> "base_url":"https://127.0.0.1:32918/q_uxm/kx",
[junit4] 2> "core":"collection1"} current state version: 3
[junit4] 2> 1714443 INFO (coreLoadExecutor-4606-thread-1-processing-n:127.0.0.1:32918_q_uxm%2Fkx) [n:127.0.0.1:32918_q_uxm%2Fkx c:collection1 x:collection1] o.a.s.c.c.ZkStateReader Add data for [collection1] ver [0]
[junit4] 2> 1714443 INFO (coreLoadExecutor-4606-thread-1-processing-n:127.0.0.1:32918_q_uxm%2Fkx) [n:127.0.0.1:32918_q_uxm%2Fkx c:collection1 x:collection1] o.a.s.c.ZkController look for our core node name
[junit4] 2> 1714443 INFO (OverseerStateUpdate-95349488939368453-127.0.0.1:34480_q_uxm%2Fkx-n_0000000000) [n:127.0.0.1:34480_q_uxm%2Fkx ] o.a.s.c.o.ReplicaMutator Update state numShards=2 message={
[junit4] 2> "collection":"collection1",
[junit4] 2> "node_name":"127.0.0.1:32918_q_uxm%2Fkx",
[junit4] 2> "shard":null,
[junit4] 2> "numShards":"2",
[junit4] 2> "roles":null,
[junit4] 2> "state":"down",
[junit4] 2> "operation":"state",
[junit4] 2> "base_url":"https://127.0.0.1:32918/q_uxm/kx",
[junit4] 2> "core":"collection1"}
[junit4] 2> 1714444 INFO (OverseerStateUpdate-95349488939368453-127.0.0.1:34480_q_uxm%2Fkx-n_0000000000) [n:127.0.0.1:34480_q_uxm%2Fkx ] o.a.s.c.o.ReplicaMutator Collection already exists with numShards=2
[junit4] 2> 1714444 INFO (OverseerStateUpdate-95349488939368453-127.0.0.1:34480_q_uxm%2Fkx-n_0000000000) [n:127.0.0.1:34480_q_uxm%2Fkx ] o.a.s.c.o.ReplicaMutator Assigning new node to shard shard=shard1
[junit4] 2> 1714546 INFO (OverseerStateUpdate-95349488939368453-127.0.0.1:34480_q_uxm%2Fkx-n_0000000000) [n:127.0.0.1:34480_q_uxm%2Fkx ] o.a.s.c.o.ZkStateWriter going to update_collection /collections/collection1/state.json version: 0
[junit4] 2> 1714547 INFO (zkCallback-1271-thread-1-processing-n:127.0.0.1:32918_q_uxm%2Fkx) [n:127.0.0.1:32918_q_uxm%2Fkx ] o.a.s.c.c.ZkStateReader A cluster state change: [WatchedEvent state:SyncConnected type:NodeDataChanged path:/collections/collection1/state.json] for collection [collection1] has occurred - updating... (live nodes size: [2])
[junit4] 2> 1714547 INFO (zkCallback-1271-thread-1-processing-n:127.0.0.1:32918_q_uxm%2Fkx) [n:127.0.0.1:32918_q_uxm%2Fkx ] o.a.s.c.c.ZkStateReader Updating data for [collection1] from [0] to [1]
[junit4] 2> 1715443 INFO (coreLoadExecutor-4606-thread-1-processing-n:127.0.0.1:32918_q_uxm%2Fkx) [n:127.0.0.1:32918_q_uxm%2Fkx c:collection1 x:collection1] o.a.s.c.ZkController waiting to find shard id in clusterstate for collection1
[junit4] 2> 1715444 INFO (coreLoadExecutor-4606-thread-1-processing-n:127.0.0.1:32918_q_uxm%2Fkx) [n:127.0.0.1:32918_q_uxm%2Fkx c:collection1 x:collection1] o.a.s.c.ZkController Check for collection zkNode:collection1
[junit4] 2> 1715444 INFO (coreLoadExecutor-4606-thread-1-processing-n:127.0.0.1:32918_q_uxm%2Fkx) [n:127.0.0.1:32918_q_uxm%2Fkx c:collection1 x:collection1] o.a.s.c.ZkController Collection zkNode exists
[junit4] 2> 1715444 INFO (coreLoadExecutor-4606-thread-1-processing-n:127.0.0.1:32918_q_uxm%2Fkx) [n:127.0.0.1:32918_q_uxm%2Fkx c:collection1 x:collection1] o.a.s.c.c.ZkStateReader Load collection config from: [/collections/collection1]
[junit4] 2> 1715445 INFO (coreLoadExecutor-4606-thread-1-processing-n:127.0.0.1:32918_q_uxm%2Fkx) [n:127.0.0.1:32918_q_uxm%2Fkx c:collection1 x:collection1] o.a.s.c.c.ZkStateReader path=[/collections/collection1] [configName]=[conf1] specified config exists in ZooKeeper
[junit4] 2> 1715445 INFO (coreLoadExecutor-4606-thread-1-processing-n:127.0.0.1:32918_q_uxm%2Fkx) [n:127.0.0.1:32918_q_uxm%2Fkx c:collection1 x:collection1] o.a.s.c.SolrResourceLoader new SolrResourceLoader for directory: '/x1/jenkins/jenkins-slave/workspace/Lucene-Solr-Tests-5.x-Java7/solr/build/solr-core/test/J0/temp/solr.handler.TestSolrConfigHandlerCloud_BD1D5E7E34E09615-001/shard-1-001/cores/collection1'
[junit4] 2> 1715445 INFO (coreLoadExecutor-4606-thread-1-processing-n:127.0.0.1:32918_q_uxm%2Fkx) [n:127.0.0.1:32918_q_uxm%2Fkx c:collection1 x:collection1] o.a.s.c.SolrResourceLoader JNDI not configured for solr (NoInitialContextEx)
[junit4] 2> 1715445 INFO (coreLoadExecutor-4606-thread-1-processing-n:127.0.0.1:32918_q_uxm%2Fkx) [n:127.0.0.1:32918_q_uxm%2Fkx c:collection1 x:collection1] o.a.s.c.SolrResourceLoader solr home defaulted to 'solr/' (could not find system property or JNDI)
[junit4] 2> 1715447 INFO (coreLoadExecutor-4606-thread-1-processing-n:127.0.0.1:32918_q_uxm%2Fkx) [n:127.0.0.1:32918_q_uxm%2Fkx c:collection1 x:collection1] o.a.s.c.Config loaded config solrconfig.xml with version 0
[junit4] 2> 1715453 INFO (coreLoadExecutor-4606-thread-1-processing-n:127.0.0.1:32918_q_uxm%2Fkx) [n:127.0.0.1:32918_q_uxm%2Fkx c:collection1 x:collection1] o.a.s.c.SolrConfig current version of requestparams : -1
[junit4] 2> 1715466 INFO (coreLoadExecutor-4606-thread-1-processing-n:127.0.0.1:32918_q_uxm%2Fkx) [n:127.0.0.1:32918_q_uxm%2Fkx c:collection1 x:collection1] o.a.s.c.SolrConfig Using Lucene MatchVersion: 5.5.0
[junit4] 2> 1715495 INFO (coreLoadExecutor-4606-thread-1-processing-n:127.0.0.1:32918_q_uxm%2Fkx) [n:127.0.0.1:32918_q_uxm%2Fkx c:collection1 x:collection1] o.a.s.c.SolrConfig Loaded SolrConfig: solrconfig.xml
[junit4] 2> 1715503 INFO (coreLoadExecutor-4606-thread-1-processing-n:127.0.0.1:32918_q_uxm%2Fkx) [n:127.0.0.1:32918_q_uxm%2Fkx c:collection1 x:collection1] o.a.s.s.IndexSchema [collection1] Schema name=test
[junit4] 2> 1715755 INFO (coreLoadExecutor-4606-thread-1-processing-n:127.0.0.1:32918_q_uxm%2Fkx) [n:127.0.0.1:32918_q_uxm%2Fkx c:collection1 x:collection1] o.a.s.s.OpenExchangeRatesOrgProvider Initialized with rates=open-exchange-rates.json, refreshInterval=1440.
[junit4] 2> 1715763 INFO (coreLoadExecutor-4606-thread-1-processing-n:127.0.0.1:32918_q_uxm%2Fkx) [n:127.0.0.1:32918_q_uxm%2Fkx c:collection1 x:collection1] o.a.s.s.IndexSchema default search field in schema is text
[junit4] 2> 1715764 INFO (coreLoadExecutor-4606-thread-1-processing-n:127.0.0.1:32918_q_uxm%2Fkx) [n:127.0.0.1:32918_q_uxm%2Fkx c:collection1 x:collection1] o.a.s.s.IndexSchema unique key field: id
[junit4] 2> 1715774 INFO (coreLoadExecutor-4606-thread-1-processing-n:127.0.0.1:32918_q_uxm%2Fkx) [n:127.0.0.1:32918_q_uxm%2Fkx c:collection1 x:collection1] o.a.s.s.FileExchangeRateProvider Reloading exchange rates from file currency.xml
[junit4] 2> 1715777 INFO (coreLoadExecutor-4606-thread-1-processing-n:127.0.0.1:32918_q_uxm%2Fkx) [n:127.0.0.1:32918_q_uxm%2Fkx c:collection1 x:collection1] o.a.s.s.FileExchangeRateProvider Reloading exchange rates from file currency.xml
[junit4] 2> 1715780 INFO (coreLoadExecutor-4606-thread-1-processing-n:127.0.0.1:32918_q_uxm%2Fkx) [n:127.0.0.1:32918_q_uxm%2Fkx c:collection1 x:collection1] o.a.s.s.OpenExchangeRatesOrgProvider Reloading exchange rates from open-exchange-rates.json
[junit4] 2> 1715781 INFO (coreLoadExecutor-4606-thread-1-processing-n:127.0.0.1:32918_q_uxm%2Fkx) [n:127.0.0.1:32918_q_uxm%2Fkx c:collection1 x:collection1] o.a.s.s.OpenExchangeRatesOrgProvider Reloading exchange rates from open-exchange-rates.json
[junit4] 2> 1715782 INFO (coreLoadExecutor-4606-thread-1-processing-n:127.0.0.1:32918_q_uxm%2Fkx) [n:127.0.0.1:32918_q_uxm%2Fkx c:collection1 x:collection1] o.a.s.c.ConfigSetProperties Did not find ConfigSet properties, assuming default properties: Can't find resource 'configsetprops.json' in classpath or '/configs/conf1', cwd=/x1/jenkins/jenkins-slave/workspace/Lucene-Solr-Tests-5.x-Java7/solr/build/solr-core/test/J0
[junit4] 2> 1715783 INFO (coreLoadExecutor-4606-thread-1-processing-n:127.0.0.1:32918_q_uxm%2Fkx) [n:127.0.0.1:32918_q_uxm%2Fkx c:collection1 x:collection1] o.a.s.c.CoreContainer Creating SolrCore 'collection1' using configuration from collection collection1
[junit4] 2> 1715783 INFO (coreLoadExecutor-4606-thread-1-processing-n:127.0.0.1:32918_q_uxm%2Fkx) [n:127.0.0.1:32918_q_uxm%2Fkx c:collection1 s:shard1 r:core_node1 x:collection1] o.a.s.c.SolrCore org.apache.solr.core.MockDirectoryFactory
[junit4] 2> 1715783 INFO (coreLoadExecutor-4606-thread-1-processing-n:127.0.0.1:32918_q_uxm%2Fkx) [n:127.0.0.1:32918_q_uxm%2Fkx c:collection1 s:shard1 r:core_node1 x:collection1] o.a.s.c.SolrCore [[collection1] ] Opening new SolrCore at [/x1/jenkins/jenkins-slave/workspace/Lucene-Solr-Tests-5.x-Java7/solr/build/solr-core/test/J0/temp/solr.handler.TestSolrConfigHandlerCloud_BD1D5E7E34E09615-001/shard-1-001/cores/collection1], dataDir=[/x1/jenkins/jenkins-slave/workspace/Lucene-Solr-Tests-5.x-Java7/solr/build/solr-core/test/J0/../../../../../../../../../../x1/jenkins/jenkins-slave/workspace/Lucene-Solr-Tests-5.x-Java7/solr/build/solr-core/test/J0/temp/solr.handler.Tes
[...truncated too long message...]
there.
[junit4] 2> 1781612 WARN (Thread-7169) [n:127.0.0.1:54781_q_uxm%2Fkx ] o.a.s.c.ZkController listener throws error
[junit4] 2> org.apache.solr.common.SolrException: Unable to reload core [collection1]
[junit4] 2> at org.apache.solr.core.CoreContainer.reload(CoreContainer.java:922)
[junit4] 2> at org.apache.solr.core.SolrCore$11.run(SolrCore.java:2603)
[junit4] 2> at org.apache.solr.cloud.ZkController$5.run(ZkController.java:2448)
[junit4] 2> Caused by: org.apache.solr.common.SolrException: Could not load conf for core collection1: Can't load schema schema.xml: Plugin Initializing failure for [schema.xml] fieldType
[junit4] 2> at org.apache.solr.core.ConfigSetService.getConfig(ConfigSetService.java:84)
[junit4] 2> at org.apache.solr.core.CoreContainer.reload(CoreContainer.java:915)
[junit4] 2> ... 2 more
[junit4] 2> Caused by: org.apache.solr.common.SolrException: Can't load schema schema.xml: Plugin Initializing failure for [schema.xml] fieldType
[junit4] 2> at org.apache.solr.schema.IndexSchema.readSchema(IndexSchema.java:577)
[junit4] 2> at org.apache.solr.schema.IndexSchema.<init>(IndexSchema.java:159)
[junit4] 2> at org.apache.solr.schema.IndexSchemaFactory.create(IndexSchemaFactory.java:56)
[junit4] 2> at org.apache.solr.schema.IndexSchemaFactory.buildIndexSchema(IndexSchemaFactory.java:70)
[junit4] 2> at org.apache.solr.core.ConfigSetService.createIndexSchema(ConfigSetService.java:108)
[junit4] 2> at org.apache.solr.core.ConfigSetService.getConfig(ConfigSetService.java:79)
[junit4] 2> ... 3 more
[junit4] 2> Caused by: org.apache.solr.common.SolrException: Plugin Initializing failure for [schema.xml] fieldType
[junit4] 2> at org.apache.solr.util.plugin.AbstractPluginLoader.load(AbstractPluginLoader.java:194)
[junit4] 2> at org.apache.solr.schema.IndexSchema.readSchema(IndexSchema.java:470)
[junit4] 2> ... 8 more
[junit4] 2> Caused by: org.apache.solr.common.SolrException: Error while opening enums config.
[junit4] 2> at org.apache.solr.schema.EnumField.init(EnumField.java:142)
[junit4] 2> at org.apache.solr.schema.FieldType.setArgs(FieldType.java:174)
[junit4] 2> at org.apache.solr.schema.FieldTypePluginLoader.init(FieldTypePluginLoader.java:150)
[junit4] 2> at org.apache.solr.schema.FieldTypePluginLoader.init(FieldTypePluginLoader.java:53)
[junit4] 2> at org.apache.solr.util.plugin.AbstractPluginLoader.load(AbstractPluginLoader.java:191)
[junit4] 2> ... 9 more
[junit4] 2> Caused by: java.io.IOException: Error opening /configs/conf1/enumsConfig.xml
[junit4] 2> at org.apache.solr.cloud.ZkSolrResourceLoader.openResource(ZkSolrResourceLoader.java:92)
[junit4] 2> at org.apache.solr.schema.EnumField.init(EnumField.java:100)
[junit4] 2> ... 13 more
[junit4] 2> Caused by: org.apache.zookeeper.KeeperException$SessionExpiredException: KeeperErrorCode = Session expired for /configs/conf1/enumsConfig.xml
[junit4] 2> at org.apache.zookeeper.KeeperException.create(KeeperException.java:127)
[junit4] 2> at org.apache.zookeeper.KeeperException.create(KeeperException.java:51)
[junit4] 2> at org.apache.zookeeper.ZooKeeper.exists(ZooKeeper.java:1045)
[junit4] 2> at org.apache.solr.common.cloud.SolrZkClient$5.execute(SolrZkClient.java:311)
[junit4] 2> at org.apache.solr.common.cloud.SolrZkClient$5.execute(SolrZkClient.java:308)
[junit4] 2> at org.apache.solr.common.cloud.ZkCmdExecutor.retryOperation(ZkCmdExecutor.java:60)
[junit4] 2> at org.apache.solr.common.cloud.SolrZkClient.exists(SolrZkClient.java:308)
[junit4] 2> at org.apache.solr.cloud.ZkController.pathExists(ZkController.java:837)
[junit4] 2> at org.apache.solr.cloud.ZkSolrResourceLoader.openResource(ZkSolrResourceLoader.java:86)
[junit4] 2> ... 14 more
[junit4] 2> NOTE: test params are: codec=Asserting(Lucene54): {}, docValues:{}, sim=DefaultSimilarity, locale=en-CA, timezone=SST
[junit4] 2> NOTE: Linux 3.13.0-52-generic amd64/Oracle Corporation 1.7.0_80 (64-bit)/cpus=4,threads=1,free=131084944,total=532152320
[junit4] 2> NOTE: All tests run in this JVM: [HLLUtilTest, DistributedQueryComponentCustomSortTest, SmileWriterTest, TestExactSharedStatsCache, TestManagedSchemaFieldTypeResource, DocumentAnalysisRequestHandlerTest, TestRequestStatusCollectionAPI, PeerSyncTest, SOLR749Test, BadCopyFieldTest, TestMergePolicyConfig, DistribDocExpirationUpdateProcessorTest, AlternateDirectoryTest, TestNRTOpen, CoreAdminRequestStatusTest, AddBlockUpdateTest, TestArbitraryIndexDir, ConcurrentDeleteAndCreateCollectionTest, HdfsChaosMonkeySafeLeaderTest, AsyncCallRequestStatusResponseTest, TestReplicationHandlerBackup, ConnectionReuseTest, CacheHeaderTest, HighlighterMaxOffsetTest, RemoteQueryErrorTest, TestOrdValues, TestAnalyzedSuggestions, TestFaceting, TestComponentsName, ExplicitHLLTest, CopyFieldTest, HdfsSyncSliceTest, TestRandomDVFaceting, ZkNodePropsTest, TestXmlQParser, SyncSliceTest, TestSchemaManager, DocValuesMissingTest, DistributedVersionInfoTest, LeaderElectionIntegrationTest, RAMDirectoryFactoryTest, TestClusterStateMutator, ActionThrottleTest, TestRawTransformer, BufferStoreTest, TestConfigSetProperties, CloneFieldUpdateProcessorFactoryTest, QueryResultKeyTest, TestStressLucene, TestDefaultSearchFieldResource, TestConfigSetsAPIZkFailure, HdfsRecoverLeaseTest, BlockJoinFacetDistribTest, PreAnalyzedFieldTest, TestIBSimilarityFactory, TestRTimerTree, ResourceLoaderTest, BasicDistributedZkTest, TestCSVLoader, TestRebalanceLeaders, TestFoldingMultitermQuery, TestDistributedSearch, SolrRequestParserTest, ExternalFileFieldSortTest, TestSolr4Spatial, XsltUpdateRequestHandlerTest, TestDocSet, TestPseudoReturnFields, TestPivotHelperCode, TestRandomCollapseQParserPlugin, PingRequestHandlerTest, OverseerStatusTest, CleanupOldIndexTest, TestJoin, TestComplexPhraseQParserPlugin, BasicZkTest, CustomCollectionTest, TestAtomicUpdateErrorCases, TestLMDirichletSimilarityFactory, IndexSchemaRuntimeFieldTest, TestChildDocTransformer, TestCollectionAPI, TestConfig, QueryElevationComponentTest, DistributedSpellCheckComponentTest, SignatureUpdateProcessorFactoryTest, ReturnFieldsTest, TestImplicitCoreProperties, TestRecoveryHdfs, DateFieldTest, MigrateRouteKeyTest, TestRemoteStreaming, CurrencyFieldOpenExchangeTest, ParsingFieldUpdateProcessorsTest, TestReplicationHandler, StatsComponentTest, SpellCheckCollatorTest, SpatialFilterTest, NoCacheHeaderTest, SolrCoreCheckLockOnStartupTest, TestSurroundQueryParser, StandardRequestHandlerTest, TestOmitPositions, TestValueSourceCache, TestIndexingPerformance, RequiredFieldsTest, FastVectorHighlighterTest, IndexSchemaTest, TestCSVResponseWriter, TestPartialUpdateDeduplication, UpdateParamsTest, TestQuerySenderNoQuery, SolrIndexConfigTest, TestBinaryField, TestSearchPerf, MinimalSchemaTest, OutputWriterTest, DirectSolrConnectionTest, TestLuceneMatchVersion, TestPhraseSuggestions, TestCodecSupport, SynonymTokenizerTest, TestXIncludeConfig, EchoParamsTest, TestLMJelinekMercerSimilarityFactory, TestBM25SimilarityFactory, TestFastOutputStream, URLClassifyProcessorTest, DateMathParserTest, TestSystemIdResolver, PrimUtilsTest, TestSuggestSpellingConverter, DOMUtilTest, ClusterStateTest, TestSolrJ, TestLRUCache, TestDocumentBuilder, SliceStateTest, SystemInfoHandlerTest, UUIDFieldTest, DistributedMLTComponentTest, TestRTGBase, CursorPagingTest, DistributedIntervalFacetingTest, CollectionsAPIAsyncDistributedZkTest, LeaderFailoverAfterPartitionTest, ShardSplitTest, TestLeaderInitiatedRecoveryThread, HdfsBasicDistributedZk2Test, HdfsBasicDistributedZkTest, HdfsChaosMonkeyNothingIsSafeTest, HdfsNNFailoverTest, TestConfigSets, TestInitParams, TestShardHandlerFactory, TestSolrConfigHandler, TestSolrConfigHandlerCloud]
[junit4] 2> NOTE: reproduce with: ant test -Dtestcase=TestSolrConfigHandlerCloud -Dtests.seed=BD1D5E7E34E09615 -Dtests.multiplier=2 -Dtests.slow=true -Dtests.locale=en-CA -Dtests.timezone=SST -Dtests.asserts=true -Dtests.file.encoding=ISO-8859-1
[junit4] ERROR 0.00s J0 | TestSolrConfigHandlerCloud (suite) <<<
[junit4] > Throwable #1: java.lang.AssertionError: ObjectTracker found 2 object(s) that were not released!!! [MockDirectoryWrapper, MockDirectoryWrapper]
[junit4] > at __randomizedtesting.SeedInfo.seed([BD1D5E7E34E09615]:0)
[junit4] > at org.apache.solr.SolrTestCaseJ4.afterClass(SolrTestCaseJ4.java:228)
[junit4] > at java.lang.Thread.run(Thread.java:745)
[junit4] Completed [477/566 (1!)] on J0 in 70.50s, 1 test, 1 failure <<< FAILURES!
[...truncated 290 lines...]
BUILD FAILED
/x1/jenkins/jenkins-slave/workspace/Lucene-Solr-Tests-5.x-Java7/build.xml:750: The following error occurred while executing this line:
/x1/jenkins/jenkins-slave/workspace/Lucene-Solr-Tests-5.x-Java7/build.xml:694: The following error occurred while executing this line:
/x1/jenkins/jenkins-slave/workspace/Lucene-Solr-Tests-5.x-Java7/build.xml:59: The following error occurred while executing this line:
/x1/jenkins/jenkins-slave/workspace/Lucene-Solr-Tests-5.x-Java7/solr/build.xml:233: The following error occurred while executing this line:
/x1/jenkins/jenkins-slave/workspace/Lucene-Solr-Tests-5.x-Java7/solr/common-build.xml:534: The following error occurred while executing this line:
/x1/jenkins/jenkins-slave/workspace/Lucene-Solr-Tests-5.x-Java7/lucene/common-build.xml:1477: The following error occurred while executing this line:
/x1/jenkins/jenkins-slave/workspace/Lucene-Solr-Tests-5.x-Java7/lucene/common-build.xml:1033: There were test failures: 566 suites (7 ignored), 2268 tests, 1 suite-level error, 56 ignored (41 assumptions) [seed: BD1D5E7E34E09615]
Total time: 61 minutes 36 seconds
Build step 'Invoke Ant' marked build as failure
Archiving artifacts
Recording test results
Email was triggered for: Failure - Any
Sending email for trigger: Failure - Any
[JENKINS] Lucene-Solr-Tests-5.x-Java7 - Build # 3957 - Still
Failing
Posted by Apache Jenkins Server <je...@builds.apache.org>.
Build: https://builds.apache.org/job/Lucene-Solr-Tests-5.x-Java7/3957/
1 tests failed.
FAILED: org.apache.solr.cloud.CollectionsAPIDistributedZkTest.test
Error Message:
Stack Trace:
java.lang.AssertionError
at __randomizedtesting.SeedInfo.seed([AD480521F8594B03:251C3AFB56A526FB]:0)
at org.junit.Assert.fail(Assert.java:92)
at org.junit.Assert.assertTrue(Assert.java:43)
at org.junit.Assert.assertNull(Assert.java:551)
at org.junit.Assert.assertNull(Assert.java:562)
at org.apache.solr.cloud.CollectionsAPIDistributedZkTest.testNoConfigSetExist(CollectionsAPIDistributedZkTest.java:511)
at org.apache.solr.cloud.CollectionsAPIDistributedZkTest.test(CollectionsAPIDistributedZkTest.java:158)
at sun.reflect.NativeMethodAccessorImpl.invoke0(Native Method)
at sun.reflect.NativeMethodAccessorImpl.invoke(NativeMethodAccessorImpl.java:57)
at sun.reflect.DelegatingMethodAccessorImpl.invoke(DelegatingMethodAccessorImpl.java:43)
at java.lang.reflect.Method.invoke(Method.java:606)
at com.carrotsearch.randomizedtesting.RandomizedRunner.invoke(RandomizedRunner.java:1764)
at com.carrotsearch.randomizedtesting.RandomizedRunner$8.evaluate(RandomizedRunner.java:871)
at com.carrotsearch.randomizedtesting.RandomizedRunner$9.evaluate(RandomizedRunner.java:907)
at com.carrotsearch.randomizedtesting.RandomizedRunner$10.evaluate(RandomizedRunner.java:921)
at org.apache.solr.BaseDistributedSearchTestCase$ShardsRepeatRule$ShardsFixedStatement.callStatement(BaseDistributedSearchTestCase.java:964)
at org.apache.solr.BaseDistributedSearchTestCase$ShardsRepeatRule$ShardsStatement.evaluate(BaseDistributedSearchTestCase.java:939)
at com.carrotsearch.randomizedtesting.rules.SystemPropertiesRestoreRule$1.evaluate(SystemPropertiesRestoreRule.java:57)
at org.apache.lucene.util.TestRuleSetupTeardownChained$1.evaluate(TestRuleSetupTeardownChained.java:49)
at org.apache.lucene.util.AbstractBeforeAfterRule$1.evaluate(AbstractBeforeAfterRule.java:45)
at org.apache.lucene.util.TestRuleThreadAndTestName$1.evaluate(TestRuleThreadAndTestName.java:48)
at org.apache.lucene.util.TestRuleIgnoreAfterMaxFailures$1.evaluate(TestRuleIgnoreAfterMaxFailures.java:64)
at org.apache.lucene.util.TestRuleMarkFailure$1.evaluate(TestRuleMarkFailure.java:47)
at com.carrotsearch.randomizedtesting.rules.StatementAdapter.evaluate(StatementAdapter.java:36)
at com.carrotsearch.randomizedtesting.ThreadLeakControl$StatementRunner.run(ThreadLeakControl.java:367)
at com.carrotsearch.randomizedtesting.ThreadLeakControl.forkTimeoutingTask(ThreadLeakControl.java:809)
at com.carrotsearch.randomizedtesting.ThreadLeakControl$3.evaluate(ThreadLeakControl.java:460)
at com.carrotsearch.randomizedtesting.RandomizedRunner.runSingleTest(RandomizedRunner.java:880)
at com.carrotsearch.randomizedtesting.RandomizedRunner$5.evaluate(RandomizedRunner.java:781)
at com.carrotsearch.randomizedtesting.RandomizedRunner$6.evaluate(RandomizedRunner.java:816)
at com.carrotsearch.randomizedtesting.RandomizedRunner$7.evaluate(RandomizedRunner.java:827)
at com.carrotsearch.randomizedtesting.rules.StatementAdapter.evaluate(StatementAdapter.java:36)
at com.carrotsearch.randomizedtesting.rules.SystemPropertiesRestoreRule$1.evaluate(SystemPropertiesRestoreRule.java:57)
at org.apache.lucene.util.AbstractBeforeAfterRule$1.evaluate(AbstractBeforeAfterRule.java:45)
at com.carrotsearch.randomizedtesting.rules.StatementAdapter.evaluate(StatementAdapter.java:36)
at org.apache.lucene.util.TestRuleStoreClassName$1.evaluate(TestRuleStoreClassName.java:41)
at com.carrotsearch.randomizedtesting.rules.NoShadowingOrOverridesOnMethodsRule$1.evaluate(NoShadowingOrOverridesOnMethodsRule.java:40)
at com.carrotsearch.randomizedtesting.rules.NoShadowingOrOverridesOnMethodsRule$1.evaluate(NoShadowingOrOverridesOnMethodsRule.java:40)
at com.carrotsearch.randomizedtesting.rules.StatementAdapter.evaluate(StatementAdapter.java:36)
at com.carrotsearch.randomizedtesting.rules.StatementAdapter.evaluate(StatementAdapter.java:36)
at com.carrotsearch.randomizedtesting.rules.StatementAdapter.evaluate(StatementAdapter.java:36)
at org.apache.lucene.util.TestRuleAssertionsRequired$1.evaluate(TestRuleAssertionsRequired.java:53)
at org.apache.lucene.util.TestRuleMarkFailure$1.evaluate(TestRuleMarkFailure.java:47)
at org.apache.lucene.util.TestRuleIgnoreAfterMaxFailures$1.evaluate(TestRuleIgnoreAfterMaxFailures.java:64)
at org.apache.lucene.util.TestRuleIgnoreTestSuites$1.evaluate(TestRuleIgnoreTestSuites.java:54)
at com.carrotsearch.randomizedtesting.rules.StatementAdapter.evaluate(StatementAdapter.java:36)
at com.carrotsearch.randomizedtesting.ThreadLeakControl$StatementRunner.run(ThreadLeakControl.java:367)
at java.lang.Thread.run(Thread.java:745)
Build Log:
[...truncated 11437 lines...]
[junit4] Suite: org.apache.solr.cloud.CollectionsAPIDistributedZkTest
[junit4] 2> Creating dataDir: /x1/jenkins/jenkins-slave/workspace/Lucene-Solr-Tests-5.x-Java7/solr/build/solr-core/test/J1/temp/solr.cloud.CollectionsAPIDistributedZkTest_AD480521F8594B03-001/init-core-data-001
[junit4] 2> 1125207 INFO (SUITE-CollectionsAPIDistributedZkTest-seed#[AD480521F8594B03]-worker) [ ] o.a.s.SolrTestCaseJ4 Randomized ssl (true) and clientAuth (false)
[junit4] 2> 1125207 INFO (SUITE-CollectionsAPIDistributedZkTest-seed#[AD480521F8594B03]-worker) [ ] o.a.s.BaseDistributedSearchTestCase Setting hostContext system property: /
[junit4] 2> 1125212 INFO (TEST-CollectionsAPIDistributedZkTest.test-seed#[AD480521F8594B03]) [ ] o.a.s.c.ZkTestServer STARTING ZK TEST SERVER
[junit4] 2> 1125213 INFO (Thread-3552) [ ] o.a.s.c.ZkTestServer client port:0.0.0.0/0.0.0.0:0
[junit4] 2> 1125213 INFO (Thread-3552) [ ] o.a.s.c.ZkTestServer Starting server
[junit4] 2> 1125313 INFO (TEST-CollectionsAPIDistributedZkTest.test-seed#[AD480521F8594B03]) [ ] o.a.s.c.ZkTestServer start zk server on port:49184
[junit4] 2> 1125313 INFO (TEST-CollectionsAPIDistributedZkTest.test-seed#[AD480521F8594B03]) [ ] o.a.s.c.c.SolrZkClient Using default ZkCredentialsProvider
[junit4] 2> 1125314 INFO (TEST-CollectionsAPIDistributedZkTest.test-seed#[AD480521F8594B03]) [ ] o.a.s.c.c.ConnectionManager Waiting for client to connect to ZooKeeper
[junit4] 2> 1125316 INFO (zkCallback-1198-thread-1) [ ] o.a.s.c.c.ConnectionManager Watcher org.apache.solr.common.cloud.ConnectionManager@320aeac7 name:ZooKeeperConnection Watcher:127.0.0.1:49184 got event WatchedEvent state:SyncConnected type:None path:null path:null type:None
[junit4] 2> 1125317 INFO (TEST-CollectionsAPIDistributedZkTest.test-seed#[AD480521F8594B03]) [ ] o.a.s.c.c.ConnectionManager Client is connected to ZooKeeper
[junit4] 2> 1125317 INFO (TEST-CollectionsAPIDistributedZkTest.test-seed#[AD480521F8594B03]) [ ] o.a.s.c.c.SolrZkClient Using default ZkACLProvider
[junit4] 2> 1125317 INFO (TEST-CollectionsAPIDistributedZkTest.test-seed#[AD480521F8594B03]) [ ] o.a.s.c.c.SolrZkClient makePath: /solr
[junit4] 2> 1125319 INFO (TEST-CollectionsAPIDistributedZkTest.test-seed#[AD480521F8594B03]) [ ] o.a.s.c.c.SolrZkClient Using default ZkCredentialsProvider
[junit4] 2> 1125319 INFO (TEST-CollectionsAPIDistributedZkTest.test-seed#[AD480521F8594B03]) [ ] o.a.s.c.c.ConnectionManager Waiting for client to connect to ZooKeeper
[junit4] 2> 1125325 INFO (zkCallback-1199-thread-1) [ ] o.a.s.c.c.ConnectionManager Watcher org.apache.solr.common.cloud.ConnectionManager@6a54d02d name:ZooKeeperConnection Watcher:127.0.0.1:49184/solr got event WatchedEvent state:SyncConnected type:None path:null path:null type:None
[junit4] 2> 1125325 INFO (TEST-CollectionsAPIDistributedZkTest.test-seed#[AD480521F8594B03]) [ ] o.a.s.c.c.ConnectionManager Client is connected to ZooKeeper
[junit4] 2> 1125325 INFO (TEST-CollectionsAPIDistributedZkTest.test-seed#[AD480521F8594B03]) [ ] o.a.s.c.c.SolrZkClient Using default ZkACLProvider
[junit4] 2> 1125325 INFO (TEST-CollectionsAPIDistributedZkTest.test-seed#[AD480521F8594B03]) [ ] o.a.s.c.c.SolrZkClient makePath: /collections/collection1
[junit4] 2> 1125327 INFO (TEST-CollectionsAPIDistributedZkTest.test-seed#[AD480521F8594B03]) [ ] o.a.s.c.c.SolrZkClient makePath: /collections/collection1/shards
[junit4] 2> 1125329 INFO (TEST-CollectionsAPIDistributedZkTest.test-seed#[AD480521F8594B03]) [ ] o.a.s.c.c.SolrZkClient makePath: /collections/control_collection
[junit4] 2> 1125331 INFO (TEST-CollectionsAPIDistributedZkTest.test-seed#[AD480521F8594B03]) [ ] o.a.s.c.c.SolrZkClient makePath: /collections/control_collection/shards
[junit4] 2> 1125333 INFO (TEST-CollectionsAPIDistributedZkTest.test-seed#[AD480521F8594B03]) [ ] o.a.s.c.AbstractZkTestCase put /x1/jenkins/jenkins-slave/workspace/Lucene-Solr-Tests-5.x-Java7/solr/core/src/test-files/solr/collection1/conf/solrconfig-tlog.xml to /configs/conf1/solrconfig.xml
[junit4] 2> 1125333 INFO (TEST-CollectionsAPIDistributedZkTest.test-seed#[AD480521F8594B03]) [ ] o.a.s.c.c.SolrZkClient makePath: /configs/conf1/solrconfig.xml
[junit4] 2> 1125336 INFO (TEST-CollectionsAPIDistributedZkTest.test-seed#[AD480521F8594B03]) [ ] o.a.s.c.AbstractZkTestCase put /x1/jenkins/jenkins-slave/workspace/Lucene-Solr-Tests-5.x-Java7/solr/core/src/test-files/solr/collection1/conf/schema.xml to /configs/conf1/schema.xml
[junit4] 2> 1125336 INFO (TEST-CollectionsAPIDistributedZkTest.test-seed#[AD480521F8594B03]) [ ] o.a.s.c.c.SolrZkClient makePath: /configs/conf1/schema.xml
[junit4] 2> 1125339 INFO (TEST-CollectionsAPIDistributedZkTest.test-seed#[AD480521F8594B03]) [ ] o.a.s.c.AbstractZkTestCase put /x1/jenkins/jenkins-slave/workspace/Lucene-Solr-Tests-5.x-Java7/solr/core/src/test-files/solr/collection1/conf/solrconfig.snippet.randomindexconfig.xml to /configs/conf1/solrconfig.snippet.randomindexconfig.xml
[junit4] 2> 1125339 INFO (TEST-CollectionsAPIDistributedZkTest.test-seed#[AD480521F8594B03]) [ ] o.a.s.c.c.SolrZkClient makePath: /configs/conf1/solrconfig.snippet.randomindexconfig.xml
[junit4] 2> 1125340 INFO (TEST-CollectionsAPIDistributedZkTest.test-seed#[AD480521F8594B03]) [ ] o.a.s.c.AbstractZkTestCase put /x1/jenkins/jenkins-slave/workspace/Lucene-Solr-Tests-5.x-Java7/solr/core/src/test-files/solr/collection1/conf/stopwords.txt to /configs/conf1/stopwords.txt
[junit4] 2> 1125340 INFO (TEST-CollectionsAPIDistributedZkTest.test-seed#[AD480521F8594B03]) [ ] o.a.s.c.c.SolrZkClient makePath: /configs/conf1/stopwords.txt
[junit4] 2> 1125342 INFO (TEST-CollectionsAPIDistributedZkTest.test-seed#[AD480521F8594B03]) [ ] o.a.s.c.AbstractZkTestCase put /x1/jenkins/jenkins-slave/workspace/Lucene-Solr-Tests-5.x-Java7/solr/core/src/test-files/solr/collection1/conf/protwords.txt to /configs/conf1/protwords.txt
[junit4] 2> 1125342 INFO (TEST-CollectionsAPIDistributedZkTest.test-seed#[AD480521F8594B03]) [ ] o.a.s.c.c.SolrZkClient makePath: /configs/conf1/protwords.txt
[junit4] 2> 1125344 INFO (TEST-CollectionsAPIDistributedZkTest.test-seed#[AD480521F8594B03]) [ ] o.a.s.c.AbstractZkTestCase put /x1/jenkins/jenkins-slave/workspace/Lucene-Solr-Tests-5.x-Java7/solr/core/src/test-files/solr/collection1/conf/currency.xml to /configs/conf1/currency.xml
[junit4] 2> 1125344 INFO (TEST-CollectionsAPIDistributedZkTest.test-seed#[AD480521F8594B03]) [ ] o.a.s.c.c.SolrZkClient makePath: /configs/conf1/currency.xml
[junit4] 2> 1125345 INFO (TEST-CollectionsAPIDistributedZkTest.test-seed#[AD480521F8594B03]) [ ] o.a.s.c.AbstractZkTestCase put /x1/jenkins/jenkins-slave/workspace/Lucene-Solr-Tests-5.x-Java7/solr/core/src/test-files/solr/collection1/conf/enumsConfig.xml to /configs/conf1/enumsConfig.xml
[junit4] 2> 1125346 INFO (TEST-CollectionsAPIDistributedZkTest.test-seed#[AD480521F8594B03]) [ ] o.a.s.c.c.SolrZkClient makePath: /configs/conf1/enumsConfig.xml
[junit4] 2> 1125347 INFO (TEST-CollectionsAPIDistributedZkTest.test-seed#[AD480521F8594B03]) [ ] o.a.s.c.AbstractZkTestCase put /x1/jenkins/jenkins-slave/workspace/Lucene-Solr-Tests-5.x-Java7/solr/core/src/test-files/solr/collection1/conf/open-exchange-rates.json to /configs/conf1/open-exchange-rates.json
[junit4] 2> 1125348 INFO (TEST-CollectionsAPIDistributedZkTest.test-seed#[AD480521F8594B03]) [ ] o.a.s.c.c.SolrZkClient makePath: /configs/conf1/open-exchange-rates.json
[junit4] 2> 1125349 INFO (TEST-CollectionsAPIDistributedZkTest.test-seed#[AD480521F8594B03]) [ ] o.a.s.c.AbstractZkTestCase put /x1/jenkins/jenkins-slave/workspace/Lucene-Solr-Tests-5.x-Java7/solr/core/src/test-files/solr/collection1/conf/mapping-ISOLatin1Accent.txt to /configs/conf1/mapping-ISOLatin1Accent.txt
[junit4] 2> 1125349 INFO (TEST-CollectionsAPIDistributedZkTest.test-seed#[AD480521F8594B03]) [ ] o.a.s.c.c.SolrZkClient makePath: /configs/conf1/mapping-ISOLatin1Accent.txt
[junit4] 2> 1125351 INFO (TEST-CollectionsAPIDistributedZkTest.test-seed#[AD480521F8594B03]) [ ] o.a.s.c.AbstractZkTestCase put /x1/jenkins/jenkins-slave/workspace/Lucene-Solr-Tests-5.x-Java7/solr/core/src/test-files/solr/collection1/conf/old_synonyms.txt to /configs/conf1/old_synonyms.txt
[junit4] 2> 1125351 INFO (TEST-CollectionsAPIDistributedZkTest.test-seed#[AD480521F8594B03]) [ ] o.a.s.c.c.SolrZkClient makePath: /configs/conf1/old_synonyms.txt
[junit4] 2> 1125353 INFO (TEST-CollectionsAPIDistributedZkTest.test-seed#[AD480521F8594B03]) [ ] o.a.s.c.AbstractZkTestCase put /x1/jenkins/jenkins-slave/workspace/Lucene-Solr-Tests-5.x-Java7/solr/core/src/test-files/solr/collection1/conf/synonyms.txt to /configs/conf1/synonyms.txt
[junit4] 2> 1125353 INFO (TEST-CollectionsAPIDistributedZkTest.test-seed#[AD480521F8594B03]) [ ] o.a.s.c.c.SolrZkClient makePath: /configs/conf1/synonyms.txt
[junit4] 2> 1125355 INFO (TEST-CollectionsAPIDistributedZkTest.test-seed#[AD480521F8594B03]) [ ] o.a.s.c.c.SolrZkClient Using default ZkCredentialsProvider
[junit4] 2> 1125355 INFO (TEST-CollectionsAPIDistributedZkTest.test-seed#[AD480521F8594B03]) [ ] o.a.s.c.c.ConnectionManager Waiting for client to connect to ZooKeeper
[junit4] 2> 1125356 INFO (zkCallback-1200-thread-1) [ ] o.a.s.c.c.ConnectionManager Watcher org.apache.solr.common.cloud.ConnectionManager@37b99009 name:ZooKeeperConnection Watcher:127.0.0.1:49184/solr got event WatchedEvent state:SyncConnected type:None path:null path:null type:None
[junit4] 2> 1125357 INFO (TEST-CollectionsAPIDistributedZkTest.test-seed#[AD480521F8594B03]) [ ] o.a.s.c.c.ConnectionManager Client is connected to ZooKeeper
[junit4] 2> 1125357 INFO (TEST-CollectionsAPIDistributedZkTest.test-seed#[AD480521F8594B03]) [ ] o.a.s.c.c.SolrZkClient Using default ZkACLProvider
[junit4] 2> 1125358 INFO (TEST-CollectionsAPIDistributedZkTest.test-seed#[AD480521F8594B03]) [ ] o.a.s.c.c.SolrZkClient Using default ZkCredentialsProvider
[junit4] 2> 1125358 INFO (TEST-CollectionsAPIDistributedZkTest.test-seed#[AD480521F8594B03]) [ ] o.a.s.c.c.ConnectionManager Waiting for client to connect to ZooKeeper
[junit4] 2> 1125359 INFO (zkCallback-1201-thread-1) [ ] o.a.s.c.c.ConnectionManager Watcher org.apache.solr.common.cloud.ConnectionManager@412e9719 name:ZooKeeperConnection Watcher:127.0.0.1:49184 got event WatchedEvent state:SyncConnected type:None path:null path:null type:None
[junit4] 2> 1125359 INFO (TEST-CollectionsAPIDistributedZkTest.test-seed#[AD480521F8594B03]) [ ] o.a.s.c.c.ConnectionManager Client is connected to ZooKeeper
[junit4] 2> 1125360 INFO (TEST-CollectionsAPIDistributedZkTest.test-seed#[AD480521F8594B03]) [ ] o.a.s.c.c.SolrZkClient Using default ZkACLProvider
[junit4] 2> 1125360 INFO (TEST-CollectionsAPIDistributedZkTest.test-seed#[AD480521F8594B03]) [ ] o.a.s.c.c.SolrZkClient makePath: /solr
[junit4] 2> 1125361 INFO (TEST-CollectionsAPIDistributedZkTest.test-seed#[AD480521F8594B03]) [ ] o.a.s.c.c.SolrZkClient Using default ZkCredentialsProvider
[junit4] 2> 1125362 INFO (TEST-CollectionsAPIDistributedZkTest.test-seed#[AD480521F8594B03]) [ ] o.a.s.c.c.ConnectionManager Waiting for client to connect to ZooKeeper
[junit4] 2> 1125363 INFO (zkCallback-1202-thread-1) [ ] o.a.s.c.c.ConnectionManager Watcher org.apache.solr.common.cloud.ConnectionManager@60595e18 name:ZooKeeperConnection Watcher:127.0.0.1:49184/solr got event WatchedEvent state:SyncConnected type:None path:null path:null type:None
[junit4] 2> 1125363 INFO (TEST-CollectionsAPIDistributedZkTest.test-seed#[AD480521F8594B03]) [ ] o.a.s.c.c.ConnectionManager Client is connected to ZooKeeper
[junit4] 2> 1125363 INFO (TEST-CollectionsAPIDistributedZkTest.test-seed#[AD480521F8594B03]) [ ] o.a.s.c.c.SolrZkClient Using default ZkACLProvider
[junit4] 2> 1125364 INFO (TEST-CollectionsAPIDistributedZkTest.test-seed#[AD480521F8594B03]) [ ] o.a.s.c.AbstractZkTestCase put /x1/jenkins/jenkins-slave/workspace/Lucene-Solr-Tests-5.x-Java7/solr/core/src/test-files/solr/collection1/conf/solrconfig-tlog.xml to /configs/conf2/solrconfig.xml
[junit4] 2> 1125364 INFO (TEST-CollectionsAPIDistributedZkTest.test-seed#[AD480521F8594B03]) [ ] o.a.s.c.c.SolrZkClient makePath: /configs/conf2/solrconfig.xml
[junit4] 2> 1125366 INFO (TEST-CollectionsAPIDistributedZkTest.test-seed#[AD480521F8594B03]) [ ] o.a.s.c.AbstractZkTestCase put /x1/jenkins/jenkins-slave/workspace/Lucene-Solr-Tests-5.x-Java7/solr/core/src/test-files/solr/collection1/conf/schema.xml to /configs/conf2/schema.xml
[junit4] 2> 1125367 INFO (TEST-CollectionsAPIDistributedZkTest.test-seed#[AD480521F8594B03]) [ ] o.a.s.c.c.SolrZkClient makePath: /configs/conf2/schema.xml
[junit4] 2> 1125368 INFO (TEST-CollectionsAPIDistributedZkTest.test-seed#[AD480521F8594B03]) [ ] o.a.s.c.AbstractZkTestCase put /x1/jenkins/jenkins-slave/workspace/Lucene-Solr-Tests-5.x-Java7/solr/core/src/test-files/solr/collection1/conf/enumsConfig.xml to /configs/conf2/enumsConfig.xml
[junit4] 2> 1125369 INFO (TEST-CollectionsAPIDistributedZkTest.test-seed#[AD480521F8594B03]) [ ] o.a.s.c.c.SolrZkClient makePath: /configs/conf2/enumsConfig.xml
[junit4] 2> 1125370 INFO (TEST-CollectionsAPIDistributedZkTest.test-seed#[AD480521F8594B03]) [ ] o.a.s.c.AbstractZkTestCase put /x1/jenkins/jenkins-slave/workspace/Lucene-Solr-Tests-5.x-Java7/solr/core/src/test-files/solr/collection1/conf/solrconfig.snippet.randomindexconfig.xml to /configs/conf2/solrconfig.snippet.randomindexconfig.xml
[junit4] 2> 1125371 INFO (TEST-CollectionsAPIDistributedZkTest.test-seed#[AD480521F8594B03]) [ ] o.a.s.c.c.SolrZkClient makePath: /configs/conf2/solrconfig.snippet.randomindexconfig.xml
[junit4] 2> 1125372 INFO (TEST-CollectionsAPIDistributedZkTest.test-seed#[AD480521F8594B03]) [ ] o.a.s.c.AbstractZkTestCase put /x1/jenkins/jenkins-slave/workspace/Lucene-Solr-Tests-5.x-Java7/solr/core/src/test-files/solr/collection1/conf/stopwords.txt to /configs/conf2/stopwords.txt
[junit4] 2> 1125373 INFO (TEST-CollectionsAPIDistributedZkTest.test-seed#[AD480521F8594B03]) [ ] o.a.s.c.c.SolrZkClient makePath: /configs/conf2/stopwords.txt
[junit4] 2> 1125374 INFO (TEST-CollectionsAPIDistributedZkTest.test-seed#[AD480521F8594B03]) [ ] o.a.s.c.AbstractZkTestCase put /x1/jenkins/jenkins-slave/workspace/Lucene-Solr-Tests-5.x-Java7/solr/core/src/test-files/solr/collection1/conf/protwords.txt to /configs/conf2/protwords.txt
[junit4] 2> 1125374 INFO (TEST-CollectionsAPIDistributedZkTest.test-seed#[AD480521F8594B03]) [ ] o.a.s.c.c.SolrZkClient makePath: /configs/conf2/protwords.txt
[junit4] 2> 1125376 INFO (TEST-CollectionsAPIDistributedZkTest.test-seed#[AD480521F8594B03]) [ ] o.a.s.c.AbstractZkTestCase put /x1/jenkins/jenkins-slave/workspace/Lucene-Solr-Tests-5.x-Java7/solr/core/src/test-files/solr/collection1/conf/currency.xml to /configs/conf2/currency.xml
[junit4] 2> 1125376 INFO (TEST-CollectionsAPIDistributedZkTest.test-seed#[AD480521F8594B03]) [ ] o.a.s.c.c.SolrZkClient makePath: /configs/conf2/currency.xml
[junit4] 2> 1125378 INFO (TEST-CollectionsAPIDistributedZkTest.test-seed#[AD480521F8594B03]) [ ] o.a.s.c.AbstractZkTestCase put /x1/jenkins/jenkins-slave/workspace/Lucene-Solr-Tests-5.x-Java7/solr/core/src/test-files/solr/collection1/conf/open-exchange-rates.json to /configs/conf2/open-exchange-rates.json
[junit4] 2> 1125379 INFO (TEST-CollectionsAPIDistributedZkTest.test-seed#[AD480521F8594B03]) [ ] o.a.s.c.c.SolrZkClient makePath: /configs/conf2/open-exchange-rates.json
[junit4] 2> 1125380 INFO (TEST-CollectionsAPIDistributedZkTest.test-seed#[AD480521F8594B03]) [ ] o.a.s.c.AbstractZkTestCase put /x1/jenkins/jenkins-slave/workspace/Lucene-Solr-Tests-5.x-Java7/solr/core/src/test-files/solr/collection1/conf/mapping-ISOLatin1Accent.txt to /configs/conf2/mapping-ISOLatin1Accent.txt
[junit4] 2> 1125381 INFO (TEST-CollectionsAPIDistributedZkTest.test-seed#[AD480521F8594B03]) [ ] o.a.s.c.c.SolrZkClient makePath: /configs/conf2/mapping-ISOLatin1Accent.txt
[junit4] 2> 1125382 INFO (TEST-CollectionsAPIDistributedZkTest.test-seed#[AD480521F8594B03]) [ ] o.a.s.c.AbstractZkTestCase put /x1/jenkins/jenkins-slave/workspace/Lucene-Solr-Tests-5.x-Java7/solr/core/src/test-files/solr/collection1/conf/old_synonyms.txt to /configs/conf2/old_synonyms.txt
[junit4] 2> 1125383 INFO (TEST-CollectionsAPIDistributedZkTest.test-seed#[AD480521F8594B03]) [ ] o.a.s.c.c.SolrZkClient makePath: /configs/conf2/old_synonyms.txt
[junit4] 2> 1125384 INFO (TEST-CollectionsAPIDistributedZkTest.test-seed#[AD480521F8594B03]) [ ] o.a.s.c.AbstractZkTestCase put /x1/jenkins/jenkins-slave/workspace/Lucene-Solr-Tests-5.x-Java7/solr/core/src/test-files/solr/collection1/conf/synonyms.txt to /configs/conf2/synonyms.txt
[junit4] 2> 1125384 INFO (TEST-CollectionsAPIDistributedZkTest.test-seed#[AD480521F8594B03]) [ ] o.a.s.c.c.SolrZkClient makePath: /configs/conf2/synonyms.txt
[junit4] 2> 1125386 INFO (TEST-CollectionsAPIDistributedZkTest.test-seed#[AD480521F8594B03]) [ ] o.a.s.c.AbstractZkTestCase put /x1/jenkins/jenkins-slave/workspace/Lucene-Solr-Tests-5.x-Java7/solr/core/src/test-files/solr/collection1/conf/elevate.xml to /configs/conf2/elevate.xml
[junit4] 2> 1125386 INFO (TEST-CollectionsAPIDistributedZkTest.test-seed#[AD480521F8594B03]) [ ] o.a.s.c.c.SolrZkClient makePath: /configs/conf2/elevate.xml
[junit4] 2> 1125511 INFO (TEST-CollectionsAPIDistributedZkTest.test-seed#[AD480521F8594B03]) [ ] o.a.s.SolrTestCaseJ4 Writing core.properties file to /x1/jenkins/jenkins-slave/workspace/Lucene-Solr-Tests-5.x-Java7/solr/build/solr-core/test/J1/temp/solr.cloud.CollectionsAPIDistributedZkTest_AD480521F8594B03-001/control-001/cores/collection1
[junit4] 2> 1125535 INFO (TEST-CollectionsAPIDistributedZkTest.test-seed#[AD480521F8594B03]) [ ] o.e.j.s.Server jetty-9.2.13.v20150730
[junit4] 2> 1125537 INFO (TEST-CollectionsAPIDistributedZkTest.test-seed#[AD480521F8594B03]) [ ] o.e.j.s.h.ContextHandler Started o.e.j.s.ServletContextHandler@6f494df{/,null,AVAILABLE}
[junit4] 2> 1125618 INFO (TEST-CollectionsAPIDistributedZkTest.test-seed#[AD480521F8594B03]) [ ] o.e.j.s.ServerConnector Started ServerConnector@b502385{SSL-http/1.1}{127.0.0.1:52657}
[junit4] 2> 1125618 INFO (TEST-CollectionsAPIDistributedZkTest.test-seed#[AD480521F8594B03]) [ ] o.e.j.s.Server Started @1128399ms
[junit4] 2> 1125619 INFO (TEST-CollectionsAPIDistributedZkTest.test-seed#[AD480521F8594B03]) [ ] o.a.s.c.s.e.JettySolrRunner Jetty properties: {coreRootDirectory=/x1/jenkins/jenkins-slave/workspace/Lucene-Solr-Tests-5.x-Java7/solr/build/solr-core/test/J1/temp/solr.cloud.CollectionsAPIDistributedZkTest_AD480521F8594B03-001/control-001/cores, hostPort=52657, hostContext=/, solr.data.dir=/x1/jenkins/jenkins-slave/workspace/Lucene-Solr-Tests-5.x-Java7/solr/build/solr-core/test/J1/temp/solr.cloud.CollectionsAPIDistributedZkTest_AD480521F8594B03-001/tempDir-001/control/data}
[junit4] 2> 1125619 INFO (TEST-CollectionsAPIDistributedZkTest.test-seed#[AD480521F8594B03]) [ ] o.a.s.s.SolrDispatchFilter SolrDispatchFilter.init(): sun.misc.Launcher$AppClassLoader@7b3cb2c6
[junit4] 2> 1125619 INFO (TEST-CollectionsAPIDistributedZkTest.test-seed#[AD480521F8594B03]) [ ] o.a.s.c.SolrResourceLoader new SolrResourceLoader for directory: '/x1/jenkins/jenkins-slave/workspace/Lucene-Solr-Tests-5.x-Java7/solr/build/solr-core/test/J1/temp/solr.cloud.CollectionsAPIDistributedZkTest_AD480521F8594B03-001/control-001'
[junit4] 2> 1125619 INFO (TEST-CollectionsAPIDistributedZkTest.test-seed#[AD480521F8594B03]) [ ] o.a.s.c.SolrResourceLoader JNDI not configured for solr (NoInitialContextEx)
[junit4] 2> 1125619 INFO (TEST-CollectionsAPIDistributedZkTest.test-seed#[AD480521F8594B03]) [ ] o.a.s.c.SolrResourceLoader solr home defaulted to 'solr/' (could not find system property or JNDI)
[junit4] 2> 1125620 INFO (TEST-CollectionsAPIDistributedZkTest.test-seed#[AD480521F8594B03]) [ ] o.a.s.c.c.SolrZkClient Using default ZkCredentialsProvider
[junit4] 2> 1125622 INFO (TEST-CollectionsAPIDistributedZkTest.test-seed#[AD480521F8594B03]) [ ] o.a.s.c.c.ConnectionManager Waiting for client to connect to ZooKeeper
[junit4] 2> 1125623 INFO (zkCallback-1203-thread-1) [ ] o.a.s.c.c.ConnectionManager Watcher org.apache.solr.common.cloud.ConnectionManager@39c0cf11 name:ZooKeeperConnection Watcher:127.0.0.1:49184/solr got event WatchedEvent state:SyncConnected type:None path:null path:null type:None
[junit4] 2> 1125623 INFO (TEST-CollectionsAPIDistributedZkTest.test-seed#[AD480521F8594B03]) [ ] o.a.s.c.c.ConnectionManager Client is connected to ZooKeeper
[junit4] 2> 1125624 INFO (TEST-CollectionsAPIDistributedZkTest.test-seed#[AD480521F8594B03]) [ ] o.a.s.c.c.SolrZkClient Using default ZkACLProvider
[junit4] 2> 1125624 INFO (TEST-CollectionsAPIDistributedZkTest.test-seed#[AD480521F8594B03]) [ ] o.a.s.s.SolrDispatchFilter Loading solr.xml from SolrHome (not found in ZooKeeper)
[junit4] 2> 1125625 INFO (TEST-CollectionsAPIDistributedZkTest.test-seed#[AD480521F8594B03]) [ ] o.a.s.c.SolrXmlConfig Loading container configuration from /x1/jenkins/jenkins-slave/workspace/Lucene-Solr-Tests-5.x-Java7/solr/build/solr-core/test/J1/temp/solr.cloud.CollectionsAPIDistributedZkTest_AD480521F8594B03-001/control-001/solr.xml
[junit4] 2> 1125640 INFO (TEST-CollectionsAPIDistributedZkTest.test-seed#[AD480521F8594B03]) [ ] o.a.s.c.CorePropertiesLocator Config-defined core root directory: /x1/jenkins/jenkins-slave/workspace/Lucene-Solr-Tests-5.x-Java7/solr/build/solr-core/test/J1/temp/solr.cloud.CollectionsAPIDistributedZkTest_AD480521F8594B03-001/control-001/cores
[junit4] 2> 1125640 INFO (TEST-CollectionsAPIDistributedZkTest.test-seed#[AD480521F8594B03]) [ ] o.a.s.c.CoreContainer New CoreContainer 700986731
[junit4] 2> 1125640 INFO (TEST-CollectionsAPIDistributedZkTest.test-seed#[AD480521F8594B03]) [ ] o.a.s.c.CoreContainer Loading cores into CoreContainer [instanceDir=/x1/jenkins/jenkins-slave/workspace/Lucene-Solr-Tests-5.x-Java7/solr/build/solr-core/test/J1/temp/solr.cloud.CollectionsAPIDistributedZkTest_AD480521F8594B03-001/control-001]
[junit4] 2> 1125641 WARN (TEST-CollectionsAPIDistributedZkTest.test-seed#[AD480521F8594B03]) [ ] o.a.s.c.CoreContainer Couldn't add files from /x1/jenkins/jenkins-slave/workspace/Lucene-Solr-Tests-5.x-Java7/solr/build/solr-core/test/J1/temp/solr.cloud.CollectionsAPIDistributedZkTest_AD480521F8594B03-001/control-001/lib to classpath: /x1/jenkins/jenkins-slave/workspace/Lucene-Solr-Tests-5.x-Java7/solr/build/solr-core/test/J1/temp/solr.cloud.CollectionsAPIDistributedZkTest_AD480521F8594B03-001/control-001/lib
[junit4] 2> 1125641 INFO (TEST-CollectionsAPIDistributedZkTest.test-seed#[AD480521F8594B03]) [ ] o.a.s.h.c.HttpShardHandlerFactory created with socketTimeout : 90000,urlScheme : ,connTimeout : 15000,maxConnectionsPerHost : 20,maxConnections : 10000,corePoolSize : 0,maximumPoolSize : 2147483647,maxThreadIdleTime : 5,sizeOfQueue : -1,fairnessPolicy : false,useRetries : false,
[junit4] 2> 1125644 INFO (TEST-CollectionsAPIDistributedZkTest.test-seed#[AD480521F8594B03]) [ ] o.a.s.u.UpdateShardHandler Creating UpdateShardHandler HTTP client with params: socketTimeout=340000&connTimeout=45000&retry=true
[junit4] 2> 1125646 INFO (TEST-CollectionsAPIDistributedZkTest.test-seed#[AD480521F8594B03]) [ ] o.a.s.l.LogWatcher SLF4J impl is org.slf4j.impl.Log4jLoggerFactory
[junit4] 2> 1125646 INFO (TEST-CollectionsAPIDistributedZkTest.test-seed#[AD480521F8594B03]) [ ] o.a.s.l.LogWatcher Registering Log Listener [Log4j (org.slf4j.impl.Log4jLoggerFactory)]
[junit4] 2> 1125646 INFO (TEST-CollectionsAPIDistributedZkTest.test-seed#[AD480521F8594B03]) [ ] o.a.s.c.ZkContainer Zookeeper client=127.0.0.1:49184/solr
[junit4] 2> 1125646 INFO (TEST-CollectionsAPIDistributedZkTest.test-seed#[AD480521F8594B03]) [ ] o.a.s.c.ZkController zkHost includes chroot
[junit4] 2> 1125646 INFO (TEST-CollectionsAPIDistributedZkTest.test-seed#[AD480521F8594B03]) [ ] o.a.s.c.c.SolrZkClient Using default ZkCredentialsProvider
[junit4] 2> 1125646 INFO (TEST-CollectionsAPIDistributedZkTest.test-seed#[AD480521F8594B03]) [ ] o.a.s.c.c.ConnectionManager Waiting for client to connect to ZooKeeper
[junit4] 2> 1125648 INFO (zkCallback-1206-thread-1) [ ] o.a.s.c.c.ConnectionManager Watcher org.apache.solr.common.cloud.ConnectionManager@4911ff7d name:ZooKeeperConnection Watcher:127.0.0.1:49184 got event WatchedEvent state:SyncConnected type:None path:null path:null type:None
[junit4] 2> 1125648 INFO (TEST-CollectionsAPIDistributedZkTest.test-seed#[AD480521F8594B03]) [ ] o.a.s.c.c.ConnectionManager Client is connected to ZooKeeper
[junit4] 2> 1125648 INFO (TEST-CollectionsAPIDistributedZkTest.test-seed#[AD480521F8594B03]) [ ] o.a.s.c.c.SolrZkClient Using default ZkACLProvider
[junit4] 2> 1125649 INFO (TEST-CollectionsAPIDistributedZkTest.test-seed#[AD480521F8594B03]) [n:127.0.0.1:52657_ ] o.a.s.c.c.ConnectionManager Waiting for client to connect to ZooKeeper
[junit4] 2> 1125650 INFO (zkCallback-1207-thread-1-processing-n:127.0.0.1:52657_) [n:127.0.0.1:52657_ ] o.a.s.c.c.ConnectionManager Watcher org.apache.solr.common.cloud.ConnectionManager@8ef8b9a name:ZooKeeperConnection Watcher:127.0.0.1:49184/solr got event WatchedEvent state:SyncConnected type:None path:null path:null type:None
[junit4] 2> 1125651 INFO (TEST-CollectionsAPIDistributedZkTest.test-seed#[AD480521F8594B03]) [n:127.0.0.1:52657_ ] o.a.s.c.c.ConnectionManager Client is connected to ZooKeeper
[junit4] 2> 1125652 INFO (TEST-CollectionsAPIDistributedZkTest.test-seed#[AD480521F8594B03]) [n:127.0.0.1:52657_ ] o.a.s.c.c.SolrZkClient makePath: /overseer/queue
[junit4] 2> 1125655 INFO (TEST-CollectionsAPIDistributedZkTest.test-seed#[AD480521F8594B03]) [n:127.0.0.1:52657_ ] o.a.s.c.c.SolrZkClient makePath: /overseer/collection-queue-work
[junit4] 2> 1125657 INFO (TEST-CollectionsAPIDistributedZkTest.test-seed#[AD480521F8594B03]) [n:127.0.0.1:52657_ ] o.a.s.c.c.SolrZkClient makePath: /overseer/collection-map-running
[junit4] 2> 1125660 INFO (TEST-CollectionsAPIDistributedZkTest.test-seed#[AD480521F8594B03]) [n:127.0.0.1:52657_ ] o.a.s.c.c.SolrZkClient makePath: /overseer/collection-map-completed
[junit4] 2> 1125662 INFO (TEST-CollectionsAPIDistributedZkTest.test-seed#[AD480521F8594B03]) [n:127.0.0.1:52657_ ] o.a.s.c.c.SolrZkClient makePath: /overseer/collection-map-failure
[junit4] 2> 1125666 INFO (TEST-CollectionsAPIDistributedZkTest.test-seed#[AD480521F8594B03]) [n:127.0.0.1:52657_ ] o.a.s.c.c.SolrZkClient makePath: /live_nodes
[junit4] 2> 1125667 INFO (TEST-CollectionsAPIDistributedZkTest.test-seed#[AD480521F8594B03]) [n:127.0.0.1:52657_ ] o.a.s.c.c.SolrZkClient makePath: /aliases.json
[junit4] 2> 1125669 INFO (TEST-CollectionsAPIDistributedZkTest.test-seed#[AD480521F8594B03]) [n:127.0.0.1:52657_ ] o.a.s.c.c.SolrZkClient makePath: /clusterstate.json
[junit4] 2> 1125670 INFO (TEST-CollectionsAPIDistributedZkTest.test-seed#[AD480521F8594B03]) [n:127.0.0.1:52657_ ] o.a.s.c.c.SolrZkClient makePath: /security.json
[junit4] 2> 1125671 INFO (TEST-CollectionsAPIDistributedZkTest.test-seed#[AD480521F8594B03]) [n:127.0.0.1:52657_ ] o.a.s.c.ZkController Register node as live in ZooKeeper:/live_nodes/127.0.0.1:52657_
[junit4] 2> 1125671 INFO (TEST-CollectionsAPIDistributedZkTest.test-seed#[AD480521F8594B03]) [n:127.0.0.1:52657_ ] o.a.s.c.c.SolrZkClient makePath: /live_nodes/127.0.0.1:52657_
[junit4] 2> 1125673 INFO (TEST-CollectionsAPIDistributedZkTest.test-seed#[AD480521F8594B03]) [n:127.0.0.1:52657_ ] o.a.s.c.c.SolrZkClient makePath: /overseer_elect
[junit4] 2> 1125675 INFO (TEST-CollectionsAPIDistributedZkTest.test-seed#[AD480521F8594B03]) [n:127.0.0.1:52657_ ] o.a.s.c.c.SolrZkClient makePath: /overseer_elect/election
[junit4] 2> 1125676 INFO (TEST-CollectionsAPIDistributedZkTest.test-seed#[AD480521F8594B03]) [n:127.0.0.1:52657_ ] o.a.s.c.Overseer Overseer (id=null) closing
[junit4] 2> 1125677 INFO (TEST-CollectionsAPIDistributedZkTest.test-seed#[AD480521F8594B03]) [n:127.0.0.1:52657_ ] o.a.s.c.LeaderElector Joined leadership election with path: /overseer_elect/election/95351342663925767-127.0.0.1:52657_-n_0000000000
[junit4] 2> 1125677 INFO (TEST-CollectionsAPIDistributedZkTest.test-seed#[AD480521F8594B03]) [n:127.0.0.1:52657_ ] o.a.s.c.OverseerElectionContext I am going to be the leader 127.0.0.1:52657_
[junit4] 2> 1125677 INFO (TEST-CollectionsAPIDistributedZkTest.test-seed#[AD480521F8594B03]) [n:127.0.0.1:52657_ ] o.a.s.c.c.SolrZkClient makePath: /overseer_elect/leader
[junit4] 2> 1125679 INFO (TEST-CollectionsAPIDistributedZkTest.test-seed#[AD480521F8594B03]) [n:127.0.0.1:52657_ ] o.a.s.c.Overseer Overseer (id=95351342663925767-127.0.0.1:52657_-n_0000000000) starting
[junit4] 2> 1125681 INFO (TEST-CollectionsAPIDistributedZkTest.test-seed#[AD480521F8594B03]) [n:127.0.0.1:52657_ ] o.a.s.c.c.SolrZkClient makePath: /overseer/queue-work
[junit4] 2> 1125687 INFO (TEST-CollectionsAPIDistributedZkTest.test-seed#[AD480521F8594B03]) [n:127.0.0.1:52657_ ] o.a.s.c.OverseerAutoReplicaFailoverThread Starting OverseerAutoReplicaFailoverThread autoReplicaFailoverWorkLoopDelay=10000 autoReplicaFailoverWaitAfterExpiration=10000 autoReplicaFailoverBadNodeExpiration=60000
[junit4] 2> 1125687 INFO (TEST-CollectionsAPIDistributedZkTest.test-seed#[AD480521F8594B03]) [n:127.0.0.1:52657_ ] o.a.s.c.c.ZkStateReader Updating cluster state from ZooKeeper...
[junit4] 2> 1125688 INFO (OverseerCollectionConfigSetProcessor-95351342663925767-127.0.0.1:52657_-n_0000000000) [n:127.0.0.1:52657_ ] o.a.s.c.OverseerTaskProcessor Process current queue of overseer operations
[junit4] 2> 1125688 INFO (OverseerStateUpdate-95351342663925767-127.0.0.1:52657_-n_0000000000) [n:127.0.0.1:52657_ ] o.a.s.c.Overseer Starting to work on the main queue
[junit4] 2> 1125707 INFO (TEST-CollectionsAPIDistributedZkTest.test-seed#[AD480521F8594B03]) [n:127.0.0.1:52657_ ] o.a.s.c.CoreContainer Security conf doesn't exist. Skipping setup for authorization module.
[junit4] 2> 1125707 INFO (TEST-CollectionsAPIDistributedZkTest.test-seed#[AD480521F8594B03]) [n:127.0.0.1:52657_ ] o.a.s.c.CoreContainer No authentication plugin used.
[junit4] 2> 1125708 INFO (TEST-CollectionsAPIDistributedZkTest.test-seed#[AD480521F8594B03]) [n:127.0.0.1:52657_ ] o.a.s.c.CorePropertiesLocator Looking for core definitions underneath /x1/jenkins/jenkins-slave/workspace/Lucene-Solr-Tests-5.x-Java7/solr/build/solr-core/test/J1/temp/solr.cloud.CollectionsAPIDistributedZkTest_AD480521F8594B03-001/control-001/cores
[junit4] 2> 1125709 INFO (TEST-CollectionsAPIDistributedZkTest.test-seed#[AD480521F8594B03]) [n:127.0.0.1:52657_ ] o.a.s.c.CoreDescriptor Created CoreDescriptor: {configSetProperties=configsetprops.json, schema=schema.xml, shard=, collection=control_collection, dataDir=data/, transient=false, name=collection1, loadOnStartup=true, config=solrconfig.xml, coreNodeName=}
[junit4] 2> 1125709 INFO (TEST-CollectionsAPIDistributedZkTest.test-seed#[AD480521F8594B03]) [n:127.0.0.1:52657_ ] o.a.s.c.CorePropertiesLocator Found core collection1 in /x1/jenkins/jenkins-slave/workspace/Lucene-Solr-Tests-5.x-Java7/solr/build/solr-core/test/J1/temp/solr.cloud.CollectionsAPIDistributedZkTest_AD480521F8594B03-001/control-001/cores/collection1
[junit4] 2> 1125709 INFO (TEST-CollectionsAPIDistributedZkTest.test-seed#[AD480521F8594B03]) [n:127.0.0.1:52657_ ] o.a.s.c.CorePropertiesLocator Found 1 core definitions
[junit4] 2> 1125710 INFO (TEST-CollectionsAPIDistributedZkTest.test-seed#[AD480521F8594B03]) [n:127.0.0.1:52657_ ] o.a.s.s.SolrDispatchFilter user.dir=/x1/jenkins/jenkins-slave/workspace/Lucene-Solr-Tests-5.x-Java7/solr/build/solr-core/test/J1
[junit4] 2> 1125710 INFO (TEST-CollectionsAPIDistributedZkTest.test-seed#[AD480521F8594B03]) [n:127.0.0.1:52657_ ] o.a.s.s.SolrDispatchFilter SolrDispatchFilter.init() done
[junit4] 2> 1125710 INFO (coreLoadExecutor-3231-thread-1-processing-n:127.0.0.1:52657_) [n:127.0.0.1:52657_ c:control_collection x:collection1] o.a.s.c.ZkController publishing state=down
[junit4] 2> 1125710 INFO (coreLoadExecutor-3231-thread-1-processing-n:127.0.0.1:52657_) [n:127.0.0.1:52657_ c:control_collection x:collection1] o.a.s.c.ZkController numShards not found on descriptor - reading it from system property
[junit4] 2> 1125712 INFO (OverseerStateUpdate-95351342663925767-127.0.0.1:52657_-n_0000000000) [n:127.0.0.1:52657_ ] o.a.s.c.Overseer processMessage: queueSize: 1, message = {
[junit4] 2> "roles":null,
[junit4] 2> "core":"collection1",
[junit4] 2> "base_url":"https://127.0.0.1:52657",
[junit4] 2> "node_name":"127.0.0.1:52657_",
[junit4] 2> "operation":"state",
[junit4] 2> "shard":null,
[junit4] 2> "numShards":"1",
[junit4] 2> "state":"down",
[junit4] 2> "collection":"control_collection"} current state version: 0
[junit4] 2> 1125712 INFO (coreLoadExecutor-3231-thread-1-processing-n:127.0.0.1:52657_) [n:127.0.0.1:52657_ c:control_collection x:collection1] o.a.s.c.ZkController look for our core node name
[junit4] 2> 1125713 INFO (OverseerStateUpdate-95351342663925767-127.0.0.1:52657_-n_0000000000) [n:127.0.0.1:52657_ ] o.a.s.c.o.ReplicaMutator Update state numShards=1 message={
[junit4] 2> "roles":null,
[junit4] 2> "core":"collection1",
[junit4] 2> "base_url":"https://127.0.0.1:52657",
[junit4] 2> "node_name":"127.0.0.1:52657_",
[junit4] 2> "operation":"state",
[junit4] 2> "shard":null,
[junit4] 2> "numShards":"1",
[junit4] 2> "state":"down",
[junit4] 2> "collection":"control_collection"}
[junit4] 2> 1125713 INFO (OverseerStateUpdate-95351342663925767-127.0.0.1:52657_-n_0000000000) [n:127.0.0.1:52657_ ] o.a.s.c.o.ClusterStateMutator building a new cName: control_collection
[junit4] 2> 1125714 INFO (OverseerStateUpdate-95351342663925767-127.0.0.1:52657_-n_0000000000) [n:127.0.0.1:52657_ ] o.a.s.c.o.ReplicaMutator Assigning new node to shard shard=shard1
[junit4] 2> 1125715 INFO (zkCallback-1207-thread-1-processing-n:127.0.0.1:52657_) [n:127.0.0.1:52657_ ] o.a.s.c.c.ZkStateReader A cluster state change: [WatchedEvent state:SyncConnected type:NodeDataChanged path:/clusterstate.json], has occurred - updating... (live nodes size: [1])
[junit4] 2> 1126713 INFO (coreLoadExecutor-3231-thread-1-processing-n:127.0.0.1:52657_) [n:127.0.0.1:52657_ c:control_collection x:collection1] o.a.s.c.ZkController waiting to find shard id in clusterstate for collection1
[junit4] 2> 1126713 INFO (coreLoadExecutor-3231-thread-1-processing-n:127.0.0.1:52657_) [n:127.0.0.1:52657_ c:control_collection x:collection1] o.a.s.c.ZkController Check for collection zkNode:control_collection
[junit4] 2> 1126713 INFO (coreLoadExecutor-3231-thread-1-processing-n:127.0.0.1:52657_) [n:127.0.0.1:52657_ c:control_collection x:collection1] o.a.s.c.ZkController Collection zkNode exists
[junit4] 2> 1126713 INFO (coreLoadExecutor-3231-thread-1-processing-n:127.0.0.1:52657_) [n:127.0.0.1:52657_ c:control_collection x:collection1] o.a.s.c.c.ZkStateReader Load collection config from: [/collections/control_collection]
[junit4] 2> 1126714 INFO (coreLoadExecutor-3231-thread-1-processing-n:127.0.0.1:52657_) [n:127.0.0.1:52657_ c:control_collection x:collection1] o.a.s.c.c.ZkStateReader path=[/collections/control_collection] [configName]=[conf1] specified config exists in ZooKeeper
[junit4] 2> 1126714 INFO (coreLoadExecutor-3231-thread-1-processing-n:127.0.0.1:52657_) [n:127.0.0.1:52657_ c:control_collection x:collection1] o.a.s.c.SolrResourceLoader new SolrResourceLoader for directory: '/x1/jenkins/jenkins-slave/workspace/Lucene-Solr-Tests-5.x-Java7/solr/build/solr-core/test/J1/temp/solr.cloud.CollectionsAPIDistributedZkTest_AD480521F8594B03-001/control-001/cores/collection1'
[junit4] 2> 1126714 INFO (coreLoadExecutor-3231-thread-1-processing-n:127.0.0.1:52657_) [n:127.0.0.1:52657_ c:control_collection x:collection1] o.a.s.c.SolrResourceLoader JNDI not configured for solr (NoInitialContextEx)
[junit4] 2> 1126714 INFO (coreLoadExecutor-3231-thread-1-processing-n:127.0.0.1:52657_) [n:127.0.0.1:52657_ c:control_collection x:collection1] o.a.s.c.SolrResourceLoader solr home defaulted to 'solr/' (could not find system property or JNDI)
[junit4] 2> 1126716 INFO (coreLoadExecutor-3231-thread-1-processing-n:127.0.0.1:52657_) [n:127.0.0.1:52657_ c:control_collection x:collection1] o.a.s.c.Config loaded config solrconfig.xml with version 0
[junit4] 2> 1126723 INFO (coreLoadExecutor-3231-thread-1-processing-n:127.0.0.1:52657_) [n:127.0.0.1:52657_ c:control_collection x:collection1] o.a.s.c.SolrConfig current version of requestparams : -1
[junit4] 2> 1126737 INFO (coreLoadExecutor-3231-thread-1-processing-n:127.0.0.1:52657_) [n:127.0.0.1:52657_ c:control_collection x:collection1] o.a.s.c.SolrConfig Using Lucene MatchVersion: 5.5.0
[junit4] 2> 1126781 INFO (coreLoadExecutor-3231-thread-1-processing-n:127.0.0.1:52657_) [n:127.0.0.1:52657_ c:control_collection x:collection1] o.a.s.c.SolrConfig Loaded SolrConfig: solrconfig.xml
[junit4] 2> 1126789 INFO (coreLoadExecutor-3231-thread-1-processing-n:127.0.0.1:52657_) [n:127.0.0.1:52657_ c:control_collection x:collection1] o.a.s.s.IndexSchema [collection1] Schema name=test
[junit4] 2> 1127055 INFO (coreLoadExecutor-3231-thread-1-processing-n:127.0.0.1:52657_) [n:127.0.0.1:52657_ c:control_collection x:collection1] o.a.s.s.OpenExchangeRatesOrgProvider Initialized with rates=open-exchange-rates.json, refreshInterval=1440.
[junit4] 2> 1127063 INFO (coreLoadExecutor-3231-thread-1-processing-n:127.0.0.1:52657_) [n:127.0.0.1:52657_ c:control_collection x:collection1] o.a.s.s.IndexSchema default search field in schema is text
[junit4] 2> 1127065 INFO (coreLoadExecutor-3231-thread-1-processing-n:127.0.0.1:52657_) [n:127.0.0.1:52657_ c:control_collection x:collection1] o.a.s.s.IndexSchema unique key field: id
[junit4] 2> 1127076 INFO (coreLoadExecutor-3231-thread-1-processing-n:127.0.0.1:52657_) [n:127.0.0.1:52657_ c:control_collection x:collection1] o.a.s.s.FileExchangeRateProvider Reloading exchange rates from file currency.xml
[junit4] 2> 1127080 INFO (coreLoadExecutor-3231-thread-1-processing-n:127.0.0.1:52657_) [n:127.0.0.1:52657_ c:control_collection x:collection1] o.a.s.s.FileExchangeRateProvider Reloading exchange rates from file currency.xml
[junit4] 2> 1127085 INFO (coreLoadExecutor-3231-thread-1-processing-n:127.0.0.1:52657_) [n:127.0.0.1:52657_ c:control_collection x:collection1] o.a.s.s.OpenExchangeRatesOrgProvider Reloading exchange rates from open-exchange-rates.json
[junit4] 2> 1127086 INFO (coreLoadExecutor-3231-thread-1-processing-n:127.0.0.1:52657_) [n:127.0.0.1:52657_ c:control_collection x:collection1] o.a.s.s.OpenExchangeRatesOrgProvider Reloading exchange rates from open-exchange-rates.json
[junit4] 2> 1127088 INFO (coreLoadExecutor-3231-thread-1-processing-n:127.0.0.1:52657_) [n:127.0.0.1:52657_ c:control_collection x:collection1] o.a.s.c.ConfigSetProperties Did not find ConfigSet properties, assuming default properties: Can't find resource 'configsetprops.json' in classpath or '/configs/conf1', cwd=/x1/jenkins/jenkins-slave/workspace/Lucene-Solr-Tests-5.x-Java7/solr/build/solr-core/test/J1
[junit4] 2> 1127088 INFO (coreLoadExecutor-3231-thread-1-processing-n:127.0.0.1:52657_) [n:127.0.0.1:52657_ c:control_collection x:collection1] o.a.s.c.CoreContainer Creating SolrCore 'collection1' using configuration from collection control_collection
[junit4] 2> 1127088 INFO (coreLoadExecutor-3231-thread-1-processing-n:127.0.0.1:52657_) [n:127.0.0.1:52657_ c:control_collection s:shard1 r:core_node1 x:collection1] o.a.s.c.SolrCore org.apache.solr.core.MockDirectoryFactory
[junit4] 2> 1127088 INFO (coreLoadExecutor-3231-thread-1-processing-n:127.0.0.1:52657_) [n:127.0.0.1:52657_ c:control_collection s:shard1 r:core_node1 x:collection1] o.a.s.c.SolrCore [[collection1] ] Opening new SolrCore at [/x1/jenkins/jenkins-slave/workspace/Lucene-Solr-Tests-5.x-Java7/solr/build/solr-core/test/J1/temp/solr.cloud.CollectionsAPIDistributedZkTest_AD480521F8594B03-001/control-001/cores/collection1], dataDir=[/x1/jenkins/jenkins-slave/workspace/Lucene-Solr-Tests-5.x-Java7/solr/build/solr-core/test/J1/temp/solr.cloud.CollectionsAPIDistributedZkTest_AD480521F8594B03-001/control-001/cores/collection1/data/]
[junit4] 2> 1127089 INFO (coreLoadExecutor-3231-thread-1-processing-n:127.0.0.1:52657_) [n:127.0.0.1:52657_ c:control_collection s:shard1 r:core_node1 x:collection1] o.a.s.c.JmxMonitoredMap JMX monitoring is enabled. Adding Solr mbeans to JMX Server: com.sun.jmx.mbeanserver.JmxMBeanServer@6403745f
[junit4] 2> 1127089 INFO (coreLoadExecutor-3231-thread-1-processing-n:127.0.0.1:52657_) [n:127.0.0.1:52657_ c:control_collection s:shard1 r:core_node1 x:collection1] o.a.s.c.CachingDirectoryFactory return new directory for /x1/jenkins/jenkins-slave/workspace/Lucene-Solr-Tests-5.x-Java7/solr/build/solr-core/test/J1/temp/solr.cloud.CollectionsAPIDistributedZkTest_AD480521F8594B03-001/control-001/cores/collection1/data
[junit4] 2> 1127089 INFO (coreLoadExecutor-3231-thread-1-processing-n:127.0.0.1:52657_) [n:127.0.0.1:52657_ c:control_collection s:shard1 r:core_node1 x:collection1] o.a.s.c.SolrCore New index directory detected: old=null new=/x1/jenkins/jenkins-slave/workspace/Lucene-Solr-Tests-5.x-Java7/solr/build/solr-core/test/J1/temp/solr.cloud.CollectionsAPIDistributedZkTest_AD480521F8594B03-001/control-001/cores/collection1/data/index/
[junit4] 2> 1127089 WARN (coreLoadExecutor-3231-thread-1-processing-n:127.0.0.1:52657_) [n:127.0.0.1:52657_ c:control_collection s:shard1 r:core_node1 x:collection1] o.a.s.c.SolrCore [collection1] Solr index directory '/x1/jenkins/jenkins-slave/workspace/Lucene-Solr-Tests-5.x-Java7/solr/build/solr-core/test/J1/temp/solr.cloud.CollectionsAPIDistributedZkTest_AD480521F8594B03-001/control-001/cores/collection1/data/index' doesn't exist. Creating new index...
[junit4] 2> 1127090 INFO (coreLoadExecutor-3231-thread-1-processing-n:127.0.0.1:52657_) [n:127.0.0.1:52657_ c:control_collection s:shard1 r:core_node1 x:collection1] o.a.s.c.CachingDirectoryFactory return new directory for /x1/jenkins/jenkins-slave/workspace/Lucene-Solr-Tests-5.x-Java7/solr/build/solr-core/test/J1/temp/solr.cloud.CollectionsAPIDistributedZkTest_AD480521F8594B03-001/control-001/cores/collection1/data/index
[junit4] 2> 1127090 INFO (coreLoadExecutor-3231-thread-1-processing-n:127.0.0.1:52657_) [n:127.0.0.1:52657_ c:control_collection s:shard1 r:core_node1 x:collection1] o.a.s.u.RandomMergePolicy RandomMergePolicy wrapping class org.apache.lucene.index.AlcoholicMergePolicy: [AlcoholicMergePolicy: minMergeSize=0, mergeFactor=10, maxMergeSize=969340367, maxMergeSizeForForcedMerge=9223372036854775807, calibrateSizeByDeletes=true, maxMergeDocs=2147483647, maxCFSSegmentSizeMB=8.796093022207999E12, noCFSRatio=0.1]
[junit4] 2> 1127091 INFO (coreLoadExecutor-3231-thread-1-processing-n:127.0.0.1:52657_) [n:127.0.0.1:52657_ c:control_collection s:shard1 r:core_node1 x:collection1] o.a.s.c.SolrDeletionPolicy SolrDeletionPolicy.onCommit: commits: num=1
[junit4] 2> commit{dir=MockDirectoryWrapper(RAMDirectory@31631afc lockFactory=org.apache.lucene.store.SingleInstanceLockFactory@6180afb8),segFN=segments_1,generation=1}
[junit4] 2> 1127091 INFO (coreLoadExecutor-3231-thread-1-processing-n:127.0.0.1:52657_) [n:127.0.0.1:52657_ c:control_collection s:shard1 r:core_node1 x:collection1] o.a.s.c.SolrDeletionPolicy newest commit generation = 1
[junit4] 2> 1127091 INFO (OldIndexDirectoryCleanupThreadForCore-collection1) [n:127.0.0.1:52657_ c:control_collection s:shard1 r:core_node1 x:collection1] o.a.s.c.SolrCore Looking for old index directories to cleanup for core collection1 in /x1/jenkins/jenkins-slave/workspace/Lucene-Solr-Tests-5.x-Java7/solr/build/solr-core/test/J1/temp/solr.cloud.CollectionsAPIDistributedZkTest_AD480521F8594B03-001/control-001/cores/collection1/data/
[junit4] 2> 1127091 WARN (OldIndexDirectoryCleanupThreadForCore-collection1) [n:127.0.0.1:52657_ c:control_collection s:shard1 r:core_node1 x:collection1] o.a.s.c.DirectoryFactory /x1/jenkins/jenkins-slave/workspace/Lucene-Solr-Tests-5.x-Java7/solr/build/solr-core/test/J1/temp/solr.cloud.CollectionsAPIDistributedZkTest_AD480521F8594B03-001/control-001/cores/collection1/data/ does not point to a valid data directory; skipping clean-up of old index directories.
[junit4] 2> 1127096 INFO (coreLoadExecutor-3231-thread-1-processing-n:127.0.0.1:52657_) [n:127.0.0.1:52657_ c:control_collection s:shard1 r:core_node1 x:collection1] o.a.s.u.p.UpdateRequestProcessorChain creating updateRequestProcessorChain "nodistrib"
[junit4] 2> 1127096 INFO (coreLoadExecutor-3231-thread-1-processing-n:127.0.0.1:52657_) [n:127.0.0.1:52657_ c:control_collection s:shard1 r:core_node1 x:collection1] o.a.s.u.p.UpdateRequestProcessorChain creating updateRequestProcessorChain "dedupe"
[junit4] 2> 1127096 INFO (coreLoadExecutor-3231-thread-1-processing-n:127.0.0.1:52657_) [n:127.0.0.1:52657_ c:control_collection s:shard1 r:core_node1 x:collection1] o.a.s.u.p.UpdateRequestProcessorChain inserting DistributedUpdateProcessorFactory into updateRequestProcessorChain "dedupe"
[junit4] 2> 1127097 INFO (coreLoadExecutor-3231-thread-1-processing-n:127.0.0.1:52657_) [n:127.0.0.1:52657_ c:control_collection s:shard1 r:core_node1 x:collection1] o.a.s.u.p.UpdateRequestProcessorChain creating updateRequestProcessorChain "stored_sig"
[junit4] 2> 1127097 INFO (coreLoadExecutor-3231-thread-1-processing-n:127.0.0.1:52657_) [n:127.0.0.1:52657_ c:control_collection s:shard1 r:core_node1 x:collection1] o.a.s.u.p.UpdateRequestProcessorChain inserting DistributedUpdateProcessorFactory into updateRequestProcessorChain "stored_sig"
[junit4] 2> 1127097 INFO (coreLoadExecutor-3231-thread-1-processing-n:127.0.0.1:52657_) [n:127.0.0.1:52657_ c:control_collection s:shard1 r:core_node1 x:collection1] o.a.s.u.p.UpdateRequestProcessorChain creating updateRequestProcessorChain "distrib-dup-test-chain-explicit"
[junit4] 2> 1127097 INFO (coreLoadExecutor-3231-thread-1-processing-n:127.0.0.1:52657_) [n:127.0.0.1:52657_ c:control_collection s:shard1 r:core_node1 x:collection1] o.a.s.u.p.UpdateRequestProcessorChain creating updateRequestProcessorChain "distrib-dup-test-chain-implicit"
[junit4] 2> 1127097 INFO (coreLoadExecutor-3231-thread-1-processing-n:127.0.0.1:52657_) [n:127.0.0.1:52657_ c:control_collection s:shard1 r:core_node1 x:collection1] o.a.s.u.p.UpdateRequestProcessorChain inserting DistributedUpdateProcessorFactory into updateRequestProcessorChain "distrib-dup-test-chain-implicit"
[junit4] 2> 1127097 INFO (coreLoadExecutor-3231-thread-1-processing-n:127.0.0.1:52657_) [n:127.0.0.1:52657_ c:control_collection s:shard1 r:core_node1 x:collection1] o.a.s.c.SolrCore no updateRequestProcessorChain defined as default, creating implicit default
[junit4] 2> 1127097 WARN (coreLoadExecutor-3231-thread-1-processing-n:127.0.0.1:52657_) [n:127.0.0.1:52657_ c:control_collection s:shard1 r:core_node1 x:collection1] o.a.s.c.RequestHandlers INVALID paramSet a in requestHandler {type = requestHandler,name = /dump,class = DumpRequestHandler,args = {defaults={a=A,b=B}}}
[junit4] 2> 1127100 INFO (coreLoadExecutor-3231-thread-1-processing-n:127.0.0.1:52657_) [n:127.0.0.1:52657_ c:control_collection s:shard1 r:core_node1 x:collection1] o.a.s.h.l.XMLLoader xsltCacheLifetimeSeconds=60
[junit4] 2> 1127102 INFO (coreLoadExecutor-3231-thread-1-processing-n:127.0.0.1:52657_) [n:127.0.0.1:52657_ c:control_collection s:shard1 r:core_node1 x:collection1] o.a.s.h.l.XMLLoader xsltCacheLifetimeSeconds=60
[junit4] 2> 1127103 INFO (coreLoadExecutor-3231-thread-1-processing-n:127.0.0.1:52657_) [n:127.0.0.1:52657_ c:control_collection s:shard1 r:core_node1 x:collection1] o.a.s.h.l.XMLLoader xsltCacheLifetimeSeconds=60
[junit4] 2> 1127105 INFO (coreLoadExecutor-3231-thread-1-processing-n:127.0.0.1:52657_) [n:127.0.0.1:52657_ c:control_collection s:shard1 r:core_node1 x:collection1] o.a.s.h.l.XMLLoader xsltCacheLifetimeSeconds=60
[junit4] 2> 1127108 INFO (coreLoadExecutor-3231-thread-1-processing-n:127.0.0.1:52657_) [n:127.0.0.1:52657_ c:control_collection s:shard1 r:core_node1 x:collection1] o.a.s.c.RequestHandlers Registered paths: /admin/threads,/admin/system,/update/json/docs,/admin/mbeans,/admin/file,standard,/dump,/update/csv,/admin/logging,/schema,/replication,/admin/segments,/admin/plugins,/update/json,/config,/admin/properties,/admin/luke,/get,/admin/ping,/update
[junit4] 2> 1127110 INFO (coreLoadExecutor-3231-thread-1-processing-n:127.0.0.1:52657_) [n:127.0.0.1:52657_ c:control_collection s:shard1 r:core_node1 x:collection1] o.a.s.c.SolrCore Using default statsCache cache: org.apache.solr.search.stats.LocalStatsCache
[junit4] 2> 1127110 INFO (coreLoadExecutor-3231-thread-1-processing-n:127.0.0.1:52657_) [n:127.0.0.1:52657_ c:control_collection s:shard1 r:core_node1 x:collection1] o.a.s.u.UpdateHandler Using UpdateLog implementation: org.apache.solr.update.UpdateLog
[junit4] 2> 1127110 INFO (coreLoadExecutor-3231-thread-1-processing-n:127.0.0.1:52657_) [n:127.0.0.1:52657_ c:control_collection s:shard1 r:core_node1 x:collection1] o.a.s.u.UpdateLog Initializing UpdateLog: dataDir= defaultSyncLevel=FLUSH numRecordsToKeep=100 maxNumLogsToKeep=10 numVersionBuckets=65536
[junit4] 2> 1127111 INFO (coreLoadExecutor-3231-thread-1-processing-n:127.0.0.1:52657_) [n:127.0.0.1:52657_ c:control_collection s:shard1 r:core_node1 x:collection1] o.a.s.u.CommitTracker Hard AutoCommit: disabled
[junit4] 2> 1127111 INFO (coreLoadExecutor-3231-thread-1-processing-n:127.0.0.1:52657_) [n:127.0.0.1:52657_ c:control_collection s:shard1 r:core_node1 x:collection1] o.a.s.u.CommitTracker Soft AutoCommit: disabled
[junit4] 2> 1127112 INFO (coreLoadExecutor-3231-thread-1-processing-n:127.0.0.1:52657_) [n:127.0.0.1:52657_ c:control_collection s:shard1 r:core_node1 x:collection1] o.a.s.u.RandomMergePolicy RandomMergePolicy wrapping class org.apache.lucene.index.TieredMergePolicy: [TieredMergePolicy: maxMergeAtOnce=47, maxMergeAtOnceExplicit=35, maxMergedSegmentMB=6.494140625, floorSegmentMB=1.462890625, forceMergeDeletesPctAllowed=11.774637453027626, segmentsPerTier=43.0, maxCFSSegmentSizeMB=8.796093022207999E12, noCFSRatio=0.0
[junit4] 2> 1127112 INFO (coreLoadExecutor-3231-thread-1-processing-n:127.0.0.1:52657_) [n:127.0.0.1:52657_ c:control_collection s:shard1 r:core_node1 x:collection1] o.a.s.c.SolrDeletionPolicy SolrDeletionPolicy.onInit: commits: num=1
[junit4] 2> commit{dir=MockDirectoryWrapper(RAMDirectory@31631afc lockFactory=org.apache.lucene.store.SingleInstanceLockFactory@6180afb8),segFN=segments_1,generation=1}
[junit4] 2> 1127112 INFO (coreLoadExecutor-3231-thread-1-processing-n:127.0.0.1:52657_) [n:127.0.0.1:52657_ c:control_collection s:shard1 r:core_node1 x:collection1] o.a.s.c.SolrDeletionPolicy newest commit generation = 1
[junit4] 2> 1127112 INFO (coreLoadExecutor-3231-thread-1-processing-n:127.0.0.1:52657_) [n:127.0.0.1:52657_ c:control_collection s:shard1 r:core_node1 x:collection1] o.a.s.s.SolrIndexSearcher Opening Searcher@27680f52[collection1] main
[junit4] 2> 1127112 INFO (coreLoadExecutor-3231-thread-1-processing-n:127.0.0.1:52657_) [n:127.0.0.1:52657_ c:control_collection s:shard1 r:core_node1 x:collection1] o.a.s.c.c.ZkStateReader Load collection config from: [/collections/control_collection]
[junit4] 2> 1127113 INFO (coreLoadExecutor-3231-thread-1-processing-n:127.0.0.1:52657_) [n:127.0.0.1:52657_ c:control_collection s:shard1 r:core_node1 x:collection1] o.a.s.c.c.ZkStateReader path=[/collections/control_collection] [configName]=[conf1] specified config exists in ZooKeeper
[junit4] 2> 1127113 INFO (coreLoadExecutor-3231-thread-1-processing-n:127.0.0.1:52657_) [n:127.0.0.1:52657_ c:control_collection s:shard1 r:core_node1 x:collection1] o.a.s.r.ManagedResourceStorage Setting up ZooKeeper-based storage for the RestManager with znodeBase: /configs/conf1
[junit4] 2> 1127114 INFO (coreLoadExecutor-3231-thread-1-processing-n:127.0.0.1:52657_) [n:127.0.0.1:52657_ c:control_collection s:shard1 r:core_node1 x:collection1] o.a.s.r.ManagedResourceStorage Configured ZooKeeperStorageIO with znodeBase: /configs/conf1
[junit4] 2> 1127114 INFO (coreLoadExecutor-3231-thread-1-processing-n:127.0.0.1:52657_) [n:127.0.0.1:52657_ c:control_collection s:shard1 r:core_node1 x:collection1] o.a.s.r.RestManager Initializing RestManager with initArgs: {}
[junit4] 2> 1127114 INFO (coreLoadExecutor-3231-thread-1-processing-n:127.0.0.1:52657_) [n:127.0.0.1:52657_ c:control_collection s:shard1 r:core_node1 x:collection1] o.a.s.r.ManagedResourceStorage Reading _rest_managed.json using ZooKeeperStorageIO:path=/configs/conf1
[junit4] 2> 1127114 INFO (coreLoadExecutor-3231-thread-1-processing-n:127.0.0.1:52657_) [n:127.0.0.1:52657_ c:control_collection s:shard1 r:core_node1 x:collection1] o.a.s.r.ManagedResourceStorage No data found for znode /configs/conf1/_rest_managed.json
[junit4] 2> 1127115 INFO (coreLoadExecutor-3231-thread-1-processing-n:127.0.0.1:52657_) [n:127.0.0.1:52657_ c:control_collection s:shard1 r:core_node1 x:collection1] o.a.s.r.ManagedResourceStorage Loaded null at path _rest_managed.json using ZooKeeperStorageIO:path=/configs/conf1
[junit4] 2> 1127115 INFO (coreLoadExecutor-3231-thread-1-processing-n:127.0.0.1:52657_) [n:127.0.0.1:52657_ c:control_collection s:shard1 r:core_node1 x:collection1] o.a.s.r.RestManager Initializing 0 registered ManagedResources
[junit4] 2> 1127115 INFO (coreLoadExecutor-3231-thread-1-processing-n:127.0.0.1:52657_) [n:127.0.0.1:52657_ c:control_collection s:shard1 r:core_node1 x:collection1] o.a.s.h.ReplicationHandler Commits will be reserved for 10000
[junit4] 2> 1127117 INFO (searcherExecutor-3232-thread-1-processing-x:collection1 n:127.0.0.1:52657_ s:shard1 r:core_node1 c:control_collection) [n:127.0.0.1:52657_ c:control_collection s:shard1 r:core_node1 x:collection1] o.a.s.c.SolrCore [collection1] Registered new searcher Searcher@27680f52[collection1] main{ExitableDirectoryReader(UninvertingDirectoryReader())}
[junit4] 2> 1127117 INFO (coreLoadExecutor-3231-thread-1-processing-n:127.0.0.1:52657_) [n:127.0.0.1:52657_ c:control_collection s:shard1 r:core_node1 x:collection1] o.a.s.u.UpdateLog Looking up max value of version field to seed version buckets
[junit4] 2> 1127117 INFO (coreLoadExecutor-3231-thread-1-processing-n:127.0.0.1:52657_) [n:127.0.0.1:52657_ c:control_collection s:shard1 r:core_node1 x:collection1] o.a.s.u.VersionInfo Refreshing highest value of _version_ for 65536 version buckets from index
[junit4] 2> 1127117 INFO (coreLoadExecutor-3231-thread-1-processing-n:127.0.0.1:52657_) [n:127.0.0.1:52657_ c:control_collection s:shard1 r:core_node1 x:collection1] o.a.s.u.VersionInfo No terms found for _version_, cannot seed version bucket highest value from index
[junit4] 2> 1127117 INFO (coreLoadExecutor-3231-thread-1-processing-n:127.0.0.1:52657_) [n:127.0.0.1:52657_ c:control_collection s:shard1 r:core_node1 x:collection1] o.a.s.u.UpdateLog Could not find max version in index or recent updates, using new clock 1525621484618252288
[junit4] 2> 1127120 INFO (coreLoadExecutor-3231-thread-1-processing-n:127.0.0.1:52657_) [n:127.0.0.1:52657_ c:control_collection s:shard1 r:core_node1 x:collection1] o.a.s.u.UpdateLog Took 2.0ms to seed version buckets with highest version 1525621484618252288
[junit4] 2> 1127120 INFO (coreLoadExecutor-3231-thread-1-processing-n:127.0.0.1:52657_) [n:127.0.0.1:52657_ c:control_collection s:shard1 r:core_node1 x:collection1] o.a.s.c.ZkController watch zkdir /configs/conf1
[junit4] 2> 1127121 INFO (coreLoadExecutor-3231-thread-1-processing-n:127.0.0.1:52657_) [n:127.0.0.1:52657_ c:control_collection s:shard1 r:core_node1 x:collection1] o.a.s.c.CoreContainer registering core: collection1
[junit4] 2> 1127121 INFO (coreZkRegister-3225-thread-1-processing-x:collection1 n:127.0.0.1:52657_ s:shard1 r:core_node1 c:control_collection) [n:127.0.0.1:52657_ c:control_collection s:shard1 r:core_node1 x:collection1] o.a.s.c.ZkController Register replica - core:collection1 address:https://127.0.0.1:52657 collection:control_collection shard:shard1
[junit4] 2> 1127122 INFO (coreZkRegister-3225-thread-1-processing-x:collection1 n:127.0.0.1:52657_ s:shard1 r:core_node1 c:control_collection) [n:127.0.0.1:52657_ c:control_collection s:shard1 r:core_node1 x:collection1] o.a.s.c.c.SolrZkClient makePath: /collections/control_collection/leader_elect/shard1/election
[junit4] 2> 1127126 INFO (coreZkRegister-3225-thread-1-processing-x:collection1 n:127.0.0.1:52657_ s:shard1 r:core_node1 c:control_collection) [n:127.0.0.1:52657_ c:control_collection s:shard1 r:core_node1 x:collection1] o.a.s.c.LeaderElector Joined leadership election with path: /collections/control_collection/leader_elect/shard1/election/95351342663925767-core_node1-n_0000000000
[junit4] 2> 1127126 INFO (coreZkRegister-3225-thread-1-processing-x:collection1 n:127.0.0.1:52657_ s:shard1 r:core_node1 c:control_collection) [n:127.0.0.1:52657_ c:control_collection s:shard1 r:core_node1 x:collection1] o.a.s.c.ShardLeaderElectionContext Running the leader process for shard=shard1 and weAreReplacement=false and leaderVoteWait=180000
[junit4] 2> 1127128 INFO (coreZkRegister-3225-thread-1-processing-x:collection1 n:127.0.0.1:52657_ s:shard1 r:core_node1 c:control_collection) [n:127.0.0.1:52657_ c:control_collection s:shard1 r:core_node1 x:collection1] o.a.s.c.ShardLeaderElectionContext Enough replicas found to continue.
[junit4] 2> 1127128 INFO (coreZkRegister-3225-thread-1-processing-x:collection1 n:127.0.0.1:52657_ s:shard1 r:core_node1 c:control_collection) [n:127.0.0.1:52657_ c:control_collection s:shard1 r:core_node1 x:collection1] o.a.s.c.ShardLeaderElectionContext I may be the new leader - try and sync
[junit4] 2> 1127128 INFO (coreZkRegister-3225-thread-1-processing-x:collection1 n:127.0.0.1:52657_ s:shard1 r:core_node1 c:control_collection) [n:127.0.0.1:52657_ c:control_collection s:shard1 r:core_node1 x:collection1] o.a.s.c.SyncStrategy Sync replicas to https://127.0.0.1:52657/collection1/
[junit4] 2> 1127129 INFO (coreZkRegister-3225-thread-1-processing-x:collection1 n:127.0.0.1:52657_ s:shard1 r:core_node1 c:control_collection) [n:127.0.0.1:52657_ c:control_collection s:shard1 r:core_node1 x:collection1] o.a.s.c.SyncStrategy Sync Success - now sync replicas to me
[junit4] 2> 1127129 INFO (OverseerStateUpdate-95351342663925767-127.0.0.1:52657_-n_0000000000) [n:127.0.0.1:52657_ ] o.a.s.c.Overseer processMessage: queueSize: 1, message = {
[junit4] 2> "operation":"leader",
[junit4] 2> "shard":"shard1",
[junit4] 2> "collection":"control_collection"} current state version: 1
[junit4] 2> 1127129 INFO (coreZkRegister-3225-thread-1-processing-x:collection1 n:127.0.0.1:52657_ s:shard1 r:core_node1 c:control_collection) [n:127.0.0.1:52657_ c:control_collection s:shard1 r:core_node1 x:collection1] o.a.s.c.SyncStrategy https://127.0.0.1:52657/collection1/ has no replicas
[junit4] 2> 1127130 INFO (coreZkRegister-3225-thread-1-processing-x:collection1 n:127.0.0.1:52657_ s:shard1 r:core_node1 c:control_collection) [n:127.0.0.1:52657_ c:control_collection s:shard1 r:core_node1 x:collection1] o.a.s.c.c.SolrZkClient makePath: /collections/control_collection/leaders/shard1
[junit4] 2> 1127133 INFO (coreZkRegister-3225-thread-1-processing-x:collection1 n:127.0.0.1:52657_ s:shard1 r:core_node1 c:control_collection) [n:127.0.0.1:52657_ c:control_collection s:shard1 r:core_node1 x:collection1] o.a.s.c.ShardLeaderElectionContextBase Creating leader registration node
[junit4] 2> 1127136 INFO (coreZkRegister-3225-thread-1-processing-x:collection1 n:127.0.0.1:52657_ s:shard1 r:core_node1 c:control_collection) [n:127.0.0.1:52657_ c:control_collection s:shard1 r:core_node1 x:collection1] o.a.s.c.ShardLeaderElectionContext I am the new leader: https://127.0.0.1:52657/collection1/ shard1
[junit4] 2> 1127136 INFO (OverseerStateUpdate-95351342663925767-127.0.0.1:52657_-n_0000000000) [n:127.0.0.1:52657_ ] o.a.s.c.Overseer processMessage: queueSize: 1, message = {
[junit4] 2> "operation":"leader",
[junit4] 2> "shard":"shard1",
[junit4] 2> "collection":"control_collection",
[junit4] 2> "base_url":"https://127.0.0.1:52657",
[junit4] 2> "core":"collection1",
[junit4] 2> "state":"active"} current state version: 1
[junit4] 2> 1127217 INFO (TEST-CollectionsAPIDistributedZkTest.test-seed#[AD480521F8594B03]) [ ] o.a.s.c.c.SolrZkClient Using default ZkCredentialsProvider
[junit4] 2> 1127217 INFO (TEST-CollectionsAPIDistributedZkTest.test-seed#[AD480521F8594B03]) [ ] o.a.s.c.c.ConnectionManager Waiting for client to connect to ZooKeeper
[junit4] 2> 1127219 INFO (zkCallback-1209-thread-1) [ ] o.a.s.c.c.ConnectionManager Watcher org.apache.solr.common.cloud.ConnectionManager@1df9e1ec name:ZooKeeperConnection Watcher:127.0.0.1:49184/solr got event WatchedEvent state:SyncConnected type:None path:null path:null type:None
[junit4] 2> 1127220 INFO (TEST-CollectionsAPIDistributedZkTest.test-seed#[AD480521F8594B03]) [ ] o.a.s.c.c.ConnectionManager Client is connected to ZooKeeper
[junit4] 2> 1127220 INFO (TEST-CollectionsAPIDistributedZkTest.test-seed#[AD480521F8594B03]) [ ] o.a.s.c.c.SolrZkClient Using default ZkACLProvider
[junit4] 2> 1127220 INFO (TEST-CollectionsAPIDistributedZkTest.test-seed#[AD480521F8594B03]) [ ] o.a.s.c.c.ZkStateReader Updating cluster state from ZooKeeper...
[junit4] 2> 1127225 INFO (TEST-CollectionsAPIDistributedZkTest.test-seed#[AD480521F8594B03]) [ ] o.a.s.c.ChaosMonkey monkey: init - expire sessions:false cause connection loss:false
[junit4] 2> 1127239 INFO (zkCallback-1209-thread-1) [ ] o.a.s.c.c.ZkStateReader A cluster state change: [WatchedEvent state:SyncConnected type:NodeDataChanged path:/clusterstate.json], has occurred - updating... (live nodes size: [1])
[junit4] 2> 1127239 INFO (zkCallback-1207-thread-1-processing-n:127.0.0.1:52657_) [n:127.0.0.1:52657_ ] o.a.s.c.c.ZkStateReader A cluster state change: [WatchedEvent state:SyncConnected type:NodeDataChanged path:/clusterstate.json], has occurred - updating... (live nodes size: [1])
[junit4] 2> 1127287 INFO (coreZkRegister-3225-thread-1-processing-x:collection1 n:127.0.0.1:52657_ s:shard1 r:core_node1 c:control_collection) [n:127.0.0.1:52657_ c:control_collection s:shard1 r:core_node1 x:collection1] o.a.s.c.ZkController We are https://127.0.0.1:52657/collection1/ and leader is https://127.0.0.1:52657/collection1/
[junit4] 2> 1127287 INFO (coreZkRegister-3225-thread-1-processing-x:collection1 n:127.0.0.1:52657_ s:shard1 r:core_node1 c:control_collection) [n:127.0.0.1:52657_ c:control_collection s:shard1 r:core_node1 x:collection1] o.a.s.c.ZkController No LogReplay needed for core=collection1 baseURL=https://127.0.0.1:52657
[junit4] 2> 1127287 INFO (coreZkRegister-3225-thread-1-processing-x:collection1 n:127.0.0.1:52657_ s:shard1 r:core_node1 c:control_collection) [n:127.0.0.1:52657_ c:control_collection s:shard1 r:core_node1 x:collection1] o.a.s.c.ZkController I am the leader, no recovery necessary
[junit4] 2> 1127287 INFO (coreZkRegister-3225-thread-1-processing-x:collection1 n:127.0.0.1:52657_ s:shard1 r:core_node1 c:control_collection) [n:127.0.0.1:52657_ c:control_collection s:shard1 r:core_node1 x:collection1] o.a.s.c.ZkController publishing state=active
[junit4] 2> 1127287 INFO (coreZkRegister-3225-thread-1-processing-x:collection1 n:127.0.0.1:52657_ s:shard1 r:core_node1 c:control_collection) [n:127.0.0.1:52657_ c:control_collection s:shard1 r:core_node1 x:collection1] o.a.s.c.ZkController numShards not found on descriptor - reading it from system property
[junit4] 2> 1127290 INFO (OverseerStateUpdate-95351342663925767-127.0.0.1:52657_-n_0000000000) [n:127.0.0.1:52657_ ] o.a.s.c.Overseer processMessage: queueSize: 1, message = {
[junit4] 2> "roles":null,
[junit4] 2> "core":"collection1",
[junit4] 2> "base_url":"https://127.0.0.1:52657",
[junit4] 2> "node_name":"127.0.0.1:52657_",
[junit4] 2> "operation":"state",
[junit4] 2> "core_node_name":"core_node1",
[junit4] 2> "shard":"shard1",
[junit4] 2> "numShards":"2",
[junit4] 2> "state":"active",
[junit4] 2> "collection":"control_collection"} current state version: 2
[junit4] 2> 1127291 INFO (OverseerStateUpdate-95351342663925767-127.0.0.1:52657_-n_0000000000) [n:127.0.0.1:52657_ ] o.a.s.c.o.ReplicaMutator Update state numShards=2 message={
[junit4] 2> "roles":null,
[junit4] 2> "core":"collection1",
[junit4] 2> "base_url":"https://127.0.0.1:52657",
[junit4] 2> "node_name":"127.0.0.1:52657_",
[junit4] 2> "operation":"state",
[junit4] 2> "core_node_name":"core_node1",
[junit4] 2> "shard":"shard1",
[junit4] 2> "numShards":"2",
[junit4] 2> "state":"active",
[junit4] 2> "collection":"control_collection"}
[junit4] 2> 1127394 INFO (zkCallback-1207-thread-1-processing-n:127.0.0.1:52657_) [n:127.0.0.1:52657_ ] o.a.s.c.c.ZkStateReader A cluster state change: [WatchedEvent state:SyncConnected type:NodeDataChanged path:/clusterstate.json], has occurred - updating... (live nodes size: [1])
[junit4] 2> 1127394 INFO (zkCallback-1209-thread-1) [ ] o.a.s.c.c.ZkStateReader A cluster state change: [WatchedEvent state:SyncConnected type:NodeDataChanged path:/clusterstate.json], has occurred - updating... (live nodes size: [1])
[junit4] 2> 1127403 INFO (TEST-CollectionsAPIDistributedZkTest.test-seed#[AD480521F8594B03]) [ ] o.a.s.SolrTestCaseJ4 Writing core.properties file to /x1/jenkins/jenkins-slave/workspace/Lucene-Solr-Tests-5.x-Java7/solr/build/solr-core/test/J1/temp/solr.cloud.CollectionsAPIDistributedZkTest_AD480521F8594B03-001/shard-1-001/cores/collection1
[junit4] 2> 1127405 INFO (TEST-CollectionsAPIDistributedZkTest.test-seed#[AD480521F8594B03]) [ ] o.a.s.c.AbstractFullDistribZkTestBase create jetty 1 in directory /x1/jenkins/jenkins-slave/workspace/Lucene-Solr-Tests-5.x-Java7/solr/build/solr-core/test/J1/temp/solr.cloud.CollectionsAPIDistributedZkTest_AD480521F8594B03-001/shard-1-001
[junit4] 2> 1127407 INFO (TEST-CollectionsAPIDistributedZkTest.test-seed#[AD480521F8594B03]) [ ] o.e.j.s.Server jetty-9.2.13.v20150730
[junit4] 2> 1127409 INFO (TEST-CollectionsAPIDistributedZkTest.test-seed#[AD480521F8594B03]) [ ] o.e.j.s.h.ContextHandler Started o.e.j.s.ServletContextHandler@51ca6103{/,null,AVAILABLE}
[junit4] 2> 1127423 INFO (TEST-CollectionsAPIDistributedZkTest.test-seed#[AD480521F8594B03]) [ ] o.e.j.s.ServerConnector Started ServerConnector@2cc431f7{SSL-http/1.1}{127.0.0.1:46158}
[junit4] 2> 1127423 INFO (TEST-CollectionsAPIDistributedZkTest.test-seed#[AD480521F8594B03]) [ ] o.e.j.s.Server Started @1130204ms
[junit4] 2> 1127423 INFO (TEST-CollectionsAPIDistributedZkTest.test-seed#[AD480521F8594B03]) [ ] o.a.s.c.s.e.JettySolrRunner Jetty properties: {solr.data.dir=/x1/jenkins/jenkins-slave/workspace/Lucene-Solr-Tests-5.x-Java7/solr/build/solr-core/test/J1/temp/solr.cloud.CollectionsAPIDistributedZkTest_AD480521F8594B03-001/tempDir-001/jetty1, coreRootDirectory=/x1/jenkins/jenkins-slave/workspace/Lucene-Solr-Tests-5.x-Java7/solr/build/solr-core/test/J1/../../../../../../../../../../x1/jenkins/jenkins-slave/workspace/Lucene-Solr-Tests-5.x-Java7/solr/build/solr-core/test/J1/temp/solr.cloud.CollectionsAPIDistributedZkTest_AD480521F8594B03-001/shard-1-001/cores, hostPort=46158, hostContext=/, solrconfig=solrconfig.xml}
[junit4] 2> 1127423 INFO (TEST-CollectionsAPIDistributedZkTest.test-seed#[AD480521F8594B03]) [ ] o.a.s.s.SolrDispatchFilter SolrDispatchFilter.init(): sun.misc.Launcher$AppClassLoader@7b3cb2c6
[junit4] 2> 1127424 INFO (TEST-CollectionsAPIDistributedZkTest.test-seed#[AD480521F8594B03]) [ ] o.a.s.c.SolrResourceLoader new SolrResourceLoader for directory: '/x1/jenkins/jenkins-slave/workspace/Lucene-Solr-Tests-5.x-Java7/solr/build/solr-core/test/J1/temp/solr.cloud.CollectionsAPIDistributedZkTest_AD480521F8594B03-001/shard-1-001'
[junit4] 2> 1127424 INFO (TEST-CollectionsAPIDistributedZkTest.test-seed#[AD480521F8594B03]) [ ] o.a.s.c.SolrResourceLoader JNDI not configured for solr (NoInitialContextEx)
[junit4] 2> 1127424 INFO (TEST-CollectionsAPIDistributedZkTest.test-seed#[AD480521F8594B03]) [ ] o.a.s.c.SolrResourceLoader solr home defaulted to 'solr/' (could not find system property or JNDI)
[junit4] 2> 1127424 INFO (TEST-CollectionsAPIDistributedZkTest.test-seed#[AD480521F8594B03]) [ ] o.a.s.c.c.SolrZkClient Using default ZkCredentialsProvider
[junit4] 2> 1127425 INFO (TEST-CollectionsAPIDistributedZkTest.test-seed#[AD480521F8594B03]) [ ] o.a.s.c.c.ConnectionManager Waiting for client to connect to ZooKeeper
[junit4] 2> 1127428 INFO (zkCallback-1210-thread-1) [ ] o.a.s.c.c.ConnectionManager Watcher org.apache.solr.common.cloud.ConnectionManager@4db29d0e name:ZooKeeperConnection Watcher:127.0.0.1:49184/solr got event WatchedEvent state:SyncConnected type:None path:null path:null type:None
[junit4] 2> 1127428 INFO (TEST-CollectionsAPIDistributedZkTest.test-seed#[AD480521F8594B03]) [ ] o.a.s.c.c.ConnectionManager Client is connected to ZooKeeper
[junit4] 2> 1127428 INFO (TEST-CollectionsAPIDistributedZkTest.test-seed#[AD480521F8594B03]) [ ] o.a.s.c.c.SolrZkClient Using default ZkACLProvider
[junit4] 2> 1127430 INFO (TEST-CollectionsAPIDistributedZkTest.test-seed#[AD480521F8594B03]) [ ] o.a.s.s.SolrDispatchFilter Loading solr.xml from SolrHome (not found in ZooKeeper)
[junit4] 2> 1127430 INFO (TEST-CollectionsAPIDistributedZkTest.test-seed#[AD480521F8594B03]) [ ] o.a.s.c.SolrXmlConfig Loading container configuration from /x1/jenkins/jenkins-slave/workspace/Lucene-Solr-Tests-5.x-Java7/solr/build/solr-core/test/J1/temp/solr.cloud.CollectionsAPIDistributedZkTest_AD480521F8594B03-001/shard-1-001/solr.xml
[junit4] 2> 1127454 INFO (TEST-CollectionsAPIDistributedZkTest.test-seed#[AD480521F8594B03]) [ ] o.a.s.c.CorePropertiesLocator Config-defined core root directory: /x1/jenkins/jenkins-slave/workspace/Lucene-Solr-Tests-5.x-Java7/solr/build/solr-core/test/J1/../../../../../../../../../../x1/jenkins/jenkins-slave/workspace/Lucene-Solr-Tests-5.x-Java7/solr/build/solr-core/test/J1/temp/solr.cloud.CollectionsAPIDistributedZkTest_AD480521F8594B03-001/shard-1-001/cores
[junit4] 2> 1127454 INFO (TEST-CollectionsAPIDistributedZkTest.test-seed#[AD480521F8594B03]) [ ] o.a.s.c.CoreContainer New CoreContainer 4255817
[junit4] 2> 1127454 INFO (TEST-CollectionsAPIDistributedZkTest.test-seed#[AD480521F8594B03]) [ ] o.a.s.c.CoreContainer Loading cores into CoreContainer [instanceDir=/x1/jenkins/jenkins-slave/workspace/Lucene-Solr-Tests-5.x-Java7/solr/build/solr-core/test/J1/temp/solr.cloud.CollectionsAPIDistributedZkTest_AD480521F8594B03-001/shard-1-001]
[junit4] 2> 1127454 WARN (TEST-CollectionsAPIDistributedZkTest.test-seed#[AD480521F8594B03]) [ ] o.a.s.c.CoreContainer Couldn't add files from /x1/jenkins/jenkins-slave/workspace/Lucene-Solr-Tests-5.x-Java7/solr/build/solr-core/test/J1/temp/solr.cloud.CollectionsAPIDistributedZkTest_AD480521F8594B03-001/shard-1-001/lib to classpath: /x1/jenkins/jenkins-slave/workspace/Lucene-Solr-Tests-5.x-Java7/solr/build/solr-core/test/J1/temp/solr.cloud.CollectionsAPIDistributedZkTest_AD480521F8594B03-001/shard-1-001/lib
[junit4] 2> 1127455 INFO (TEST-CollectionsAPIDistributedZkTest.test-seed#[AD480521F8594B03]) [ ] o.a.s.h.c.HttpShardHandlerFactory created with socketTimeout : 90000,urlScheme : ,connTimeout : 15000,maxConnectionsPerHost : 20,maxConnections : 10000,corePoolSize : 0,maximumPoolSize : 2147483647,maxThreadIdleTime : 5,sizeOfQueue : -1,fairnessPolicy : false,useRetries : false,
[junit4] 2> 1127459 INFO (TEST-CollectionsAPIDistributedZkTest.test-seed#[AD480521F8594B03]) [ ] o.a.s.u.UpdateShardHandler Creating UpdateShardHandler HTTP client with params: socketTimeout=340000&connTimeout=45000&retry=true
[junit4] 2> 1127462 INFO (TEST-CollectionsAPIDistributedZkTest.test-seed#[AD480521F8594B03]) [ ] o.a.s.l.LogWatcher SLF4J impl is org.slf4j.impl.Log4jLoggerFactory
[junit4] 2> 1127462 INFO (TEST-CollectionsAPIDistributedZkTest.test-seed#[AD480521F8594B03]) [ ] o.a.s.l.LogWatcher Registering Log Listener [Log4j (org.slf4j.impl.Log4jLoggerFactory)]
[junit4] 2> 1127462 INFO (TEST-CollectionsAPIDistributedZkTest.test-seed#[AD480521F8594B03]) [ ] o.a.s.c.ZkContainer Zookeeper client=127.0.0.1:49184/solr
[junit4] 2> 1127462 INFO (TEST-CollectionsAPIDistributedZkTest.test-seed#[AD480521F8594B03]) [ ] o.a.s.c.ZkController zkHost includes chroot
[junit4] 2> 1127462 INFO (TEST-CollectionsAPIDistributedZkTest.test-seed#[AD480521F8594B03]) [ ] o.a.s.c.c.SolrZkClient Using default ZkCredentialsProvider
[junit4] 2> 1127463 INFO (TEST-CollectionsAPIDistributedZkTest.test-seed#[AD480521F8594B03]) [ ] o.a.s.c.c.ConnectionManager Waiting for client to connect to ZooKeeper
[junit4] 2> 1127465 INFO (zkCallback-1213-thread-1) [ ] o.a.s.c.c.ConnectionManager Watcher org.apache.solr.common.cloud.ConnectionManager@2a560028 name:ZooKeeperConnection Watcher:127.0.0.1:49184 got event WatchedEvent state:SyncConnected type:None path:null path:null type:None
[junit4] 2> 1127465 INFO (TEST-CollectionsAPIDistributedZkTest.test-seed#[AD480521F8594B03]) [ ] o.a.s.c.c.ConnectionManager Client is connected to ZooKeeper
[junit4] 2> 1127465 INFO (TEST-CollectionsAPIDistributedZkTest.test-seed#[AD480521F8594B03]) [ ] o.a.s.c.c.SolrZkClient Using default ZkACLProvider
[junit4] 2> 1127467 INFO (TEST-CollectionsAPIDistributedZkTest.test-seed#[AD480521F8594B03]) [n:127.0.0.1:46158_ ] o.a.s.c.c.ConnectionManager Waiting for client to connect to ZooKeeper
[junit4] 2> 1127468 INFO (zkCallback-1214-thread-1-processing-n:127.0.0.1:46158_) [n:127.0.0.1:46158_ ] o.a.s.c.c.ConnectionManager Watcher org.apache.solr.common.cloud.ConnectionManager@74c0e69f name:ZooKeeperConnection Watcher:127.0.0.1:49184/solr got event WatchedEvent state:SyncConnected type:None path:null path:null type:None
[junit4] 2> 1127468 INFO (TEST-CollectionsAPIDistributedZkTest.test-seed#[AD480521F8594B03]) [n:127.0.0.1:46158_ ] o.a.s.c.c.ConnectionManager Client is connected to ZooKeeper
[junit4] 2> 1127477 INFO (TEST-CollectionsAPIDistributedZkTest.test-seed#[AD480521F8594B03]) [n:127.0.0.1:46158_ ] o.a.s.c.c.ZkStateReader Updating cluster state from ZooKeeper...
[junit4] 2> 1128486 INFO (TEST-CollectionsAPIDistributedZkTest.test-seed#[AD480521F8594B03]) [n:127.0.0.1:46158_ ] o.a.s.c.ZkController Register node as live in ZooKeeper:/live_nodes/127.0.0.1:46158_
[junit4] 2> 1128486 INFO (TEST-CollectionsAPIDistributedZkTest.test-seed#[AD480521F8594B03]) [n:127.0.0.1:46158_ ] o.a.s.c.c.SolrZkClient makePath: /live_nodes/127.0.0.1:46158_
[junit4] 2> 1128488 INFO (zkCallback-1214-thread-1-processing-n:127.0.0.1:46158_) [n:127.0.0.1:46158_ ] o.a.s.c.c.ZkStateReader A live node change: [WatchedEvent state:SyncConnected type:NodeChildrenChanged path:/live_nodes], has occurred - updating... (live nodes size: [1])
[junit4] 2> 1128488 INFO (zkCallback-1209-thread-1) [ ] o.a.s.c.c.ZkStateReader A live node change: [WatchedEvent state:SyncConnected type:NodeChildrenChanged path:/live_nodes], has occurred - updating... (live nodes size: [1])
[junit4] 2> 1128488 INFO (zkCallback-1207-thread-1-processing-n:127.0.0.1:52657_) [n:127.0.0.1:52657_ ] o.a.s.c.c.ZkStateReader A live node change: [WatchedEvent state:SyncConnected type:NodeChildrenChanged path:/live_nodes], has occurred - updating... (live nodes size: [1])
[junit4] 2> 1128490 INFO (TEST-CollectionsAPIDistributedZkTest.test-seed#[AD480521F8594B03]) [n:127.0.0.1:46158_ ] o.a.s.c.Overseer Overseer (id=null) closing
[junit4] 2> 1128491 INFO (TEST-CollectionsAPIDistributedZkTest.test-seed#[AD480521F8594B03]) [n:127.0.0.1:46158_ ] o.a.s.c.LeaderElector Joined leadership election with path: /overseer_elect/election/95351342663925771-127.0.0.1:46158_-n_0000000001
[junit4] 2> 1128492 INFO (TEST-CollectionsAPIDistributedZkTest.test-seed#[AD480521F8594B03]) [n:127.0.0.1:46158_ ] o.a.s.c.LeaderElector Watching path /overseer_elect/election/95351342663925767-127.0.0.1:52657_-n_0000000000 to know if I could be the leader
[junit4] 2> 1128544 INFO (TEST-CollectionsAPIDistributedZkTest.test-seed#[AD480521F8594B03]) [n:127.0.0.1:46158_ ] o.a.s.c.CoreContainer Security conf doesn't exist. Skipping setup for authorization module.
[junit4] 2> 1128544 INFO (TEST-CollectionsAPIDistributedZkTest.test-seed#[AD480521F8594B03]) [n:127.0.0.1:46158_ ] o.a.s.c.CoreContainer No authentication plugin used.
[junit4] 2> 1128545 INFO (TEST-CollectionsAPIDistributedZkTest.test-seed#[AD480521F8594B03]) [n:127.0.0.1:46158_ ] o.a.s.c.CorePropertiesLocator Looking for core definitions underneath /x1/jenkins/jenkins-slave/workspace/Lucene-Solr-Tests-5.x-Java7/solr/build/solr-core/test/J1/../../../../../../../../../../x1/jenkins/jenkins-slave/workspace/Lucene-Solr-Tests-5.x-Java7/solr/build/solr-core/test/J1/temp/solr.cloud.CollectionsAPIDistributedZkTest_AD480521F8594B03-001/shard-1-001/cores
[junit4] 2> 1128546 INFO (TEST-CollectionsAPIDistributedZkTest.test-seed#[AD480521F8594B03]) [n:127.0.0.1:46158_ ] o.a.s.c.CoreDescriptor Created CoreDescriptor: {schema=schema.xml, transient=false, name=collection1, dataDir=data/, config=solrconfig.xml, collection=collection1, shard=, configSetProperties=configsetprops.json, coreNodeName=, loadOnStartup=true}
[junit4] 2> 1128546 INFO (TEST-CollectionsAPIDistributedZkTest.test-seed#[AD480521F8594B03]) [n:127.0.0.1:46158_ ] o.a.s.c.CorePropertiesLocator Found core collection1 in /x1/jenkins/jenkins-slave/workspace/Lucene-Solr-Tests-5.x-Java7/solr/build/solr-core/test/J1/../../../../../../../../../../x1/jenkins/jenkins-slave/workspace/Lucene-Solr-Tests-5.x-Java7/solr/build/solr-core/test/J1/temp/solr.cloud.CollectionsAPIDistributedZkTest_AD480521F8594B03-001/shard-1-001/cores/collection1
[junit4] 2> 1128546 INFO (TEST-CollectionsAPIDistributedZkTest.test-seed#[AD480521F8594B03]) [n:127.0.0.1:46158_ ] o.a.s.c.CorePropertiesLocator Found 1 core definitions
[junit4] 2> 1128548 INFO (TEST-CollectionsAPIDistributedZkTest.test-seed#[AD480521F8594B03]) [n:127.0.0.1:46158_ ] o.a.s.s.SolrDispatchFilter user.dir=/x1/jenkins/jenkins-slave/workspace/Lucene-Solr-Tests-5.x-Java7/solr/build/solr-core/test/J1
[junit4] 2> 1128548 INFO (TEST-CollectionsAPIDistributedZkTest.test-seed#[AD480521F8594B03]) [n:127.0.0.1:46158_ ] o.a.s.s.SolrDispatchFilter SolrDispatchFilter.init() done
[junit4] 2> 1128549 INFO (coreLoadExecutor-3242-thread-1-processing-n:127.0.0.1:46158_) [n:127.0.0.1:46158_ c:collection1 x:collection1] o.a.s.c.ZkController publishing state=down
[junit4] 2> 1128549 INFO (coreLoadExecutor-3242-thread-1-processing-n:127.0.0.1:46158_) [n:127.0.0.1:46158_ c:collection1 x:collection1] o.a.s.c.ZkController numShards not found on descriptor - reading it from system property
[junit4] 2> 1128552 INFO (OverseerStateUpdate-95351342663925767-127.0.0.1:52657_-n_0000000000) [n:127.0.0.1:52657_ ] o.a.s.c.Overseer processMessage: queueSize: 1, message = {
[junit4] 2> "roles":null,
[junit4] 2> "core":"collection1",
[junit4] 2> "base_url":"https://127.0.0.1:46158",
[junit4] 2> "node_name":"127.0.0.1:46158_",
[junit4] 2> "operation":"state",
[junit4] 2> "shard":null,
[junit4] 2> "numShards":"2",
[junit4] 2> "state":"down",
[junit4] 2> "collection":"collection1"} current state version: 3
[junit4] 2> 1128552 INFO (coreLoadExecutor-3242-thread-1-processing-n:127.0.0.1:46158_) [n:127.0.0.1:46158_ c:collection1 x:collection1] o.a.s.c.ZkController look for our core node name
[junit4] 2> 1128553 INFO (OverseerStateUpdate-95351342663925767-127.0.0.1:52657_-n_0000000000) [n:127.0.0.1:52657_ ] o.a.s.c.o.ReplicaMutator Update state numShards=2 message={
[junit4] 2> "roles":null,
[junit4] 2> "core":"collection1",
[junit4] 2> "base_url":"https://127.0.0.1:46158",
[junit4] 2> "node_name":"127.0.0.1:46158_",
[junit4] 2> "operation":"state",
[junit4] 2> "shard":null,
[junit4] 2> "numShards":"2",
[junit4] 2> "state":"down",
[junit4] 2> "collection":"collection1"}
[junit4] 2> 1128553 INFO (OverseerStateUpdate-95351342663925767-127.0.0.1:52657_-n_0000000000) [n:127.0.0.1:52657_ ] o.a.s.c.o.ClusterStateMutator building a new cName: collection1
[junit4] 2> 1128553 INFO (OverseerStateUpdate-95351342663925767-127.0.0.1:52657_-n_0000000000) [n:127.0.0.1:52657_ ] o.a.s.c.o.ReplicaMutator Assigning new node to shard shard=shard2
[junit4] 2> 1128657 INFO (zkCallback-1209-thread-1) [ ] o.a.s.c.c.ZkStateReader A cluster state change: [WatchedEvent state:SyncConnected type:NodeDataChanged path:/clusterstate.json], has occurred - updating... (live nodes size: [2])
[junit4] 2> 1128657 INFO (zkCallback-1214-thread-1-processing-n:127.0.0.1:46158_) [n:127.0.0.1:46158_ ] o.a.s.c.c.ZkStateReader A cluster state change: [WatchedEvent state:SyncConnected type:NodeDataChanged path:/clusterstate.json], has occurred - updating... (live nodes size: [2])
[junit4] 2> 1128657 INFO (zkCallback-1207-thread-1-processing-n:127.0.0.1:52657_) [n:127.0.0.1:52657_ ] o.a.s.c.c.ZkStateReader A cluster state change: [WatchedEvent state:SyncConnected type:NodeDataChanged path:/clusterstate.json], has occurred - updating... (live nodes size: [2])
[junit4] 2> 1129553 INFO (coreLoadExecutor-3242-thread-1-processing-n:127.0.0.1:46158_) [n:127.0.0.1:46158_ c:collection1 x:collection1] o.a.s.c.ZkController waiting to find shard id in clusterstate for collection1
[junit4] 2> 1129553 INFO (coreLoadExecutor-3242-thread-1-processing-n:127.0.0.1:46158_) [n:127.0.0.1:46158_ c:collection1 x:collection1] o.a.s.c.ZkController Check for collection zkNode:collection1
[junit4] 2> 1129553 INFO (coreLoadExecutor-3242-thread-1-processing-n:127.0.0.1:46158_) [n:127.0.0.1:46158_ c:collection1 x:collection1] o.a.s.c.ZkController Collection zkNode exists
[junit4] 2> 1129553 INFO (coreLoadExecutor-3242-thread-1-processing-n:127.0.0.1:46158_) [n:127.0.0.1:46158_ c:collection1 x:collection1] o.a.s.c.c.ZkStateReader Load collection config from: [/collections/collection1]
[junit4] 2> 1129554 INFO (coreLoadExecutor-3242-thread-1-processing-n:127.0.0.1:46158_) [n:127.0.0.1:46158_ c:collection1 x:collection1] o.a.s.c.c.ZkStateReader path=[/collections/collection1] [configName]=[conf1] specified config exists in ZooKeeper
[junit4] 2> 1129554 INFO (coreLoadExecutor-3242-thread-1-processing-n:127.0.0.1:46158_) [n:127.0.0.1:46158_ c:collection1 x:collection1] o.a.s.c.SolrResourceLoader new SolrResourceLoader for directory: '/x1/jenkins/jenkins-slave/workspace/Lucene-Solr-Tests-5.x-Java7/solr/build/solr-core/test/J1/temp/solr.cloud.CollectionsAPIDistributedZkTest_AD480521F8594B03-001/shard-1-001/cores/collecti
[...truncated too long message...]
ue(Overseer.java:892)
[junit4] 2> at org.apache.solr.cloud.ShardLeaderElectionContext.runLeaderProcess(ElectionContext.java:303)
[junit4] 2> at org.apache.solr.cloud.LeaderElector.runIamLeaderProcess(LeaderElector.java:197)
[junit4] 2> at org.apache.solr.cloud.LeaderElector.checkIfIamLeader(LeaderElector.java:157)
[junit4] 2> at org.apache.solr.cloud.LeaderElector.joinElection(LeaderElector.java:346)
[junit4] 2> at org.apache.solr.cloud.LeaderElector.joinElection(LeaderElector.java:255)
[junit4] 2> at org.apache.solr.cloud.ShardLeaderElectionContext.rejoinLeaderElection(ElectionContext.java:657)
[junit4] 2> at org.apache.solr.cloud.ShardLeaderElectionContext.runLeaderProcess(ElectionContext.java:329)
[junit4] 2> at org.apache.solr.cloud.LeaderElector.runIamLeaderProcess(LeaderElector.java:197)
[junit4] 2> at org.apache.solr.cloud.LeaderElector.checkIfIamLeader(LeaderElector.java:157)
[junit4] 2> at org.apache.solr.cloud.LeaderElector.access$200(LeaderElector.java:58)
[junit4] 2> at org.apache.solr.cloud.LeaderElector$ElectionWatcher.process(LeaderElector.java:388)
[junit4] 2> at org.apache.solr.common.cloud.SolrZkClient$3$1.run(SolrZkClient.java:264)
[junit4] 2> at java.util.concurrent.Executors$RunnableAdapter.call(Executors.java:471)
[junit4] 2> at java.util.concurrent.FutureTask.run(FutureTask.java:262)
[junit4] 2> at org.apache.solr.common.util.ExecutorUtil$MDCAwareThreadPoolExecutor$1.run(ExecutorUtil.java:231)
[junit4] 2> at java.util.concurrent.ThreadPoolExecutor.runWorker(ThreadPoolExecutor.java:1145)
[junit4] 2> at java.util.concurrent.ThreadPoolExecutor$Worker.run(ThreadPoolExecutor.java:615)
[junit4] 2> at java.lang.Thread.run(Thread.java:745)
[junit4] 2> Caused by: org.apache.zookeeper.KeeperException$SessionExpiredException: KeeperErrorCode = Session expired for /overseer
[junit4] 2> at org.apache.zookeeper.KeeperException.create(KeeperException.java:127)
[junit4] 2> at org.apache.zookeeper.KeeperException.create(KeeperException.java:51)
[junit4] 2> at org.apache.zookeeper.ZooKeeper.create(ZooKeeper.java:783)
[junit4] 2> at org.apache.solr.common.cloud.SolrZkClient$9.execute(SolrZkClient.java:380)
[junit4] 2> at org.apache.solr.common.cloud.SolrZkClient$9.execute(SolrZkClient.java:377)
[junit4] 2> at org.apache.solr.common.cloud.ZkCmdExecutor.retryOperation(ZkCmdExecutor.java:60)
[junit4] 2> at org.apache.solr.common.cloud.SolrZkClient.create(SolrZkClient.java:377)
[junit4] 2> at org.apache.solr.cloud.Overseer.createOverseerNode(Overseer.java:948)
[junit4] 2> ... 20 more
[junit4] 2> 1154571 INFO (TEST-CollectionsAPIDistributedZkTest.test-seed#[AD480521F8594B03]) [ ] o.e.j.s.ServerConnector Stopped ServerConnector@108b4668{SSL-http/1.1}{127.0.0.1:0}
[junit4] 2> 1154571 INFO (TEST-CollectionsAPIDistributedZkTest.test-seed#[AD480521F8594B03]) [ ] o.e.j.s.h.ContextHandler Stopped o.e.j.s.ServletContextHandler@2cb07e56{/,null,UNAVAILABLE}
[junit4] 2> 1154573 INFO (TEST-CollectionsAPIDistributedZkTest.test-seed#[AD480521F8594B03]) [n:127.0.0.1:59960_ c:nodes_used_collection s:shard1 r:core_node4 x:nodes_used_collection_shard1_replica2] o.a.s.c.ZkTestServer connecting to 127.0.0.1:49184 49184
[junit4] 2> 1154788 INFO (Thread-3552) [ ] o.a.s.c.ZkTestServer connecting to 127.0.0.1:49184 49184
[junit4] 2> 1154788 WARN (Thread-3552) [ ] o.a.s.c.ZkTestServer Watch limit violations:
[junit4] 2> Maximum concurrent create/delete watches above limit:
[junit4] 2>
[junit4] 2> 7 /solr/aliases.json
[junit4] 2> 5 /solr/security.json
[junit4] 2> 5 /solr/configs/conf1
[junit4] 2>
[junit4] 2> Maximum concurrent data watches above limit:
[junit4] 2>
[junit4] 2> 7 /solr/clusterstate.json
[junit4] 2> 4 /solr/collections/nodes_used_collection/state.json
[junit4] 2>
[junit4] 2> Maximum concurrent children watches above limit:
[junit4] 2>
[junit4] 2> 7 /solr/live_nodes
[junit4] 2> 7 /solr/collections
[junit4] 2> 5 /solr/overseer/collection-queue-work
[junit4] 2> 4 /solr/overseer/queue
[junit4] 2>
[junit4] 2> NOTE: reproduce with: ant test -Dtestcase=CollectionsAPIDistributedZkTest -Dtests.method=test -Dtests.seed=AD480521F8594B03 -Dtests.multiplier=2 -Dtests.slow=true -Dtests.locale=ar-SD -Dtests.timezone=Mideast/Riyadh87 -Dtests.asserts=true -Dtests.file.encoding=UTF-8
[junit4] FAILURE 29.6s J1 | CollectionsAPIDistributedZkTest.test <<<
[junit4] > Throwable #1: java.lang.AssertionError
[junit4] > at __randomizedtesting.SeedInfo.seed([AD480521F8594B03:251C3AFB56A526FB]:0)
[junit4] > at org.apache.solr.cloud.CollectionsAPIDistributedZkTest.testNoConfigSetExist(CollectionsAPIDistributedZkTest.java:511)
[junit4] > at org.apache.solr.cloud.CollectionsAPIDistributedZkTest.test(CollectionsAPIDistributedZkTest.java:158)
[junit4] > at org.apache.solr.BaseDistributedSearchTestCase$ShardsRepeatRule$ShardsFixedStatement.callStatement(BaseDistributedSearchTestCase.java:964)
[junit4] > at org.apache.solr.BaseDistributedSearchTestCase$ShardsRepeatRule$ShardsStatement.evaluate(BaseDistributedSearchTestCase.java:939)
[junit4] > at java.lang.Thread.run(Thread.java:745)
[junit4] 2> 1154792 INFO (SUITE-CollectionsAPIDistributedZkTest-seed#[AD480521F8594B03]-worker) [n:127.0.0.1:59960_ c:nodes_used_collection s:shard1 r:core_node4 x:nodes_used_collection_shard1_replica2] o.a.s.SolrTestCaseJ4 ###deleteCore
[junit4] 2> NOTE: leaving temporary files on disk at: /x1/jenkins/jenkins-slave/workspace/Lucene-Solr-Tests-5.x-Java7/solr/build/solr-core/test/J1/temp/solr.cloud.CollectionsAPIDistributedZkTest_AD480521F8594B03-001
[junit4] 2> NOTE: test params are: codec=Asserting(Lucene54), sim=DefaultSimilarity, locale=ar-SD, timezone=Mideast/Riyadh87
[junit4] 2> NOTE: Linux 3.13.0-52-generic amd64/Oracle Corporation 1.7.0_80 (64-bit)/cpus=4,threads=1,free=66194416,total=448266240
[junit4] 2> NOTE: All tests run in this JVM: [TestWordDelimiterFilterFactory, TestMiniSolrCloudClusterSSL, SpellCheckCollatorTest, TestReloadDeadlock, BigEndianAscendingWordSerializerTest, ClusterStateUpdateTest, DistanceUnitsTest, TestDFRSimilarityFactory, DocExpirationUpdateProcessorFactoryTest, TestLFUCache, DOMUtilTest, CollectionTooManyReplicasTest, TestReplicaProperties, TestClassNameShortening, DirectSolrSpellCheckerTest, DocumentBuilderTest, SolrCmdDistributorTest, TestMiniSolrCloudCluster, HdfsDirectoryTest, TestLMJelinekMercerSimilarityFactory, TestDefaultStatsCache, DistribJoinFromCollectionTest, TestBM25SimilarityFactory, AliasIntegrationTest, NumericFieldsTest, EnumFieldTest, AnalysisErrorHandlingTest, SortByFunctionTest, TestQuerySenderNoQuery, TestManagedStopFilterFactory, TestConfigSets, SolrIndexSplitterTest, HighlighterTest, TestUseDocValuesAsStored, MBeansHandlerTest, HdfsWriteToMultipleCollectionsTest, LoggingHandlerTest, AnalyticsQueryTest, TestStressUserVersions, TestSurroundQueryParser, TestUpdate, TermsComponentTest, HdfsThreadLeakTest, ZkSolrClientTest, UniqFieldsUpdateProcessorFactoryTest, SpatialHeatmapFacetsTest, ZkCLITest, PKIAuthenticationIntegrationTest, SSLMigrationTest, TestInfoStreamLogging, OpenCloseCoreStressTest, PreAnalyzedUpdateProcessorTest, DeleteInactiveReplicaTest, FullHLLTest, AsyncMigrateRouteKeyTest, TriLevelCompositeIdRoutingTest, ShardRoutingTest, WordBreakSolrSpellCheckerTest, TestDistributedGrouping, TestQueryTypes, TestNoOpRegenerator, MoreLikeThisHandlerTest, FastVectorHighlighterTest, TestHashPartitioner, TestSchemaSimilarityResource, SharedFSAutoReplicaFailoverTest, TestConfigOverlay, ConjunctionSolrSpellCheckerTest, SolrInfoMBeanTest, TestSolrQueryResponse, SchemaVersionSpecificBehaviorTest, IndexBasedSpellCheckerTest, TestManagedSchemaDynamicFieldResource, TestCodecSupport, TestTrackingShardHandlerFactory, TestDocumentBuilder, AddSchemaFieldsUpdateProcessorFactoryTest, MinimalSchemaTest, TestManagedResourceStorage, TestExclusionRuleCollectionAccess, BlockCacheTest, TestSolrCLIRunExample, SoftAutoCommitTest, CoreMergeIndexesAdminHandlerTest, NotRequiredUniqueKeyTest, RankQueryTest, OpenExchangeRatesOrgProviderTest, TestNonDefinedSimilarityFactory, TestFileDictionaryLookup, SpellCheckComponentTest, OverseerCollectionConfigSetProcessorTest, SolrCloudExampleTest, BasicDistributedZkTest, ChaosMonkeySafeLeaderTest, BasicDistributedZk2Test, CollectionsAPIDistributedZkTest]
[junit4] Completed [270/566 (1!)] on J1 in 29.61s, 1 test, 1 failure <<< FAILURES!
[...truncated 947 lines...]
BUILD FAILED
/x1/jenkins/jenkins-slave/workspace/Lucene-Solr-Tests-5.x-Java7/build.xml:750: The following error occurred while executing this line:
/x1/jenkins/jenkins-slave/workspace/Lucene-Solr-Tests-5.x-Java7/build.xml:694: The following error occurred while executing this line:
/x1/jenkins/jenkins-slave/workspace/Lucene-Solr-Tests-5.x-Java7/build.xml:59: The following error occurred while executing this line:
/x1/jenkins/jenkins-slave/workspace/Lucene-Solr-Tests-5.x-Java7/solr/build.xml:233: The following error occurred while executing this line:
/x1/jenkins/jenkins-slave/workspace/Lucene-Solr-Tests-5.x-Java7/solr/common-build.xml:534: The following error occurred while executing this line:
/x1/jenkins/jenkins-slave/workspace/Lucene-Solr-Tests-5.x-Java7/lucene/common-build.xml:1477: The following error occurred while executing this line:
/x1/jenkins/jenkins-slave/workspace/Lucene-Solr-Tests-5.x-Java7/lucene/common-build.xml:1033: There were test failures: 566 suites (7 ignored), 2268 tests, 1 failure, 56 ignored (41 assumptions) [seed: AD480521F8594B03]
Total time: 64 minutes 36 seconds
Build step 'Invoke Ant' marked build as failure
Archiving artifacts
Recording test results
Email was triggered for: Failure - Any
Sending email for trigger: Failure - Any