You are viewing a plain text version of this content. The canonical link for it is here.
Posted to builds@beam.apache.org by Apache Jenkins Server <je...@builds.apache.org> on 2020/08/28 06:07:17 UTC
Build failed in Jenkins: beam_PostCommit_Website_Test #4354
See <https://ci-beam.apache.org/job/beam_PostCommit_Website_Test/4354/display/redirect?page=changes>
Changes:
[ningk] [BEAM-10827] Fix forward the google-cloud-core version
[Valentyn Tymofieiev] [BEAM-8551] Verify that installed python packages don't have conflicting
[Valentyn Tymofieiev] Upgrade TF to 2.3.0.
[noreply] Merge pull request #12492 from [BEAM-6807] Implement an Azure blobstore
[noreply] Merge pull request #12661 from Add export FHIR resources to GCS IO
------------------------------------------
Started by timer
Running as SYSTEM
[EnvInject] - Loading node environment variables.
Building remotely on websites1 (git-websites svn-websites) in workspace <https://ci-beam.apache.org/job/beam_PostCommit_Website_Test/ws/>
No credentials specified
Wiping out workspace first.
Cloning the remote Git repository
Cloning repository https://github.com/apache/beam.git
> git init <https://ci-beam.apache.org/job/beam_PostCommit_Website_Test/ws/src> # timeout=10
Fetching upstream changes from https://github.com/apache/beam.git
> git --version # timeout=10
> git fetch --tags --progress -- https://github.com/apache/beam.git +refs/heads/*:refs/remotes/origin/* # timeout=10
> git config remote.origin.url https://github.com/apache/beam.git # timeout=10
> git config --add remote.origin.fetch +refs/heads/*:refs/remotes/origin/* # timeout=10
> git config remote.origin.url https://github.com/apache/beam.git # timeout=10
Fetching upstream changes from https://github.com/apache/beam.git
> git fetch --tags --progress -- https://github.com/apache/beam.git +refs/heads/*:refs/remotes/origin/* +refs/pull/${ghprbPullId}/*:refs/remotes/origin/pr/${ghprbPullId}/* # timeout=10
> git rev-parse origin/master^{commit} # timeout=10
Checking out Revision d80b4bc50ebc6ec7706450c82a714315a61dcc1b (origin/master)
> git config core.sparsecheckout # timeout=10
> git checkout -f d80b4bc50ebc6ec7706450c82a714315a61dcc1b # timeout=10
Commit message: "[BEAM-8551] Verify that installed python packages don't have conflicting requirements. (#12714)"
> git rev-list --no-walk d89bbfa5ad7e392371c85586fae94334e8ca9a87 # timeout=10
No emails were triggered.
[EnvInject] - Executing scripts and injecting environment variables after the SCM step.
[EnvInject] - Injecting as environment variables the properties content
SPARK_LOCAL_IP=127.0.0.1
[EnvInject] - Variables injected successfully.
[Gradle] - Launching build.
[src] $ <https://ci-beam.apache.org/job/beam_PostCommit_Website_Test/ws/src/gradlew> --continue --max-workers=12 -Dorg.gradle.jvmargs=-Xms2g -Dorg.gradle.jvmargs=-Xmx4g -Pdocker-pull-licenses :website:testWebsite -PdisableExternal=false
To honour the JVM settings for this build a new JVM will be forked. Please consider using the daemon: https://docs.gradle.org/5.2.1/userguide/gradle_daemon.html.
Daemon will be stopped at the end of the build stopping after processing
> Task :buildSrc:compileJava NO-SOURCE
> Task :buildSrc:compileGroovy FROM-CACHE
> Task :buildSrc:pluginDescriptors
> Task :buildSrc:processResources
> Task :buildSrc:classes
> Task :buildSrc:jar
> Task :buildSrc:assemble
> Task :buildSrc:spotlessGroovy
> Task :buildSrc:spotlessGroovyCheck
> Task :buildSrc:spotlessGroovyGradle
> Task :buildSrc:spotlessGroovyGradleCheck
> Task :buildSrc:spotlessCheck
> Task :buildSrc:pluginUnderTestMetadata
> Task :buildSrc:compileTestJava NO-SOURCE
> Task :buildSrc:compileTestGroovy NO-SOURCE
> Task :buildSrc:processTestResources NO-SOURCE
> Task :buildSrc:testClasses UP-TO-DATE
> Task :buildSrc:test NO-SOURCE
> Task :buildSrc:validateTaskProperties FROM-CACHE
> Task :buildSrc:check
> Task :buildSrc:build
Configuration on demand is an incubating feature.
> Task :website:buildDockerImage
Sending build context to Docker daemon 48.37MB
Step 1/8 : FROM debian:stretch-slim
---> 8ff748cdd6b1
Step 2/8 : SHELL ["/bin/bash", "-o", "pipefail", "-e", "-u", "-x", "-c"]
---> Using cache
---> e34c4df1e02e
Step 3/8 : ENV DEBIAN_FRONTEND=noninteractive LANGUAGE=C.UTF-8 LANG=C.UTF-8 LC_ALL=C.UTF-8 LC_CTYPE=C.UTF-8 LC_MESSAGES=C.UTF-8
---> Using cache
---> 757069dfbc50
Step 4/8 : RUN apt-get update && apt-get install -y --no-install-recommends ca-certificates curl git gnupg2 gosu lynx && apt-get autoremove -yqq --purge && apt-get clean && rm -rf /var/lib/apt/lists/*
---> Using cache
---> 296e1e0d5cf8
Step 5/8 : RUN curl -sL https://deb.nodesource.com/setup_10.x | bash - && apt-get update && apt-get install -y --no-install-recommends nodejs && apt-get autoremove -yqq --purge && apt-get clean && rm -rf /var/lib/apt/lists/*
---> Using cache
---> 8e22d2bec517
Step 6/8 : RUN curl -sS https://dl.yarnpkg.com/debian/pubkey.gpg | apt-key add - && echo "deb https://dl.yarnpkg.com/debian/ stable main" | tee /etc/apt/sources.list.d/yarn.list && apt-get update && apt-get install -y --no-install-recommends yarn && apt-get autoremove -yqq --purge && apt-get clean && rm -rf /var/lib/apt/lists/*
---> Using cache
---> 5a2a0e98de69
Step 7/8 : RUN HUGOHOME="$(mktemp -d)" && export HUGOHOME && curl -sL https://github.com/gohugoio/hugo/releases/download/v0.68.3/hugo_extended_0.68.3_Linux-64bit.tar.gz > "${HUGOHOME}/hugo.tar.gz" && tar -xzvf "${HUGOHOME}/hugo.tar.gz" hugo && mv hugo /usr/local/bin/hugo && chmod +x /usr/local/bin/hugo && rm -r "${HUGOHOME}"
---> Using cache
---> 4383f962e28a
Step 8/8 : WORKDIR /opt/
---> Using cache
---> 47a979744ea8
Successfully built 47a979744ea8
Successfully tagged beam-website:latest
> Task :website:createDockerContainer
> Task :website:startDockerContainer
979a4edb4399bd43d09838751a1681d8da79b3cd60dc87e46555ef82802344ca
> Task :website:setupDockerContainer
> Task :website:installDependencies
yarn install v1.22.4
warning Skipping preferred cache folder "/.cache/yarn" because it is not writable.
warning Selected the next writable cache folder in the list, will be "/tmp/.yarn-cache-910".
[1/4] Resolving packages...
[2/4] Fetching packages...
info fsevents@2.1.3: The platform "linux" is incompatible with this module.
info "fsevents@2.1.3" is an optional dependency and failed compatibility check. Excluding it from installation.
[3/4] Linking dependencies...
info Visit https://yarnpkg.com/en/docs/cli/install for documentation about this command.
error Could not write file "/opt/website/www/yarn-error.log": "EACCES: permission denied, open '/opt/website/www/yarn-error.log'"
error An unexpected error occurred: "EACCES: permission denied, mkdir '/opt/website/www/node_modules'".
> Task :website:installDependencies FAILED
> Task :website:initGitSubmodules FAILED
error: could not lock config file .git/config: Permission denied
fatal: Failed to register url for submodule path 'website/www/site/themes/docsy'
> Task :website:buildCodeSamples FAILED
yarn run v1.22.4
warning Skipping preferred cache folder "/.cache/yarn" because it is not writable.
warning Selected the next writable cache folder in the list, will be "/tmp/.yarn-cache-910".
$ ./build_code_samples.sh
warning Cannot find a suitable global folder. Tried these: "/usr/local, /.yarn"
Working directory: /opt/website/www
Dist directory: ./site/code_samples
mkdir: cannot create directory ‘./site/code_samples’: Permission denied
error Command failed with exit code 1.
info Visit https://yarnpkg.com/en/docs/cli/run for documentation about this command.
> Task :website:buildLocalWebsite FAILED
yarn run v1.22.4
warning Skipping preferred cache folder "/.cache/yarn" because it is not writable.
warning Selected the next writable cache folder in the list, will be "/tmp/.yarn-cache-910".
$ cross-env HUGO_ENV=production hugo --minify -d ../dist -s site -v -d /opt/build/website/generated-local-content --config /opt/website/www/site/config.toml
warning Cannot find a suitable global folder. Tried these: "/usr/local, /.yarn"
/bin/sh: 1: cross-env: not found
error Command failed with exit code 127.
info Visit https://yarnpkg.com/en/docs/cli/run for documentation about this command.
> Task :website:stopAndRemoveDockerContainer
979a4edb4399bd43d09838751a1681d8da79b3cd60dc87e46555ef82802344ca
FAILURE: Build completed with 4 failures.
1: Task failed with an exception.
-----------
* What went wrong:
Execution failed for task ':website:installDependencies'.
> Process 'command 'docker'' finished with non-zero exit value 1
* Try:
Run with --stacktrace option to get the stack trace. Run with --info or --debug option to get more log output. Run with --scan to get full insights.
==============================================================================
2: Task failed with an exception.
-----------
* What went wrong:
Execution failed for task ':website:initGitSubmodules'.
> Process 'command 'docker'' finished with non-zero exit value 128
* Try:
Run with --stacktrace option to get the stack trace. Run with --info or --debug option to get more log output. Run with --scan to get full insights.
==============================================================================
3: Task failed with an exception.
-----------
* What went wrong:
Execution failed for task ':website:buildCodeSamples'.
> Process 'command 'docker'' finished with non-zero exit value 1
* Try:
Run with --stacktrace option to get the stack trace. Run with --info or --debug option to get more log output. Run with --scan to get full insights.
==============================================================================
4: Task failed with an exception.
-----------
* What went wrong:
Execution failed for task ':website:buildLocalWebsite'.
> Process 'command 'docker'' finished with non-zero exit value 127
* Try:
Run with --stacktrace option to get the stack trace. Run with --info or --debug option to get more log output. Run with --scan to get full insights.
==============================================================================
* Get more help at https://help.gradle.org
Deprecated Gradle features were used in this build, making it incompatible with Gradle 6.0.
Use '--warning-mode all' to show the individual deprecation warnings.
See https://docs.gradle.org/5.2.1/userguide/command_line_interface.html#sec:command_line_warnings
BUILD FAILED in 47s
9 actionable tasks: 9 executed
Publishing build scan...
https://gradle.com/s/g4wksbo62tjoy
Build step 'Invoke Gradle script' changed build result to FAILURE
Build step 'Invoke Gradle script' marked build as failure
---------------------------------------------------------------------
To unsubscribe, e-mail: builds-unsubscribe@beam.apache.org
For additional commands, e-mail: builds-help@beam.apache.org
Jenkins build is back to normal : beam_PostCommit_Website_Test
#4357
Posted by Apache Jenkins Server <je...@builds.apache.org>.
See <https://ci-beam.apache.org/job/beam_PostCommit_Website_Test/4357/display/redirect?page=changes>
---------------------------------------------------------------------
To unsubscribe, e-mail: builds-unsubscribe@beam.apache.org
For additional commands, e-mail: builds-help@beam.apache.org
Build failed in Jenkins: beam_PostCommit_Website_Test #4356
Posted by Apache Jenkins Server <je...@builds.apache.org>.
See <https://ci-beam.apache.org/job/beam_PostCommit_Website_Test/4356/display/redirect?page=changes>
Changes:
[noreply] [BEAM-10409] Add combiner packing to graph optimizer phases (#12185)
------------------------------------------
Started by timer
Running as SYSTEM
[EnvInject] - Loading node environment variables.
Building remotely on websites1 (git-websites svn-websites) in workspace <https://ci-beam.apache.org/job/beam_PostCommit_Website_Test/ws/>
No credentials specified
Wiping out workspace first.
Cloning the remote Git repository
Cloning repository https://github.com/apache/beam.git
> git init <https://ci-beam.apache.org/job/beam_PostCommit_Website_Test/ws/src> # timeout=10
Fetching upstream changes from https://github.com/apache/beam.git
> git --version # timeout=10
> git fetch --tags --progress -- https://github.com/apache/beam.git +refs/heads/*:refs/remotes/origin/* # timeout=10
> git config remote.origin.url https://github.com/apache/beam.git # timeout=10
> git config --add remote.origin.fetch +refs/heads/*:refs/remotes/origin/* # timeout=10
> git config remote.origin.url https://github.com/apache/beam.git # timeout=10
Fetching upstream changes from https://github.com/apache/beam.git
> git fetch --tags --progress -- https://github.com/apache/beam.git +refs/heads/*:refs/remotes/origin/* +refs/pull/${ghprbPullId}/*:refs/remotes/origin/pr/${ghprbPullId}/* # timeout=10
> git rev-parse origin/master^{commit} # timeout=10
Checking out Revision 2e77e46d35e4e37cc3953cc3a725fe94b12cde08 (origin/master)
> git config core.sparsecheckout # timeout=10
> git checkout -f 2e77e46d35e4e37cc3953cc3a725fe94b12cde08 # timeout=10
Commit message: "[BEAM-10409] Add combiner packing to graph optimizer phases (#12185)"
> git rev-list --no-walk 78d7636cac9234dbcc7145bb0330275c557c0010 # timeout=10
No emails were triggered.
[EnvInject] - Executing scripts and injecting environment variables after the SCM step.
[EnvInject] - Injecting as environment variables the properties content
SPARK_LOCAL_IP=127.0.0.1
[EnvInject] - Variables injected successfully.
[Gradle] - Launching build.
[src] $ <https://ci-beam.apache.org/job/beam_PostCommit_Website_Test/ws/src/gradlew> --continue --max-workers=12 -Dorg.gradle.jvmargs=-Xms2g -Dorg.gradle.jvmargs=-Xmx4g -Pdocker-pull-licenses :website:testWebsite -PdisableExternal=false
To honour the JVM settings for this build a new JVM will be forked. Please consider using the daemon: https://docs.gradle.org/5.2.1/userguide/gradle_daemon.html.
Daemon will be stopped at the end of the build stopping after processing
> Task :buildSrc:compileJava NO-SOURCE
> Task :buildSrc:compileGroovy FROM-CACHE
> Task :buildSrc:pluginDescriptors
> Task :buildSrc:processResources
> Task :buildSrc:classes
> Task :buildSrc:jar
> Task :buildSrc:assemble
> Task :buildSrc:spotlessGroovy
> Task :buildSrc:spotlessGroovyCheck
> Task :buildSrc:spotlessGroovyGradle
> Task :buildSrc:spotlessGroovyGradleCheck
> Task :buildSrc:spotlessCheck
> Task :buildSrc:pluginUnderTestMetadata
> Task :buildSrc:compileTestJava NO-SOURCE
> Task :buildSrc:compileTestGroovy NO-SOURCE
> Task :buildSrc:processTestResources NO-SOURCE
> Task :buildSrc:testClasses UP-TO-DATE
> Task :buildSrc:test NO-SOURCE
> Task :buildSrc:validateTaskProperties FROM-CACHE
> Task :buildSrc:check
> Task :buildSrc:build
Configuration on demand is an incubating feature.
> Task :website:buildDockerImage
Sending build context to Docker daemon 48.37MB
Step 1/8 : FROM debian:stretch-slim
---> 8ff748cdd6b1
Step 2/8 : SHELL ["/bin/bash", "-o", "pipefail", "-e", "-u", "-x", "-c"]
---> Using cache
---> e34c4df1e02e
Step 3/8 : ENV DEBIAN_FRONTEND=noninteractive LANGUAGE=C.UTF-8 LANG=C.UTF-8 LC_ALL=C.UTF-8 LC_CTYPE=C.UTF-8 LC_MESSAGES=C.UTF-8
---> Using cache
---> 757069dfbc50
Step 4/8 : RUN apt-get update && apt-get install -y --no-install-recommends ca-certificates curl git gnupg2 gosu lynx && apt-get autoremove -yqq --purge && apt-get clean && rm -rf /var/lib/apt/lists/*
---> Using cache
---> 296e1e0d5cf8
Step 5/8 : RUN curl -sL https://deb.nodesource.com/setup_10.x | bash - && apt-get update && apt-get install -y --no-install-recommends nodejs && apt-get autoremove -yqq --purge && apt-get clean && rm -rf /var/lib/apt/lists/*
---> Using cache
---> 8e22d2bec517
Step 6/8 : RUN curl -sS https://dl.yarnpkg.com/debian/pubkey.gpg | apt-key add - && echo "deb https://dl.yarnpkg.com/debian/ stable main" | tee /etc/apt/sources.list.d/yarn.list && apt-get update && apt-get install -y --no-install-recommends yarn && apt-get autoremove -yqq --purge && apt-get clean && rm -rf /var/lib/apt/lists/*
---> Using cache
---> 5a2a0e98de69
Step 7/8 : RUN HUGOHOME="$(mktemp -d)" && export HUGOHOME && curl -sL https://github.com/gohugoio/hugo/releases/download/v0.68.3/hugo_extended_0.68.3_Linux-64bit.tar.gz > "${HUGOHOME}/hugo.tar.gz" && tar -xzvf "${HUGOHOME}/hugo.tar.gz" hugo && mv hugo /usr/local/bin/hugo && chmod +x /usr/local/bin/hugo && rm -r "${HUGOHOME}"
---> Using cache
---> 4383f962e28a
Step 8/8 : WORKDIR /opt/
---> Using cache
---> 47a979744ea8
Successfully built 47a979744ea8
Successfully tagged beam-website:latest
> Task :website:createDockerContainer
> Task :website:startDockerContainer
9bd31a6a4cf94cf76eff0991fe513e9b61d1593e6e3b587a29fc7a50952e74e3
> Task :website:setupDockerContainer
> Task :website:installDependencies
yarn install v1.22.4
warning Skipping preferred cache folder "/.cache/yarn" because it is not writable.
warning Selected the next writable cache folder in the list, will be "/tmp/.yarn-cache-910".
[1/4] Resolving packages...
[2/4] Fetching packages...
info fsevents@2.1.3: The platform "linux" is incompatible with this module.
info "fsevents@2.1.3" is an optional dependency and failed compatibility check. Excluding it from installation.
[3/4] Linking dependencies...
info Visit https://yarnpkg.com/en/docs/cli/install for documentation about this command.
error Could not write file "/opt/website/www/yarn-error.log": "EACCES: permission denied, open '/opt/website/www/yarn-error.log'"
error An unexpected error occurred: "EACCES: permission denied, mkdir '/opt/website/www/node_modules'".
> Task :website:installDependencies FAILED
> Task :website:initGitSubmodules FAILED
error: could not lock config file .git/config: Permission denied
fatal: Failed to register url for submodule path 'website/www/site/themes/docsy'
> Task :website:buildCodeSamples FAILED
yarn run v1.22.4
warning Skipping preferred cache folder "/.cache/yarn" because it is not writable.
warning Selected the next writable cache folder in the list, will be "/tmp/.yarn-cache-910".
$ ./build_code_samples.sh
warning Cannot find a suitable global folder. Tried these: "/usr/local, /.yarn"
Working directory: /opt/website/www
Dist directory: ./site/code_samples
mkdir: cannot create directory ‘./site/code_samples’: Permission denied
error Command failed with exit code 1.
info Visit https://yarnpkg.com/en/docs/cli/run for documentation about this command.
> Task :website:buildLocalWebsite FAILED
yarn run v1.22.4
warning Skipping preferred cache folder "/.cache/yarn" because it is not writable.
warning Selected the next writable cache folder in the list, will be "/tmp/.yarn-cache-910".
$ cross-env HUGO_ENV=production hugo --minify -d ../dist -s site -v -d /opt/build/website/generated-local-content --config /opt/website/www/site/config.toml
warning Cannot find a suitable global folder. Tried these: "/usr/local, /.yarn"
/bin/sh: 1: cross-env: not found
error Command failed with exit code 127.
info Visit https://yarnpkg.com/en/docs/cli/run for documentation about this command.
> Task :website:stopAndRemoveDockerContainer
9bd31a6a4cf94cf76eff0991fe513e9b61d1593e6e3b587a29fc7a50952e74e3
FAILURE: Build completed with 4 failures.
1: Task failed with an exception.
-----------
* What went wrong:
Execution failed for task ':website:installDependencies'.
> Process 'command 'docker'' finished with non-zero exit value 1
* Try:
Run with --stacktrace option to get the stack trace. Run with --info or --debug option to get more log output. Run with --scan to get full insights.
==============================================================================
2: Task failed with an exception.
-----------
* What went wrong:
Execution failed for task ':website:initGitSubmodules'.
> Process 'command 'docker'' finished with non-zero exit value 128
* Try:
Run with --stacktrace option to get the stack trace. Run with --info or --debug option to get more log output. Run with --scan to get full insights.
==============================================================================
3: Task failed with an exception.
-----------
* What went wrong:
Execution failed for task ':website:buildCodeSamples'.
> Process 'command 'docker'' finished with non-zero exit value 1
* Try:
Run with --stacktrace option to get the stack trace. Run with --info or --debug option to get more log output. Run with --scan to get full insights.
==============================================================================
4: Task failed with an exception.
-----------
* What went wrong:
Execution failed for task ':website:buildLocalWebsite'.
> Process 'command 'docker'' finished with non-zero exit value 127
* Try:
Run with --stacktrace option to get the stack trace. Run with --info or --debug option to get more log output. Run with --scan to get full insights.
==============================================================================
* Get more help at https://help.gradle.org
Deprecated Gradle features were used in this build, making it incompatible with Gradle 6.0.
Use '--warning-mode all' to show the individual deprecation warnings.
See https://docs.gradle.org/5.2.1/userguide/command_line_interface.html#sec:command_line_warnings
BUILD FAILED in 47s
9 actionable tasks: 9 executed
Publishing build scan...
https://gradle.com/s/wlzlvuu2sfvqi
Build step 'Invoke Gradle script' changed build result to FAILURE
Build step 'Invoke Gradle script' marked build as failure
---------------------------------------------------------------------
To unsubscribe, e-mail: builds-unsubscribe@beam.apache.org
For additional commands, e-mail: builds-help@beam.apache.org
Build failed in Jenkins: beam_PostCommit_Website_Test #4355
Posted by Apache Jenkins Server <je...@builds.apache.org>.
See <https://ci-beam.apache.org/job/beam_PostCommit_Website_Test/4355/display/redirect?page=changes>
Changes:
[noreply] [BEAM-9898][BEAM-9899] SnowflakeIO.Write for cross-language with python
------------------------------------------
Started by timer
Running as SYSTEM
[EnvInject] - Loading node environment variables.
Building remotely on websites1 (git-websites svn-websites) in workspace <https://ci-beam.apache.org/job/beam_PostCommit_Website_Test/ws/>
No credentials specified
Wiping out workspace first.
Cloning the remote Git repository
Cloning repository https://github.com/apache/beam.git
> git init <https://ci-beam.apache.org/job/beam_PostCommit_Website_Test/ws/src> # timeout=10
Fetching upstream changes from https://github.com/apache/beam.git
> git --version # timeout=10
> git fetch --tags --progress -- https://github.com/apache/beam.git +refs/heads/*:refs/remotes/origin/* # timeout=10
> git config remote.origin.url https://github.com/apache/beam.git # timeout=10
> git config --add remote.origin.fetch +refs/heads/*:refs/remotes/origin/* # timeout=10
> git config remote.origin.url https://github.com/apache/beam.git # timeout=10
Fetching upstream changes from https://github.com/apache/beam.git
> git fetch --tags --progress -- https://github.com/apache/beam.git +refs/heads/*:refs/remotes/origin/* +refs/pull/${ghprbPullId}/*:refs/remotes/origin/pr/${ghprbPullId}/* # timeout=10
> git rev-parse origin/master^{commit} # timeout=10
Checking out Revision 78d7636cac9234dbcc7145bb0330275c557c0010 (origin/master)
> git config core.sparsecheckout # timeout=10
> git checkout -f 78d7636cac9234dbcc7145bb0330275c557c0010 # timeout=10
Commit message: "[BEAM-9898][BEAM-9899] SnowflakeIO.Write for cross-language with python wrapper and integration test (#12509)"
> git rev-list --no-walk d80b4bc50ebc6ec7706450c82a714315a61dcc1b # timeout=10
No emails were triggered.
[EnvInject] - Executing scripts and injecting environment variables after the SCM step.
[EnvInject] - Injecting as environment variables the properties content
SPARK_LOCAL_IP=127.0.0.1
[EnvInject] - Variables injected successfully.
[Gradle] - Launching build.
[src] $ <https://ci-beam.apache.org/job/beam_PostCommit_Website_Test/ws/src/gradlew> --continue --max-workers=12 -Dorg.gradle.jvmargs=-Xms2g -Dorg.gradle.jvmargs=-Xmx4g -Pdocker-pull-licenses :website:testWebsite -PdisableExternal=false
To honour the JVM settings for this build a new JVM will be forked. Please consider using the daemon: https://docs.gradle.org/5.2.1/userguide/gradle_daemon.html.
Daemon will be stopped at the end of the build stopping after processing
> Task :buildSrc:compileJava NO-SOURCE
> Task :buildSrc:compileGroovy FROM-CACHE
> Task :buildSrc:pluginDescriptors
> Task :buildSrc:processResources
> Task :buildSrc:classes
> Task :buildSrc:jar
> Task :buildSrc:assemble
> Task :buildSrc:spotlessGroovy
> Task :buildSrc:spotlessGroovyCheck
> Task :buildSrc:spotlessGroovyGradle
> Task :buildSrc:spotlessGroovyGradleCheck
> Task :buildSrc:spotlessCheck
> Task :buildSrc:pluginUnderTestMetadata
> Task :buildSrc:compileTestJava NO-SOURCE
> Task :buildSrc:compileTestGroovy NO-SOURCE
> Task :buildSrc:processTestResources NO-SOURCE
> Task :buildSrc:testClasses UP-TO-DATE
> Task :buildSrc:test NO-SOURCE
> Task :buildSrc:validateTaskProperties FROM-CACHE
> Task :buildSrc:check
> Task :buildSrc:build
Configuration on demand is an incubating feature.
> Task :website:buildDockerImage
Sending build context to Docker daemon 48.37MB
Step 1/8 : FROM debian:stretch-slim
---> 8ff748cdd6b1
Step 2/8 : SHELL ["/bin/bash", "-o", "pipefail", "-e", "-u", "-x", "-c"]
---> Using cache
---> e34c4df1e02e
Step 3/8 : ENV DEBIAN_FRONTEND=noninteractive LANGUAGE=C.UTF-8 LANG=C.UTF-8 LC_ALL=C.UTF-8 LC_CTYPE=C.UTF-8 LC_MESSAGES=C.UTF-8
---> Using cache
---> 757069dfbc50
Step 4/8 : RUN apt-get update && apt-get install -y --no-install-recommends ca-certificates curl git gnupg2 gosu lynx && apt-get autoremove -yqq --purge && apt-get clean && rm -rf /var/lib/apt/lists/*
---> Using cache
---> 296e1e0d5cf8
Step 5/8 : RUN curl -sL https://deb.nodesource.com/setup_10.x | bash - && apt-get update && apt-get install -y --no-install-recommends nodejs && apt-get autoremove -yqq --purge && apt-get clean && rm -rf /var/lib/apt/lists/*
---> Using cache
---> 8e22d2bec517
Step 6/8 : RUN curl -sS https://dl.yarnpkg.com/debian/pubkey.gpg | apt-key add - && echo "deb https://dl.yarnpkg.com/debian/ stable main" | tee /etc/apt/sources.list.d/yarn.list && apt-get update && apt-get install -y --no-install-recommends yarn && apt-get autoremove -yqq --purge && apt-get clean && rm -rf /var/lib/apt/lists/*
---> Using cache
---> 5a2a0e98de69
Step 7/8 : RUN HUGOHOME="$(mktemp -d)" && export HUGOHOME && curl -sL https://github.com/gohugoio/hugo/releases/download/v0.68.3/hugo_extended_0.68.3_Linux-64bit.tar.gz > "${HUGOHOME}/hugo.tar.gz" && tar -xzvf "${HUGOHOME}/hugo.tar.gz" hugo && mv hugo /usr/local/bin/hugo && chmod +x /usr/local/bin/hugo && rm -r "${HUGOHOME}"
---> Using cache
---> 4383f962e28a
Step 8/8 : WORKDIR /opt/
---> Using cache
---> 47a979744ea8
Successfully built 47a979744ea8
Successfully tagged beam-website:latest
> Task :website:createDockerContainer
> Task :website:startDockerContainer
9efd4c35b8e43441568e46144479a876091183365e824ba9e8b3da2fb7313a73
> Task :website:setupDockerContainer
> Task :website:installDependencies
yarn install v1.22.4
warning Skipping preferred cache folder "/.cache/yarn" because it is not writable.
warning Selected the next writable cache folder in the list, will be "/tmp/.yarn-cache-910".
[1/4] Resolving packages...
[2/4] Fetching packages...
info fsevents@2.1.3: The platform "linux" is incompatible with this module.
info "fsevents@2.1.3" is an optional dependency and failed compatibility check. Excluding it from installation.
[3/4] Linking dependencies...
error Could not write file "/opt/website/www/yarn-error.log": "EACCES: permission denied, open '/opt/website/www/yarn-error.log'"
info Visit https://yarnpkg.com/en/docs/cli/install for documentation about this command.
error An unexpected error occurred: "EACCES: permission denied, mkdir '/opt/website/www/node_modules'".
> Task :website:installDependencies FAILED
> Task :website:initGitSubmodules FAILED
error: could not lock config file .git/config: Permission denied
fatal: Failed to register url for submodule path 'website/www/site/themes/docsy'
> Task :website:buildCodeSamples FAILED
yarn run v1.22.4
warning Skipping preferred cache folder "/.cache/yarn" because it is not writable.
warning Selected the next writable cache folder in the list, will be "/tmp/.yarn-cache-910".
$ ./build_code_samples.sh
warning Cannot find a suitable global folder. Tried these: "/usr/local, /.yarn"
Working directory: /opt/website/www
Dist directory: ./site/code_samples
mkdir: cannot create directory ‘./site/code_samples’: Permission denied
info Visit https://yarnpkg.com/en/docs/cli/run for documentation about this command.
error Command failed with exit code 1.
> Task :website:buildLocalWebsite FAILED
yarn run v1.22.4
warning Skipping preferred cache folder "/.cache/yarn" because it is not writable.
warning Selected the next writable cache folder in the list, will be "/tmp/.yarn-cache-910".
$ cross-env HUGO_ENV=production hugo --minify -d ../dist -s site -v -d /opt/build/website/generated-local-content --config /opt/website/www/site/config.toml
warning Cannot find a suitable global folder. Tried these: "/usr/local, /.yarn"
/bin/sh: 1: cross-env: not found
info Visit https://yarnpkg.com/en/docs/cli/run for documentation about this command.
error Command failed with exit code 127.
> Task :website:stopAndRemoveDockerContainer
9efd4c35b8e43441568e46144479a876091183365e824ba9e8b3da2fb7313a73
FAILURE: Build completed with 4 failures.
1: Task failed with an exception.
-----------
* What went wrong:
Execution failed for task ':website:installDependencies'.
> Process 'command 'docker'' finished with non-zero exit value 1
* Try:
Run with --stacktrace option to get the stack trace. Run with --info or --debug option to get more log output. Run with --scan to get full insights.
==============================================================================
2: Task failed with an exception.
-----------
* What went wrong:
Execution failed for task ':website:initGitSubmodules'.
> Process 'command 'docker'' finished with non-zero exit value 128
* Try:
Run with --stacktrace option to get the stack trace. Run with --info or --debug option to get more log output. Run with --scan to get full insights.
==============================================================================
3: Task failed with an exception.
-----------
* What went wrong:
Execution failed for task ':website:buildCodeSamples'.
> Process 'command 'docker'' finished with non-zero exit value 1
* Try:
Run with --stacktrace option to get the stack trace. Run with --info or --debug option to get more log output. Run with --scan to get full insights.
==============================================================================
4: Task failed with an exception.
-----------
* What went wrong:
Execution failed for task ':website:buildLocalWebsite'.
> Process 'command 'docker'' finished with non-zero exit value 127
* Try:
Run with --stacktrace option to get the stack trace. Run with --info or --debug option to get more log output. Run with --scan to get full insights.
==============================================================================
* Get more help at https://help.gradle.org
Deprecated Gradle features were used in this build, making it incompatible with Gradle 6.0.
Use '--warning-mode all' to show the individual deprecation warnings.
See https://docs.gradle.org/5.2.1/userguide/command_line_interface.html#sec:command_line_warnings
BUILD FAILED in 42s
9 actionable tasks: 9 executed
Publishing build scan...
https://gradle.com/s/rfljo3oe5wb72
Build step 'Invoke Gradle script' changed build result to FAILURE
Build step 'Invoke Gradle script' marked build as failure
---------------------------------------------------------------------
To unsubscribe, e-mail: builds-unsubscribe@beam.apache.org
For additional commands, e-mail: builds-help@beam.apache.org