You are viewing a plain text version of this content. The canonical link for it is here.
Posted to notifications@maven.apache.org by Apache Jenkins Server <je...@builds.apache.org> on 2021/08/06 11:07:23 UTC

Build failed in Jenkins: Maven » Maven TLP » maven-invoker-plugin » MINVOKER-281-java-8 #4

See https://ci-maven.apache.org/job/Maven/job/maven-box/job/maven-invoker-plugin/job/MINVOKER-281-java-8/4/

Changes:

* remove unused method

All tests passed

Build log:
[...truncated 3730 lines...]
[INFO]           invocation-multiple/pom.xml ...................... SUCCESS (16.1 s)
[INFO] Building: fail-noprojects_verify/pom.xml
[INFO]           fail-noprojects_verify/pom.xml ................... SUCCESS (3.8 s)
[INFO] Building: updateOnly/pom.xml
[INFO] run post-build script verify.groovy
[INFO]           exec-timeout-mojo-level/pom.xml .................. SUCCESS (9.4 s)
[INFO] Building: invocation-group-properties/pom.xml
[INFO] run post-build script verify.bsh
[INFO]           updateOnly/pom.xml ............................... SUCCESS (4.5 s)
[INFO] Building: pom-filtering/pom.xml
[INFO] run post-build script verify.bsh
[INFO]           pom-filtering/pom.xml ............................ SUCCESS (6.9 s)
[INFO] Building: exec-timeout-mojo-level/pom.xml
[INFO] run post-build script verify.groovy
[INFO]           invocation-group-properties/pom.xml .............. SUCCESS (15.9 s)
[INFO] Building: staging-dependencies/pom.xml
[INFO] run post-build script verify.groovy
[INFO]           exec-timeout-mojo-level/pom.xml .................. SUCCESS (9.9 s)
[INFO] Building: invocation-group-properties/pom.xml
[INFO] run post-build script verify.bsh
[INFO]           staging-dependencies/pom.xml ..................... SUCCESS (7.3 s)
[INFO] Building: local-repo-url/pom.xml
[INFO] run post-build script verify.groovy
[INFO]           local-repo-url/pom.xml ........................... SUCCESS (6.8 s)
[INFO] Building: fail-ignore-with-verify/pom.xml
[INFO] run post-build script verify.groovy
[INFO]           invocation-group-properties/pom.xml .............. SUCCESS (14.8 s)
[INFO] Building: staging-dependencies/pom.xml
[INFO]           fail-ignore-with-verify/pom.xml .................. SUCCESS (5.3 s)
[INFO] Building: install-extra-artifacts/pom.xml
[INFO] run post-build script verify.bsh
[INFO]           install-extra-artifacts/pom.xml .................. SUCCESS (5.1 s)
[INFO] Building: script-streamLogs-true/pom.xml
[INFO] run post-build script verify.bsh
[INFO]           staging-dependencies/pom.xml ..................... SUCCESS (7.3 s)
[INFO] Building: local-repo-url/pom.xml
[INFO] run post-build script verify.groovy
[INFO]           script-streamLogs-true/pom.xml ................... SUCCESS (5.3 s)
[INFO] Building: spaces-should-work_non-windows/pom.xml
[INFO] run pre-build script setup.groovy
[INFO] run post-build script verify.groovy
[INFO]           local-repo-url/pom.xml ........................... SUCCESS (7.4 s)
[INFO] Building: fail-ignore-with-verify/pom.xml
[INFO]           spaces-should-work_non-windows/pom.xml ........... SUCCESS (7.5 s)
[INFO] Building: spaces-should-work_windows/pom.xml
[INFO]           spaces-should-work_windows/pom.xml ............... SKIPPED due to Maven version, OS
[INFO] Building: settings-merge/pom.xml
[INFO]           fail-ignore-with-verify/pom.xml .................. SUCCESS (6.0 s)
[INFO] Building: install-extra-artifacts/pom.xml
[INFO] run post-build script verify.bsh
[INFO]           install-extra-artifacts/pom.xml .................. SUCCESS (5.7 s)
[INFO] Building: script-streamLogs-true/pom.xml
[INFO]           settings-merge/pom.xml ........................... SUCCESS (11.3 s)
[INFO] Building: fail-prebuild/pom.xml
[INFO] run post-build script verify.groovy
[INFO]           script-streamLogs-true/pom.xml ................... SUCCESS (5.4 s)
[INFO] Building: spaces-should-work_non-windows/pom.xml
[INFO] run pre-build script setup.groovy
[INFO] run post-build script verify.bsh
[INFO]           fail-prebuild/pom.xml ............................ SUCCESS (4.0 s)
[INFO] Building: invocation-cmdline-exclude/pom.xml
[INFO]           invocation-cmdline-exclude/pom.xml ............... SUCCESS (3.8 s)
[INFO] Building: script-class-loading/pom.xml
[INFO]           spaces-should-work_non-windows/pom.xml ........... SUCCESS (8.0 s)
[INFO] Building: spaces-should-work_windows/pom.xml
[INFO]           spaces-should-work_windows/pom.xml ............... SKIPPED due to OS
[INFO] Building: settings-merge/pom.xml
[INFO]           settings-merge/pom.xml ........................... SKIPPED due to JRE version
[INFO] Building: fail-prebuild/pom.xml
[INFO] run post-build script verify.bsh
[INFO]           fail-prebuild/pom.xml ............................ SUCCESS (4.3 s)
[INFO] Building: invocation-cmdline-exclude/pom.xml
[INFO]           invocation-cmdline-exclude/pom.xml ............... SUCCESS (3.6 s)
[INFO] Building: script-class-loading/pom.xml
[INFO]           script-class-loading/pom.xml ..................... SUCCESS (11.1 s)
[INFO] Building: local-repo-isolated/pom.xml
[INFO] run post-build script verify.bsh
[INFO]           local-repo-isolated/pom.xml ...................... SUCCESS (6.4 s)
[INFO] Building: invocation-offline/pom.xml
[INFO]           script-class-loading/pom.xml ..................... SUCCESS (11.6 s)
[INFO] Building: local-repo-isolated/pom.xml
[INFO] run post-build script verify.bsh
[INFO]           invocation-offline/pom.xml ....................... SUCCESS (8.8 s)
[INFO] Building: selector-scripts/pom.xml
[INFO] run pre-build script setup.groovy
[INFO] run post-build script verify.bsh
[INFO]           local-repo-isolated/pom.xml ...................... SUCCESS (6.2 s)
[INFO] Building: invocation-offline/pom.xml
[INFO] run post-build script verify.bsh
[INFO]           selector-scripts/pom.xml ......................... SUCCESS (7.8 s)
[INFO] Building: script-additional-vars/pom.xml
[INFO] run post-build script verify.bsh
[INFO]           invocation-offline/pom.xml ....................... SUCCESS (8.7 s)
[INFO] Building: selector-scripts/pom.xml
[INFO] run pre-build script setup.groovy
[INFO]           script-additional-vars/pom.xml ................... SUCCESS (8.5 s)
[INFO] Building: invocation-emptyproperty/pom.xml
[INFO] run post-build script verify.bsh
[INFO]           selector-scripts/pom.xml ......................... SUCCESS (9.1 s)
[INFO] Building: script-additional-vars/pom.xml
[INFO]           invocation-emptyproperty/pom.xml ................. SUCCESS (6.6 s)
[INFO] Building: wrongPropertyInterpolation/pom.xml
[INFO]           script-additional-vars/pom.xml ................... SUCCESS (10.2 s)
[INFO] Building: invocation-emptyproperty/pom.xml
[INFO]           invocation-emptyproperty/pom.xml ................. SUCCESS (7.0 s)
[INFO] Building: wrongPropertyInterpolation/pom.xml
[INFO]           wrongPropertyInterpolation/pom.xml ............... SUCCESS (13.1 s)
[INFO] Building: invocation-project/pom.xml
[INFO] run post-build script verify.bsh
[INFO]           invocation-project/pom.xml ....................... SUCCESS (8.7 s)
[INFO] Building: MINVOKER-191/pom.xml
[INFO]           wrongPropertyInterpolation/pom.xml ............... SUCCESS (14.0 s)
[INFO] Building: invocation-project/pom.xml
[INFO]           MINVOKER-191/pom.xml ............................. SUCCESS (11.2 s)
[INFO] Building: invocation-spaces/pom.xml
[INFO] run post-build script verify.bsh
[INFO]           invocation-project/pom.xml ....................... SUCCESS (9.2 s)
[INFO] Building: MINVOKER-191/pom.xml
[INFO] run post-build script verify.bsh
[INFO]           invocation-spaces/pom.xml ........................ SUCCESS (9.4 s)
[INFO] Building: fail-run-postbuild/pom.xml
[INFO]           MINVOKER-191/pom.xml ............................. SUCCESS (10.4 s)
[INFO] Building: invocation-spaces/pom.xml
[INFO] run post-build script verify.bsh
[INFO]           fail-run-postbuild/pom.xml ....................... SUCCESS (7.8 s)
[INFO] Building: project-cloning/pom.xml
[INFO] run pre-build script setup.bsh
[INFO] run post-build script verify.bsh
[INFO]           invocation-spaces/pom.xml ........................ SUCCESS (9.4 s)
[INFO] Building: fail-run-postbuild/pom.xml
[INFO] run post-build script verify.bsh
[INFO]           project-cloning/pom.xml .......................... SUCCESS (10.3 s)
[INFO] Building: settings-inherit/pom.xml
[INFO] run post-build script verify.bsh
[INFO]           fail-run-postbuild/pom.xml ....................... SUCCESS (7.8 s)
[INFO] Building: project-cloning/pom.xml
[INFO] run pre-build script setup.bsh
[INFO]           settings-inherit/pom.xml ......................... SUCCESS (6.3 s)
[INFO] Building: script-context/pom.xml
[INFO] run post-build script verify.bsh
[INFO]           script-context/pom.xml ........................... SUCCESS (8.7 s)
[INFO] 
[INFO] --- maven-checkstyle-plugin:3.0.0:check (checkstyle-check) @ maven-invoker-plugin ---
[INFO] run post-build script verify.bsh
[INFO]           project-cloning/pom.xml .......................... SUCCESS (10.7 s)
[INFO] Building: settings-inherit/pom.xml
[INFO] There are 4 errors reported by Checkstyle 6.18 with config/maven_checks.xml ruleset.
[INFO] Ignored 4 errors, 0 violation remaining.
[INFO] 
[INFO] --- maven-invoker-plugin:3.2.2:verify (integration-test) @ maven-invoker-plugin ---
[INFO] -------------------------------------------------
[INFO] Build Summary:
[INFO]   Passed: 75, Failed: 0, Errors: 0, Skipped: 1
[INFO] -------------------------------------------------
[ERROR] The following builds was skipped:
[ERROR] *  spaces-should-work_windows/pom.xml
[INFO] -------------------------------------------------
[INFO] ------------------------------------------------------------------------
[INFO] BUILD SUCCESS
[INFO] ------------------------------------------------------------------------
[INFO] Total time: 10:27 min
[INFO] Finished at: 2021-08-06T11:07:12+00:00
[INFO] Final Memory: 68M/1390M
[INFO] ------------------------------------------------------------------------
[INFO] [jenkins-event-spy] Generated /home/jenkins/jenkins-home/workspace/voker-plugin_MINVOKER-281-java-8@3@tmp/withMavendf32b6b2/maven-spy-20210806-105644-7853544446017287936994.log
[Pipeline] }
[Pipeline] // dir
[Pipeline] }
[withMaven] artifactsPublisher - Archive artifact linux-jdk8-m3.2.x_build/pom.xml under org/apache/maven/plugins/maven-invoker-plugin/3.2.3-SNAPSHOT/maven-invoker-plugin-3.2.3-SNAPSHOT.pom
[withMaven] artifactsPublisher - Archive artifact linux-jdk8-m3.2.x_build/target/maven-invoker-plugin-3.2.3-SNAPSHOT.jar under org/apache/maven/plugins/maven-invoker-plugin/3.2.3-SNAPSHOT/maven-invoker-plugin-3.2.3-SNAPSHOT.jar
[Fast Archiver] No prior successful build to compare, so performing full copy of artifacts
[withMaven] junitPublisher - Archive test results for Maven artifact org.apache.maven.plugins:maven-invoker-plugin:maven-plugin:3.2.3-SNAPSHOT generated by maven-surefire-plugin:test (default-test): linux-jdk8-m3.2.x_build/target/surefire-reports/*.xml
Recording test results
[withMaven] Jenkins Task Scanner Plugin not found, don't display results of source code scanning for 'TODO' and 'FIXME' in pipeline screen.
[withMaven] invokerPublisher - Archive invoker results for Maven artifact MavenArtifact{org.apache.maven.plugins:maven-invoker-plugin:maven-plugin:3.2.3-SNAPSHOT(version: 3.2.3-SNAPSHOT, snapshot:false) } generated by PluginInvocation{org.apache.maven.plugins:maven-invoker-plugin:3.2.2@integration-test  integration-test}: linux-jdk8-m3.2.x_build/target/invoker-reports/*.xml
ERROR: [withMaven] invokerPublisher - Silently ignore exception archiving Invoker runs for Maven artifact MavenArtifact{org.apache.maven.plugins:maven-invoker-plugin:maven-plugin:3.2.3-SNAPSHOT(version: 3.2.3-SNAPSHOT, snapshot:false) } generated by PluginInvocation{org.apache.maven.plugins:maven-invoker-plugin:3.2.2@integration-test  integration-test}: java.io.IOException: Unknown attribute 'buildlog' for tag 'build-job' (position: START_TAG seen ...dk8-m3.2.x_build/target/it/MINVOKER-190-logDirectory/build.log" />... @2:278) 
[withMaven] Publishers: Generated Artifacts Publisher: 51 ms, Junit Publisher: 86 ms, Open Task Scanner Publisher: 1 ms, Invoker Publisher: 162 ms, Pipeline Graph Publisher: 1 ms
[Pipeline] // withMaven
[Pipeline] cleanWs
[WS-CLEANUP] Deleting project workspace...
[WS-CLEANUP] Deferred wipeout is used...
[WS-CLEANUP] done
[Pipeline] }
[Pipeline] // stage
[Pipeline] }
[Pipeline] // ws
[Pipeline] }
[Pipeline] // node
[Pipeline] }
[INFO]           settings-inherit/pom.xml ......................... SUCCESS (5.5 s)
[INFO] Building: script-context/pom.xml
[INFO] run post-build script verify.bsh
[INFO]           script-context/pom.xml ........................... SUCCESS (5.4 s)
[INFO] 
[INFO] --- maven-checkstyle-plugin:3.0.0:check (checkstyle-check) @ maven-invoker-plugin ---
[INFO] There are 4 errors reported by Checkstyle 6.18 with config/maven_checks.xml ruleset.
[INFO] Ignored 4 errors, 0 violation remaining.
[INFO] 
[INFO] --- maven-invoker-plugin:3.2.2:verify (integration-test) @ maven-invoker-plugin ---
[INFO] -------------------------------------------------
[INFO] Build Summary:
[INFO]   Passed: 74, Failed: 0, Errors: 0, Skipped: 2
[INFO] -------------------------------------------------
[ERROR] The following builds was skipped:
[ERROR] *  settings-merge/pom.xml
[ERROR] *  spaces-should-work_windows/pom.xml
[INFO] -------------------------------------------------
[INFO] ------------------------------------------------------------------------
[INFO] BUILD SUCCESS
[INFO] ------------------------------------------------------------------------
[INFO] Total time:  10:37 min
[INFO] Finished at: 2021-08-06T11:07:22Z
[INFO] ------------------------------------------------------------------------
[INFO] [jenkins-event-spy] Generated /home/jenkins/jenkins-home/workspace/voker-plugin_MINVOKER-281-java-8@2@2@tmp/withMaven8b3058be/maven-spy-20210806-105645-4814877823862544616560.log
[Pipeline] }
[Pipeline] // dir
[Pipeline] }
[withMaven] artifactsPublisher - Archive artifact linux-jdk16-m3.6.x_build/pom.xml under org/apache/maven/plugins/maven-invoker-plugin/3.2.3-SNAPSHOT/maven-invoker-plugin-3.2.3-SNAPSHOT.pom
[withMaven] artifactsPublisher - Archive artifact linux-jdk16-m3.6.x_build/target/maven-invoker-plugin-3.2.3-SNAPSHOT.jar under org/apache/maven/plugins/maven-invoker-plugin/3.2.3-SNAPSHOT/maven-invoker-plugin-3.2.3-SNAPSHOT.jar
[Fast Archiver] No prior successful build to compare, so performing full copy of artifacts
[withMaven] junitPublisher - Archive test results for Maven artifact org.apache.maven.plugins:maven-invoker-plugin:maven-plugin:3.2.3-SNAPSHOT generated by maven-surefire-plugin:test (default-test): linux-jdk16-m3.6.x_build/target/surefire-reports/*.xml
Recording test results
[withMaven] Jenkins Task Scanner Plugin not found, don't display results of source code scanning for 'TODO' and 'FIXME' in pipeline screen.
[withMaven] invokerPublisher - Archive invoker results for Maven artifact MavenArtifact{org.apache.maven.plugins:maven-invoker-plugin:maven-plugin:3.2.3-SNAPSHOT(version: 3.2.3-SNAPSHOT, snapshot:false) } generated by PluginInvocation{org.apache.maven.plugins:maven-invoker-plugin:3.2.2@integration-test  integration-test}: linux-jdk16-m3.6.x_build/target/invoker-reports/*.xml
ERROR: [withMaven] invokerPublisher - Silently ignore exception archiving Invoker runs for Maven artifact MavenArtifact{org.apache.maven.plugins:maven-invoker-plugin:maven-plugin:3.2.3-SNAPSHOT(version: 3.2.3-SNAPSHOT, snapshot:false) } generated by PluginInvocation{org.apache.maven.plugins:maven-invoker-plugin:3.2.2@integration-test  integration-test}: java.io.IOException: Unknown attribute 'buildlog' for tag 'build-job' (position: START_TAG seen ...k16-m3.6.x_build/target/it/MINVOKER-190-logDirectory/build.log" />... @2:281) 
[withMaven] Publishers: Generated Artifacts Publisher: 39 ms, Junit Publisher: 79 ms, Open Task Scanner Publisher: 1 ms, Invoker Publisher: 140 ms
[Pipeline] // withMaven
[Pipeline] cleanWs
[WS-CLEANUP] Deleting project workspace...
[WS-CLEANUP] Deferred wipeout is used...
[WS-CLEANUP] done
[Pipeline] }
[Pipeline] // stage
[Pipeline] }
[Pipeline] // ws
[Pipeline] }
[Pipeline] // node
[Pipeline] }
[Pipeline] // parallel
[Pipeline] stage
[Pipeline] { (Notifications)
[Pipeline] echo
Build result: FAILURE
[Pipeline] jiraIssueSelector
[Pipeline] echo
The authors of changes [olamy].
[Pipeline] echo
Sending email ...
[Pipeline] emailext