You are viewing a plain text version of this content. The canonical link for it is here.
Posted to dev@kafka.apache.org by Apache Jenkins Server <je...@builds.apache.org> on 2016/08/09 03:22:25 UTC
Build failed in Jenkins: kafka-trunk-jdk8 #806
See <https://builds.apache.org/job/kafka-trunk-jdk8/806/changes>
Changes:
[ismael] MINOR: Add `fetchTopicMetadataFromZk` overload that takes
[ismael] KAFKA-4013; Include exception cause in SaslServerCallbackHandler
------------------------------------------
[...truncated 11383 lines...]
org.apache.kafka.streams.kstream.internals.KTableKTableOuterJoinTest > testSendingOldValue STARTED
org.apache.kafka.streams.kstream.internals.KTableKTableOuterJoinTest > testSendingOldValue PASSED
org.apache.kafka.streams.kstream.internals.KTableKTableOuterJoinTest > testJoin STARTED
org.apache.kafka.streams.kstream.internals.KTableKTableOuterJoinTest > testJoin PASSED
org.apache.kafka.streams.kstream.internals.KTableKTableOuterJoinTest > testNotSendingOldValue STARTED
org.apache.kafka.streams.kstream.internals.KTableKTableOuterJoinTest > testNotSendingOldValue PASSED
org.apache.kafka.streams.kstream.internals.KTableKTableLeftJoinTest > testSendingOldValue STARTED
org.apache.kafka.streams.kstream.internals.KTableKTableLeftJoinTest > testSendingOldValue PASSED
org.apache.kafka.streams.kstream.internals.KTableKTableLeftJoinTest > testJoin STARTED
org.apache.kafka.streams.kstream.internals.KTableKTableLeftJoinTest > testJoin PASSED
org.apache.kafka.streams.kstream.internals.KTableKTableLeftJoinTest > testNotSendingOldValue STARTED
org.apache.kafka.streams.kstream.internals.KTableKTableLeftJoinTest > testNotSendingOldValue PASSED
org.apache.kafka.streams.kstream.internals.KTableFilterTest > testSendingOldValue STARTED
org.apache.kafka.streams.kstream.internals.KTableFilterTest > testSendingOldValue PASSED
org.apache.kafka.streams.kstream.internals.KTableFilterTest > testNotSendingOldValue STARTED
org.apache.kafka.streams.kstream.internals.KTableFilterTest > testNotSendingOldValue PASSED
org.apache.kafka.streams.kstream.internals.KTableFilterTest > testSkipNullOnMaterialization STARTED
org.apache.kafka.streams.kstream.internals.KTableFilterTest > testSkipNullOnMaterialization PASSED
org.apache.kafka.streams.kstream.internals.KTableFilterTest > testKTable STARTED
org.apache.kafka.streams.kstream.internals.KTableFilterTest > testKTable PASSED
org.apache.kafka.streams.kstream.internals.KTableFilterTest > testValueGetter STARTED
org.apache.kafka.streams.kstream.internals.KTableFilterTest > testValueGetter PASSED
org.apache.kafka.streams.kstream.internals.KStreamImplTest > testToWithNullValueSerdeDoesntNPE STARTED
org.apache.kafka.streams.kstream.internals.KStreamImplTest > testToWithNullValueSerdeDoesntNPE PASSED
org.apache.kafka.streams.kstream.internals.KStreamImplTest > testNumProcesses STARTED
org.apache.kafka.streams.kstream.internals.KStreamImplTest > testNumProcesses PASSED
org.apache.kafka.streams.kstream.internals.KTableForeachTest > testForeach STARTED
org.apache.kafka.streams.kstream.internals.KTableForeachTest > testForeach PASSED
org.apache.kafka.streams.kstream.internals.KStreamKStreamLeftJoinTest > testLeftJoin STARTED
org.apache.kafka.streams.kstream.internals.KStreamKStreamLeftJoinTest > testLeftJoin PASSED
org.apache.kafka.streams.kstream.internals.KStreamKStreamLeftJoinTest > testWindowing STARTED
org.apache.kafka.streams.kstream.internals.KStreamKStreamLeftJoinTest > testWindowing PASSED
org.apache.kafka.streams.kstream.internals.KTableMapKeysTest > testMapKeysConvertingToStream STARTED
org.apache.kafka.streams.kstream.internals.KTableMapKeysTest > testMapKeysConvertingToStream PASSED
org.apache.kafka.streams.kstream.internals.KStreamBranchTest > testKStreamBranch STARTED
org.apache.kafka.streams.kstream.internals.KStreamBranchTest > testKStreamBranch PASSED
org.apache.kafka.streams.kstream.internals.KStreamMapValuesTest > testFlatMapValues STARTED
org.apache.kafka.streams.kstream.internals.KStreamMapValuesTest > testFlatMapValues PASSED
org.apache.kafka.streams.kstream.internals.KTableSourceTest > testSendingOldValue STARTED
org.apache.kafka.streams.kstream.internals.KTableSourceTest > testSendingOldValue PASSED
org.apache.kafka.streams.kstream.internals.KTableSourceTest > testNotSendingOldValue STARTED
org.apache.kafka.streams.kstream.internals.KTableSourceTest > testNotSendingOldValue PASSED
org.apache.kafka.streams.kstream.internals.KTableSourceTest > testKTable STARTED
org.apache.kafka.streams.kstream.internals.KTableSourceTest > testKTable PASSED
org.apache.kafka.streams.kstream.internals.KTableSourceTest > testValueGetter STARTED
org.apache.kafka.streams.kstream.internals.KTableSourceTest > testValueGetter PASSED
org.apache.kafka.streams.kstream.internals.KStreamFlatMapTest > testFlatMap STARTED
org.apache.kafka.streams.kstream.internals.KStreamFlatMapTest > testFlatMap PASSED
org.apache.kafka.streams.kstream.internals.KStreamFlatMapValuesTest > testFlatMapValues STARTED
org.apache.kafka.streams.kstream.internals.KStreamFlatMapValuesTest > testFlatMapValues PASSED
org.apache.kafka.streams.kstream.internals.KStreamFilterTest > testFilterNot STARTED
org.apache.kafka.streams.kstream.internals.KStreamFilterTest > testFilterNot PASSED
org.apache.kafka.streams.kstream.internals.KStreamFilterTest > testFilter STARTED
org.apache.kafka.streams.kstream.internals.KStreamFilterTest > testFilter PASSED
org.apache.kafka.streams.kstream.internals.KTableAggregateTest > testAggBasic STARTED
org.apache.kafka.streams.kstream.internals.KTableAggregateTest > testAggBasic PASSED
org.apache.kafka.streams.kstream.internals.KTableAggregateTest > testCount STARTED
org.apache.kafka.streams.kstream.internals.KTableAggregateTest > testCount PASSED
org.apache.kafka.streams.kstream.internals.KTableAggregateTest > testAggRepartition STARTED
org.apache.kafka.streams.kstream.internals.KTableAggregateTest > testAggRepartition PASSED
org.apache.kafka.streams.kstream.internals.KTableAggregateTest > testRemoveOldBeforeAddNew STARTED
org.apache.kafka.streams.kstream.internals.KTableAggregateTest > testRemoveOldBeforeAddNew PASSED
org.apache.kafka.streams.kstream.internals.KTableImplTest > testStateStore STARTED
org.apache.kafka.streams.kstream.internals.KTableImplTest > testStateStore PASSED
org.apache.kafka.streams.kstream.internals.KTableImplTest > testRepartition STARTED
org.apache.kafka.streams.kstream.internals.KTableImplTest > testRepartition PASSED
org.apache.kafka.streams.kstream.internals.KTableImplTest > testStateStoreLazyEval STARTED
org.apache.kafka.streams.kstream.internals.KTableImplTest > testStateStoreLazyEval PASSED
org.apache.kafka.streams.kstream.internals.KTableImplTest > testKTable STARTED
org.apache.kafka.streams.kstream.internals.KTableImplTest > testKTable PASSED
org.apache.kafka.streams.kstream.internals.KTableImplTest > testValueGetter STARTED
org.apache.kafka.streams.kstream.internals.KTableImplTest > testValueGetter PASSED
org.apache.kafka.streams.kstream.KStreamBuilderTest > testMerge STARTED
org.apache.kafka.streams.kstream.KStreamBuilderTest > testMerge PASSED
org.apache.kafka.streams.kstream.KStreamBuilderTest > testFrom STARTED
org.apache.kafka.streams.kstream.KStreamBuilderTest > testFrom PASSED
org.apache.kafka.streams.kstream.KStreamBuilderTest > testNewName STARTED
org.apache.kafka.streams.kstream.KStreamBuilderTest > testNewName PASSED
org.apache.kafka.streams.kstream.TimeWindowsTest > shouldHaveSaneEqualsAndHashCode STARTED
org.apache.kafka.streams.kstream.TimeWindowsTest > shouldHaveSaneEqualsAndHashCode PASSED
org.apache.kafka.streams.kstream.TimeWindowsTest > windowSizeMustNotBeZero STARTED
org.apache.kafka.streams.kstream.TimeWindowsTest > windowSizeMustNotBeZero PASSED
org.apache.kafka.streams.kstream.TimeWindowsTest > advanceIntervalMustNotBeZero STARTED
org.apache.kafka.streams.kstream.TimeWindowsTest > advanceIntervalMustNotBeZero PASSED
org.apache.kafka.streams.kstream.TimeWindowsTest > windowSizeMustNotBeNegative STARTED
org.apache.kafka.streams.kstream.TimeWindowsTest > windowSizeMustNotBeNegative PASSED
org.apache.kafka.streams.kstream.TimeWindowsTest > advanceIntervalMustNotBeNegative STARTED
org.apache.kafka.streams.kstream.TimeWindowsTest > advanceIntervalMustNotBeNegative PASSED
org.apache.kafka.streams.kstream.TimeWindowsTest > advanceIntervalMustNotBeLargerThanWindowSize STARTED
org.apache.kafka.streams.kstream.TimeWindowsTest > advanceIntervalMustNotBeLargerThanWindowSize PASSED
org.apache.kafka.streams.kstream.TimeWindowsTest > windowsForTumblingWindows STARTED
org.apache.kafka.streams.kstream.TimeWindowsTest > windowsForTumblingWindows PASSED
org.apache.kafka.streams.kstream.TimeWindowsTest > windowsForHoppingWindows STARTED
org.apache.kafka.streams.kstream.TimeWindowsTest > windowsForHoppingWindows PASSED
org.apache.kafka.streams.kstream.TimeWindowsTest > windowsForBarelyOverlappingHoppingWindows STARTED
org.apache.kafka.streams.kstream.TimeWindowsTest > windowsForBarelyOverlappingHoppingWindows PASSED
org.apache.kafka.streams.integration.FanoutIntegrationTest > shouldFanoutTheInput STARTED
org.apache.kafka.streams.integration.FanoutIntegrationTest > shouldFanoutTheInput PASSED
org.apache.kafka.streams.integration.KStreamRepartitionJoinTest > shouldCorrectlyRepartitionOnJoinOperations STARTED
org.apache.kafka.streams.integration.KStreamRepartitionJoinTest > shouldCorrectlyRepartitionOnJoinOperations PASSED
org.apache.kafka.streams.integration.KStreamAggregationIntegrationTest > shouldReduce STARTED
org.apache.kafka.streams.integration.KStreamAggregationIntegrationTest > shouldReduce PASSED
org.apache.kafka.streams.integration.KStreamAggregationIntegrationTest > shouldAggregate STARTED
org.apache.kafka.streams.integration.KStreamAggregationIntegrationTest > shouldAggregate PASSED
org.apache.kafka.streams.integration.KStreamAggregationIntegrationTest > shouldCount STARTED
org.apache.kafka.streams.integration.KStreamAggregationIntegrationTest > shouldCount PASSED
org.apache.kafka.streams.integration.KStreamAggregationIntegrationTest > shouldGroupByKey STARTED
org.apache.kafka.streams.integration.KStreamAggregationIntegrationTest > shouldGroupByKey PASSED
org.apache.kafka.streams.integration.KStreamAggregationIntegrationTest > shouldReduceWindowed STARTED
org.apache.kafka.streams.integration.KStreamAggregationIntegrationTest > shouldReduceWindowed PASSED
org.apache.kafka.streams.integration.KStreamAggregationIntegrationTest > shouldAggregateWindowed STARTED
org.apache.kafka.streams.integration.KStreamAggregationIntegrationTest > shouldAggregateWindowed PASSED
org.apache.kafka.streams.integration.QueryableStateIntegrationTest > shouldBeAbleToQueryState STARTED
org.apache.kafka.streams.integration.QueryableStateIntegrationTest > shouldBeAbleToQueryState PASSED
org.apache.kafka.streams.integration.ResetIntegrationTest > testReprocessingFromScratchAfterReset STARTED
org.apache.kafka.streams.integration.ResetIntegrationTest > testReprocessingFromScratchAfterReset PASSED
:streams:test FAILED
FAILURE: Build failed with an exception.
* What went wrong:
Execution failed for task ':streams:test'.
> Process 'Gradle Test Executor 4' finished with non-zero exit value 1
* Try:
Run with --stacktrace option to get the stack trace. Run with --info or --debug option to get more log output.
BUILD FAILED
Total time: 1 hrs 43 mins 17.712 secs
Build step 'Execute shell' marked build as failure
Recording test results
Setting GRADLE_2_4_RC_2_HOME=/home/jenkins/jenkins-slave/tools/hudson.plugins.gradle.GradleInstallation/Gradle_2.4-rc-2
Setting GRADLE_2_4_RC_2_HOME=/home/jenkins/jenkins-slave/tools/hudson.plugins.gradle.GradleInstallation/Gradle_2.4-rc-2
Jenkins build is back to normal : kafka-trunk-jdk8 #808
Posted by Apache Jenkins Server <je...@builds.apache.org>.
See <https://builds.apache.org/job/kafka-trunk-jdk8/808/changes>
Build failed in Jenkins: kafka-trunk-jdk8 #807
Posted by Apache Jenkins Server <je...@builds.apache.org>.
See <https://builds.apache.org/job/kafka-trunk-jdk8/807/changes>
Changes:
[me] MINOR: Remove redundant clause in secureAclsEnabled check
[me] KAFKA-3954; Consumer should use internal topics information returned by
------------------------------------------
[...truncated 8287 lines...]
org.apache.kafka.common.metrics.JmxReporterTest > testJmxRegistration STARTED
org.apache.kafka.common.metrics.JmxReporterTest > testJmxRegistration PASSED
org.apache.kafka.common.metrics.stats.HistogramTest > testHistogram STARTED
org.apache.kafka.common.metrics.stats.HistogramTest > testHistogram PASSED
org.apache.kafka.common.metrics.stats.HistogramTest > testConstantBinScheme STARTED
org.apache.kafka.common.metrics.stats.HistogramTest > testConstantBinScheme PASSED
org.apache.kafka.common.metrics.stats.HistogramTest > testLinearBinScheme STARTED
org.apache.kafka.common.metrics.stats.HistogramTest > testLinearBinScheme PASSED
org.apache.kafka.common.utils.CrcTest > testUpdateInt STARTED
org.apache.kafka.common.utils.CrcTest > testUpdateInt PASSED
org.apache.kafka.common.utils.CrcTest > testUpdate STARTED
org.apache.kafka.common.utils.CrcTest > testUpdate PASSED
org.apache.kafka.common.utils.UtilsTest > testAbs STARTED
org.apache.kafka.common.utils.UtilsTest > testAbs PASSED
org.apache.kafka.common.utils.UtilsTest > testMin STARTED
org.apache.kafka.common.utils.UtilsTest > testMin PASSED
org.apache.kafka.common.utils.UtilsTest > testJoin STARTED
org.apache.kafka.common.utils.UtilsTest > testJoin PASSED
org.apache.kafka.common.utils.UtilsTest > testReadBytes STARTED
org.apache.kafka.common.utils.UtilsTest > testReadBytes PASSED
org.apache.kafka.common.utils.UtilsTest > testGetHost STARTED
org.apache.kafka.common.utils.UtilsTest > testGetHost PASSED
org.apache.kafka.common.utils.UtilsTest > testGetPort STARTED
org.apache.kafka.common.utils.UtilsTest > testGetPort PASSED
org.apache.kafka.common.utils.UtilsTest > testCloseAll STARTED
org.apache.kafka.common.utils.UtilsTest > testCloseAll PASSED
org.apache.kafka.common.utils.UtilsTest > testFormatAddress STARTED
org.apache.kafka.common.utils.UtilsTest > testFormatAddress PASSED
org.apache.kafka.common.utils.AbstractIteratorTest > testEmptyIterator STARTED
org.apache.kafka.common.utils.AbstractIteratorTest > testEmptyIterator PASSED
org.apache.kafka.common.utils.AbstractIteratorTest > testIterator STARTED
org.apache.kafka.common.utils.AbstractIteratorTest > testIterator PASSED
org.apache.kafka.common.ClusterTest > testBootstrap STARTED
org.apache.kafka.common.ClusterTest > testBootstrap PASSED
org.apache.kafka.common.cache.LRUCacheTest > testEviction STARTED
org.apache.kafka.common.cache.LRUCacheTest > testEviction PASSED
org.apache.kafka.common.cache.LRUCacheTest > testPutGet STARTED
org.apache.kafka.common.cache.LRUCacheTest > testPutGet PASSED
org.apache.kafka.common.cache.LRUCacheTest > testRemove STARTED
org.apache.kafka.common.cache.LRUCacheTest > testRemove PASSED
org.apache.kafka.common.network.SslTransportLayerTest > testClientAuthenticationRequestedValidProvided STARTED
org.apache.kafka.common.network.SslTransportLayerTest > testClientAuthenticationRequestedValidProvided PASSED
org.apache.kafka.common.network.SslTransportLayerTest > testUnsupportedCiphers STARTED
org.apache.kafka.common.network.SslTransportLayerTest > testUnsupportedCiphers PASSED
org.apache.kafka.common.network.SslTransportLayerTest > testUnsupportedTLSVersion STARTED
org.apache.kafka.common.network.SslTransportLayerTest > testUnsupportedTLSVersion PASSED
org.apache.kafka.common.network.SslTransportLayerTest > testClientAuthenticationRequiredNotProvided STARTED
org.apache.kafka.common.network.SslTransportLayerTest > testClientAuthenticationRequiredNotProvided PASSED
org.apache.kafka.common.network.SslTransportLayerTest > testClientAuthenticationRequestedNotProvided STARTED
org.apache.kafka.common.network.SslTransportLayerTest > testClientAuthenticationRequestedNotProvided PASSED
org.apache.kafka.common.network.SslTransportLayerTest > testInvalidKeystorePassword STARTED
org.apache.kafka.common.network.SslTransportLayerTest > testInvalidKeystorePassword PASSED
org.apache.kafka.common.network.SslTransportLayerTest > testClientAuthenticationDisabledNotProvided STARTED
org.apache.kafka.common.network.SslTransportLayerTest > testClientAuthenticationDisabledNotProvided PASSED
org.apache.kafka.common.network.SslTransportLayerTest > testInvalidEndpointIdentification STARTED
org.apache.kafka.common.network.SslTransportLayerTest > testInvalidEndpointIdentification PASSED
org.apache.kafka.common.network.SslTransportLayerTest > testEndpointIdentificationDisabled STARTED
org.apache.kafka.common.network.SslTransportLayerTest > testEndpointIdentificationDisabled PASSED
org.apache.kafka.common.network.SslTransportLayerTest > testClientAuthenticationRequiredUntrustedProvided STARTED
org.apache.kafka.common.network.SslTransportLayerTest > testClientAuthenticationRequiredUntrustedProvided PASSED
org.apache.kafka.common.network.SslTransportLayerTest > testClientAuthenticationDisabledUntrustedProvided STARTED
org.apache.kafka.common.network.SslTransportLayerTest > testClientAuthenticationDisabledUntrustedProvided PASSED
org.apache.kafka.common.network.SslTransportLayerTest > testNetReadBufferResize STARTED
org.apache.kafka.common.network.SslTransportLayerTest > testNetReadBufferResize PASSED
org.apache.kafka.common.network.SslTransportLayerTest > testNetWriteBufferResize STARTED
org.apache.kafka.common.network.SslTransportLayerTest > testNetWriteBufferResize PASSED
org.apache.kafka.common.network.SslTransportLayerTest > testInvalidTruststorePassword STARTED
org.apache.kafka.common.network.SslTransportLayerTest > testInvalidTruststorePassword PASSED
org.apache.kafka.common.network.SslTransportLayerTest > testApplicationBufferResize STARTED
org.apache.kafka.common.network.SslTransportLayerTest > testApplicationBufferResize PASSED
org.apache.kafka.common.network.SslTransportLayerTest > testClientAuthenticationRequiredValidProvided STARTED
org.apache.kafka.common.network.SslTransportLayerTest > testClientAuthenticationRequiredValidProvided PASSED
org.apache.kafka.common.network.SslTransportLayerTest > testInvalidKeyPassword STARTED
org.apache.kafka.common.network.SslTransportLayerTest > testInvalidKeyPassword PASSED
org.apache.kafka.common.network.SslTransportLayerTest > testValidEndpointIdentification STARTED
org.apache.kafka.common.network.SslTransportLayerTest > testValidEndpointIdentification PASSED
org.apache.kafka.common.network.SelectorTest > testSendLargeRequest STARTED
org.apache.kafka.common.network.SelectorTest > testSendLargeRequest PASSED
org.apache.kafka.common.network.SelectorTest > testLargeMessageSequence STARTED
org.apache.kafka.common.network.SelectorTest > testLargeMessageSequence PASSED
org.apache.kafka.common.network.SelectorTest > testMute STARTED
org.apache.kafka.common.network.SelectorTest > testMute PASSED
org.apache.kafka.common.network.SelectorTest > testCantSendWithInProgress STARTED
org.apache.kafka.common.network.SelectorTest > testCantSendWithInProgress PASSED
org.apache.kafka.common.network.SelectorTest > testExistingConnectionId STARTED
org.apache.kafka.common.network.SelectorTest > testExistingConnectionId PASSED
org.apache.kafka.common.network.SelectorTest > testCantSendWithoutConnecting STARTED
org.apache.kafka.common.network.SelectorTest > testCantSendWithoutConnecting PASSED
org.apache.kafka.common.network.SelectorTest > testCloseOldestConnection STARTED
org.apache.kafka.common.network.SelectorTest > testCloseOldestConnection PASSED
org.apache.kafka.common.network.SelectorTest > testServerDisconnect STARTED
org.apache.kafka.common.network.SelectorTest > testServerDisconnect PASSED
org.apache.kafka.common.network.SelectorTest > testNoRouteToHost STARTED
org.apache.kafka.common.network.SelectorTest > testNoRouteToHost PASSED
org.apache.kafka.common.network.SelectorTest > testNormalOperation STARTED
org.apache.kafka.common.network.SelectorTest > testNormalOperation PASSED
org.apache.kafka.common.network.SelectorTest > testConnectionRefused STARTED
org.apache.kafka.common.network.SelectorTest > testConnectionRefused PASSED
org.apache.kafka.common.network.SelectorTest > testEmptyRequest STARTED
org.apache.kafka.common.network.SelectorTest > testEmptyRequest PASSED
org.apache.kafka.common.network.SslSelectorTest > testDisabledRenegotiation STARTED
org.apache.kafka.common.network.SslSelectorTest > testDisabledRenegotiation PASSED
org.apache.kafka.common.network.SslSelectorTest > testRenegotiation STARTED
ERROR: Could not install GRADLE_2_4_RC_2_HOME
java.lang.NullPointerException
at hudson.plugins.toolenv.ToolEnvBuildWrapper$1.buildEnvVars(ToolEnvBuildWrapper.java:46)
at hudson.model.AbstractBuild.getEnvironment(AbstractBuild.java:947)
at hudson.plugins.git.GitSCM.getParamExpandedRepos(GitSCM.java:390)
at hudson.plugins.git.GitSCM.compareRemoteRevisionWithImpl(GitSCM.java:577)
at hudson.plugins.git.GitSCM.compareRemoteRevisionWith(GitSCM.java:527)
at hudson.scm.SCM.compareRemoteRevisionWith(SCM.java:381)
at hudson.scm.SCM.poll(SCM.java:398)
at hudson.model.AbstractProject._poll(AbstractProject.java:1453)
at hudson.model.AbstractProject.poll(AbstractProject.java:1356)
at hudson.triggers.SCMTrigger$Runner.runPolling(SCMTrigger.java:526)
at hudson.triggers.SCMTrigger$Runner.run(SCMTrigger.java:555)
at hudson.util.SequentialExecutionQueue$QueueEntry.run(SequentialExecutionQueue.java:119)
at java.util.concurrent.Executors$RunnableAdapter.call(Executors.java:471)
at java.util.concurrent.FutureTask.run(FutureTask.java:262)
at java.util.concurrent.ThreadPoolExecutor.runWorker(ThreadPoolExecutor.java:1145)
at java.util.concurrent.ThreadPoolExecutor$Worker.run(ThreadPoolExecutor.java:615)
at java.lang.Thread.run(Thread.java:745)
ERROR: Could not install GRADLE_2_4_RC_2_HOME
java.lang.NullPointerException
at hudson.plugins.toolenv.ToolEnvBuildWrapper$1.buildEnvVars(ToolEnvBuildWrapper.java:46)
at hudson.model.AbstractBuild.getEnvironment(AbstractBuild.java:947)
at hudson.plugins.git.GitSCM.getParamExpandedRepos(GitSCM.java:390)
at hudson.plugins.git.GitSCM.compareRemoteRevisionWithImpl(GitSCM.java:577)
at hudson.plugins.git.GitSCM.compareRemoteRevisionWith(GitSCM.java:527)
at hudson.scm.SCM.compareRemoteRevisionWith(SCM.java:381)
at hudson.scm.SCM.poll(SCM.java:398)
at hudson.model.AbstractProject._poll(AbstractProject.java:1453)
at hudson.model.AbstractProject.poll(AbstractProject.java:1356)
at hudson.triggers.SCMTrigger$Runner.runPolling(SCMTrigger.java:526)
at hudson.triggers.SCMTrigger$Runner.run(SCMTrigger.java:555)
at hudson.util.SequentialExecutionQueue$QueueEntry.run(SequentialExecutionQueue.java:119)
at java.util.concurrent.Executors$RunnableAdapter.call(Executors.java:471)
at java.util.concurrent.FutureTask.run(FutureTask.java:262)
at java.util.concurrent.ThreadPoolExecutor.runWorker(ThreadPoolExecutor.java:1145)
at java.util.concurrent.ThreadPoolExecutor$Worker.run(ThreadPoolExecutor.java:615)
at java.lang.Thread.run(Thread.java:745)
Build timed out (after 180 minutes). Marking the build as failed.
Build was aborted
Recording test results
Setting GRADLE_2_4_RC_2_HOME=/home/jenkins/jenkins-slave/tools/hudson.plugins.gradle.GradleInstallation/Gradle_2.4-rc-2
Setting GRADLE_2_4_RC_2_HOME=/home/jenkins/jenkins-slave/tools/hudson.plugins.gradle.GradleInstallation/Gradle_2.4-rc-2