You are viewing a plain text version of this content. The canonical link for it is here.
Posted to builds@cassandra.apache.org by Apache Jenkins Server <je...@builds.apache.org> on 2021/09/17 00:18:29 UTC
Build complete: Cassandra-trunk #716 [UNSTABLE]
e86ae7fbe52c95747d69f7d78b6da6fbd34bd48d
-------------------------------------------------------------------------------
Build Cassandra-trunk #716 Still Unstable
URL: https://ci-cassandra.apache.org/job/Cassandra-trunk/716/
-------------------------------------------------------------------------------
Changes:
[Stefan Miklosovic] make creation timestamp consistent for all tables of a snapshot
-------------------------------------------------------------------------------
Failed Tests:
4 tests failed.
FAILED: dtest.materialized_views_test.TestMaterializedViewsConsistency.test_multi_partition_consistent_reads_after_write
FAILED: org.apache.cassandra.distributed.upgrade.CompactStorageUpgradeTest.compactStorageHiddenColumnTest
FAILED: org.apache.cassandra.cql3.validation.entities.SecondaryIndexTest.testIndexOnFrozenCollectionOfUDT-compression
FAILED: org.apache.cassandra.net.ConnectionTest.testMessageDeliveryOnReconnect-compression
-------------------------------------------------------------------------------
For complete test report and logs see https://nightlies.apache.org/cassandra/Cassandra-trunk/716/