You are viewing a plain text version of this content. The canonical link for it is here.
Posted to builds@cassandra.apache.org by Apache Jenkins Server <je...@builds.apache.org> on 2025/01/15 02:00:34 UTC

Build complete: Cassandra-trunk #1982 [UNSTABLE] 3c1e10b74e64b4fd9ca8bb203d503120c56f0e77

-------------------------------------------------------------------------------
  Build Cassandra-trunk #1982 Still Unstable
  URL: https://ci-cassandra.apache.org/job/Cassandra-trunk/1982/
  -------------------------------------------------------------------------------
  Changes:
  No changes

  -------------------------------------------------------------------------------
  Failed Tests:
  23 tests failed.
FAILED:  dtest-latest.disk_balance_test.TestDiskBalance.Tests / dtest-latest jdk17 40/64 / test_disk_balance_after_boundary_change_stcs
FAILED:  dtest-latest.read_repair_test.TestSpeculativeReadRepair.Tests / dtest-latest jdk11 64/64 / test_quorum_requirement
FAILED:  dtest-latest.read_repair_test.TestSpeculativeReadRepair.Tests / dtest-latest jdk17 1/64 / test_quorum_requirement_on_speculated_read
FAILED:  dtest-latest.read_repair_test.TestSpeculativeReadRepair.Tests / dtest-latest jdk11 62/64 / test_speculative_data_request
FAILED:  dtest-latest.read_repair_test.TestSpeculativeReadRepair.Tests / dtest-latest jdk17 63/64 / test_speculative_write
FAILED:  dtest.compaction_test.TestCompaction.Tests / dtest jdk11 58/64 / test_compaction_throughput
FAILED:  dtest.global_row_key_cache_test.TestGlobalRowKeyCache.Tests / dtest jdk11 49/64 / test_functional
FAILED:  dtest.repair_tests.incremental_repair_test.TestIncRepair.Tests / dtest jdk11 29/64 / test_multiple_full_repairs_lcs
FAILED:  dtest.replace_address_test.TestReplaceAddress.Tests / dtest jdk17 10/64 / test_fail_without_replace
FAILED:  dtest.sslnodetonode_test.TestNodeToNodeSSLEncryption.Tests / dtest jdk17 33/64 / test_ca_mismatch
FAILED:  org.apache.cassandra.distributed.test.CASTest.Tests / jvm-dtest jdk11 6/12 / fastReadsAndFailedWrites-_jdk11_x86_64
FAILED:  dtest-latest.read_repair_test.TestSpeculativeReadRepair.Tests / dtest-latest jdk17 61/64 / test_normal_read_repair
FAILED:  dtest-latest.read_repair_test.TestSpeculativeReadRepair.Tests / dtest-latest jdk11 1/64 / test_quorum_requirement_on_speculated_read
FAILED:  org.apache.cassandra.transport.SimpleClientPerfTest.Tests / test-burn jdk11 2/2 / measureLargeWithCompression[5/v5]-_jdk11_x86_64
FAILED:  org.apache.cassandra.transport.SimpleClientPerfTest.Tests / test-burn jdk17 2/2 / measureLargeWithCompression[5/v5]-_jdk17_x86_64
FAILED:  org.apache.cassandra.transport.SimpleClientPerfTest.Tests / test-burn jdk11 2/2 / measureLargeWithCompression[6/v6-beta]-_jdk11_x86_64
FAILED:  org.apache.cassandra.transport.SimpleClientPerfTest.Tests / test-burn jdk17 2/2 / measureLargeWithCompression[6/v6-beta]-_jdk17_x86_64
FAILED:  org.apache.cassandra.transport.SimpleClientPerfTest.Tests / test-burn jdk11 2/2 / measureLarge[5/v5]-_jdk11_x86_64
FAILED:  org.apache.cassandra.transport.SimpleClientPerfTest.Tests / test-burn jdk17 2/2 / measureLarge[5/v5]-_jdk17_x86_64
FAILED:  org.apache.cassandra.transport.SimpleClientPerfTest.Tests / test-burn jdk11 2/2 / measureLarge[6/v6-beta]-_jdk11_x86_64
FAILED:  org.apache.cassandra.transport.SimpleClientPerfTest.Tests / test-burn jdk17 2/2 / measureLarge[6/v6-beta]-_jdk17_x86_64
FAILED:  dtest.compaction_test.TestCompaction.Tests / dtest jdk17 58/64 / test_compaction_throughput
FAILED:  org.apache.cassandra.fuzz.harry.integration.model.InJVMTokenAwareExecutorTest.Tests / jvm-dtest jdk11 11/12 / testRepair-cassandra.testtag_IS_UNDEFINED

  -------------------------------------------------------------------------------
  For complete test report and logs see https://nightlies.apache.org/cassandra/Cassandra-trunk/1982/