You are viewing a plain text version of this content. The canonical link for it is here.
Posted to dev@lucene.apache.org by Policeman Jenkins Server <je...@thetaphi.de> on 2014/06/18 17:50:56 UTC
[JENKINS] Lucene-Solr-4.x-Linux (64bit/jdk1.8.0_20-ea-b15) - Build
# 10474 - Still Failing!
Build: http://jenkins.thetaphi.de/job/Lucene-Solr-4.x-Linux/10474/
Java: 64bit/jdk1.8.0_20-ea-b15 -XX:-UseCompressedOops -XX:+UseParallelGC
2 tests failed.
REGRESSION: org.apache.solr.cloud.OverseerStatusTest.testDistribSearch
Error Message:
overseerstatus the collection time out:180s
Stack Trace:
org.apache.solr.client.solrj.impl.HttpSolrServer$RemoteSolrException: overseerstatus the collection time out:180s
at org.apache.solr.client.solrj.impl.HttpSolrServer.executeMethod(HttpSolrServer.java:554)
at org.apache.solr.client.solrj.impl.HttpSolrServer.request(HttpSolrServer.java:210)
at org.apache.solr.client.solrj.impl.HttpSolrServer.request(HttpSolrServer.java:206)
at org.apache.solr.cloud.AbstractFullDistribZkTestBase.invokeCollectionApi(AbstractFullDistribZkTestBase.java:1730)
at org.apache.solr.cloud.OverseerStatusTest.doTest(OverseerStatusTest.java:96)
at org.apache.solr.BaseDistributedSearchTestCase.testDistribSearch(BaseDistributedSearchTestCase.java:865)
at sun.reflect.GeneratedMethodAccessor44.invoke(Unknown Source)
at sun.reflect.DelegatingMethodAccessorImpl.invoke(DelegatingMethodAccessorImpl.java:43)
at java.lang.reflect.Method.invoke(Method.java:483)
at com.carrotsearch.randomizedtesting.RandomizedRunner.invoke(RandomizedRunner.java:1618)
at com.carrotsearch.randomizedtesting.RandomizedRunner$6.evaluate(RandomizedRunner.java:827)
at com.carrotsearch.randomizedtesting.RandomizedRunner$7.evaluate(RandomizedRunner.java:863)
at com.carrotsearch.randomizedtesting.RandomizedRunner$8.evaluate(RandomizedRunner.java:877)
at com.carrotsearch.randomizedtesting.rules.SystemPropertiesRestoreRule$1.evaluate(SystemPropertiesRestoreRule.java:53)
at org.apache.lucene.util.TestRuleSetupTeardownChained$1.evaluate(TestRuleSetupTeardownChained.java:50)
at org.apache.lucene.util.TestRuleFieldCacheSanity$1.evaluate(TestRuleFieldCacheSanity.java:51)
at org.apache.lucene.util.AbstractBeforeAfterRule$1.evaluate(AbstractBeforeAfterRule.java:46)
at com.carrotsearch.randomizedtesting.rules.SystemPropertiesInvariantRule$1.evaluate(SystemPropertiesInvariantRule.java:55)
at org.apache.lucene.util.TestRuleThreadAndTestName$1.evaluate(TestRuleThreadAndTestName.java:49)
at org.apache.lucene.util.TestRuleIgnoreAfterMaxFailures$1.evaluate(TestRuleIgnoreAfterMaxFailures.java:65)
at org.apache.lucene.util.TestRuleMarkFailure$1.evaluate(TestRuleMarkFailure.java:48)
at com.carrotsearch.randomizedtesting.rules.StatementAdapter.evaluate(StatementAdapter.java:36)
at com.carrotsearch.randomizedtesting.ThreadLeakControl$StatementRunner.run(ThreadLeakControl.java:360)
at com.carrotsearch.randomizedtesting.ThreadLeakControl.forkTimeoutingTask(ThreadLeakControl.java:793)
at com.carrotsearch.randomizedtesting.ThreadLeakControl$3.evaluate(ThreadLeakControl.java:453)
at com.carrotsearch.randomizedtesting.RandomizedRunner.runSingleTest(RandomizedRunner.java:836)
at com.carrotsearch.randomizedtesting.RandomizedRunner$3.evaluate(RandomizedRunner.java:738)
at com.carrotsearch.randomizedtesting.RandomizedRunner$4.evaluate(RandomizedRunner.java:772)
at com.carrotsearch.randomizedtesting.RandomizedRunner$5.evaluate(RandomizedRunner.java:783)
at com.carrotsearch.randomizedtesting.rules.StatementAdapter.evaluate(StatementAdapter.java:36)
at com.carrotsearch.randomizedtesting.rules.SystemPropertiesRestoreRule$1.evaluate(SystemPropertiesRestoreRule.java:53)
at org.apache.lucene.util.AbstractBeforeAfterRule$1.evaluate(AbstractBeforeAfterRule.java:46)
at org.apache.lucene.util.TestRuleStoreClassName$1.evaluate(TestRuleStoreClassName.java:42)
at com.carrotsearch.randomizedtesting.rules.SystemPropertiesInvariantRule$1.evaluate(SystemPropertiesInvariantRule.java:55)
at com.carrotsearch.randomizedtesting.rules.NoShadowingOrOverridesOnMethodsRule$1.evaluate(NoShadowingOrOverridesOnMethodsRule.java:39)
at com.carrotsearch.randomizedtesting.rules.NoShadowingOrOverridesOnMethodsRule$1.evaluate(NoShadowingOrOverridesOnMethodsRule.java:39)
at com.carrotsearch.randomizedtesting.rules.StatementAdapter.evaluate(StatementAdapter.java:36)
at com.carrotsearch.randomizedtesting.rules.StatementAdapter.evaluate(StatementAdapter.java:36)
at com.carrotsearch.randomizedtesting.rules.StatementAdapter.evaluate(StatementAdapter.java:36)
at org.apache.lucene.util.TestRuleAssertionsRequired$1.evaluate(TestRuleAssertionsRequired.java:43)
at org.apache.lucene.util.TestRuleMarkFailure$1.evaluate(TestRuleMarkFailure.java:48)
at org.apache.lucene.util.TestRuleIgnoreAfterMaxFailures$1.evaluate(TestRuleIgnoreAfterMaxFailures.java:65)
at org.apache.lucene.util.TestRuleIgnoreTestSuites$1.evaluate(TestRuleIgnoreTestSuites.java:55)
at com.carrotsearch.randomizedtesting.rules.StatementAdapter.evaluate(StatementAdapter.java:36)
at com.carrotsearch.randomizedtesting.ThreadLeakControl$StatementRunner.run(ThreadLeakControl.java:360)
at java.lang.Thread.run(Thread.java:745)
FAILED: org.apache.solr.cloud.SyncSliceTest.testDistribSearch
Error Message:
No live SolrServers available to handle this request
Stack Trace:
org.apache.solr.client.solrj.SolrServerException: No live SolrServers available to handle this request
at __randomizedtesting.SeedInfo.seed([464EC46D52D3FA02:C7A84A75258C9A3E]:0)
at org.apache.solr.client.solrj.impl.LBHttpSolrServer.request(LBHttpSolrServer.java:317)
at org.apache.solr.client.solrj.impl.CloudSolrServer.request(CloudSolrServer.java:659)
at org.apache.solr.client.solrj.request.QueryRequest.process(QueryRequest.java:91)
at org.apache.solr.client.solrj.SolrServer.query(SolrServer.java:301)
at org.apache.solr.cloud.AbstractFullDistribZkTestBase.checkShardConsistency(AbstractFullDistribZkTestBase.java:1149)
at org.apache.solr.cloud.AbstractFullDistribZkTestBase.checkShardConsistency(AbstractFullDistribZkTestBase.java:1118)
at org.apache.solr.cloud.SyncSliceTest.doTest(SyncSliceTest.java:236)
at org.apache.solr.BaseDistributedSearchTestCase.testDistribSearch(BaseDistributedSearchTestCase.java:865)
at sun.reflect.NativeMethodAccessorImpl.invoke0(Native Method)
at sun.reflect.NativeMethodAccessorImpl.invoke(NativeMethodAccessorImpl.java:62)
at sun.reflect.DelegatingMethodAccessorImpl.invoke(DelegatingMethodAccessorImpl.java:43)
at java.lang.reflect.Method.invoke(Method.java:483)
at com.carrotsearch.randomizedtesting.RandomizedRunner.invoke(RandomizedRunner.java:1618)
at com.carrotsearch.randomizedtesting.RandomizedRunner$6.evaluate(RandomizedRunner.java:827)
at com.carrotsearch.randomizedtesting.RandomizedRunner$7.evaluate(RandomizedRunner.java:863)
at com.carrotsearch.randomizedtesting.RandomizedRunner$8.evaluate(RandomizedRunner.java:877)
at com.carrotsearch.randomizedtesting.rules.SystemPropertiesRestoreRule$1.evaluate(SystemPropertiesRestoreRule.java:53)
at org.apache.lucene.util.TestRuleSetupTeardownChained$1.evaluate(TestRuleSetupTeardownChained.java:50)
at org.apache.lucene.util.TestRuleFieldCacheSanity$1.evaluate(TestRuleFieldCacheSanity.java:51)
at org.apache.lucene.util.AbstractBeforeAfterRule$1.evaluate(AbstractBeforeAfterRule.java:46)
at com.carrotsearch.randomizedtesting.rules.SystemPropertiesInvariantRule$1.evaluate(SystemPropertiesInvariantRule.java:55)
at org.apache.lucene.util.TestRuleThreadAndTestName$1.evaluate(TestRuleThreadAndTestName.java:49)
at org.apache.lucene.util.TestRuleIgnoreAfterMaxFailures$1.evaluate(TestRuleIgnoreAfterMaxFailures.java:65)
at org.apache.lucene.util.TestRuleMarkFailure$1.evaluate(TestRuleMarkFailure.java:48)
at com.carrotsearch.randomizedtesting.rules.StatementAdapter.evaluate(StatementAdapter.java:36)
at com.carrotsearch.randomizedtesting.ThreadLeakControl$StatementRunner.run(ThreadLeakControl.java:360)
at com.carrotsearch.randomizedtesting.ThreadLeakControl.forkTimeoutingTask(ThreadLeakControl.java:793)
at com.carrotsearch.randomizedtesting.ThreadLeakControl$3.evaluate(ThreadLeakControl.java:453)
at com.carrotsearch.randomizedtesting.RandomizedRunner.runSingleTest(RandomizedRunner.java:836)
at com.carrotsearch.randomizedtesting.RandomizedRunner$3.evaluate(RandomizedRunner.java:738)
at com.carrotsearch.randomizedtesting.RandomizedRunner$4.evaluate(RandomizedRunner.java:772)
at com.carrotsearch.randomizedtesting.RandomizedRunner$5.evaluate(RandomizedRunner.java:783)
at com.carrotsearch.randomizedtesting.rules.StatementAdapter.evaluate(StatementAdapter.java:36)
at com.carrotsearch.randomizedtesting.rules.SystemPropertiesRestoreRule$1.evaluate(SystemPropertiesRestoreRule.java:53)
at org.apache.lucene.util.AbstractBeforeAfterRule$1.evaluate(AbstractBeforeAfterRule.java:46)
at org.apache.lucene.util.TestRuleStoreClassName$1.evaluate(TestRuleStoreClassName.java:42)
at com.carrotsearch.randomizedtesting.rules.SystemPropertiesInvariantRule$1.evaluate(SystemPropertiesInvariantRule.java:55)
at com.carrotsearch.randomizedtesting.rules.NoShadowingOrOverridesOnMethodsRule$1.evaluate(NoShadowingOrOverridesOnMethodsRule.java:39)
at com.carrotsearch.randomizedtesting.rules.NoShadowingOrOverridesOnMethodsRule$1.evaluate(NoShadowingOrOverridesOnMethodsRule.java:39)
at com.carrotsearch.randomizedtesting.rules.StatementAdapter.evaluate(StatementAdapter.java:36)
at com.carrotsearch.randomizedtesting.rules.StatementAdapter.evaluate(StatementAdapter.java:36)
at com.carrotsearch.randomizedtesting.rules.StatementAdapter.evaluate(StatementAdapter.java:36)
at org.apache.lucene.util.TestRuleAssertionsRequired$1.evaluate(TestRuleAssertionsRequired.java:43)
at org.apache.lucene.util.TestRuleMarkFailure$1.evaluate(TestRuleMarkFailure.java:48)
at org.apache.lucene.util.TestRuleIgnoreAfterMaxFailures$1.evaluate(TestRuleIgnoreAfterMaxFailures.java:65)
at org.apache.lucene.util.TestRuleIgnoreTestSuites$1.evaluate(TestRuleIgnoreTestSuites.java:55)
at com.carrotsearch.randomizedtesting.rules.StatementAdapter.evaluate(StatementAdapter.java:36)
at com.carrotsearch.randomizedtesting.ThreadLeakControl$StatementRunner.run(ThreadLeakControl.java:360)
at java.lang.Thread.run(Thread.java:745)
Build Log:
[...truncated 11097 lines...]
[junit4] Suite: org.apache.solr.cloud.SyncSliceTest
[junit4] 2> Creating dataDir: /mnt/ssd/jenkins/workspace/Lucene-Solr-4.x-Linux/solr/build/solr-core/test/J0/./solr.cloud.SyncSliceTest-464EC46D52D3FA02-001/init-core-data-001
[junit4] 2> 257620 T1440 oas.SolrTestCaseJ4.buildSSLConfig Randomized ssl (true) and clientAuth (false)
[junit4] 2> 257620 T1440 oas.BaseDistributedSearchTestCase.initHostContext Setting hostContext system property: /
[junit4] 2> 257622 T1440 oas.SolrTestCaseJ4.setUp ###Starting testDistribSearch
[junit4] 2> 257623 T1440 oasc.ZkTestServer.run STARTING ZK TEST SERVER
[junit4] 1> client port:0.0.0.0/0.0.0.0:0
[junit4] 2> 257623 T1441 oasc.ZkTestServer$ZKServerMain.runFromConfig Starting server
[junit4] 2> 257723 T1440 oasc.ZkTestServer.run start zk server on port:60693
[junit4] 2> 257724 T1440 oascc.ConnectionManager.waitForConnected Waiting for client to connect to ZooKeeper
[junit4] 2> 257736 T1447 oascc.ConnectionManager.process Watcher org.apache.solr.common.cloud.ConnectionManager@1adadca8 name:ZooKeeperConnection Watcher:127.0.0.1:60693 got event WatchedEvent state:SyncConnected type:None path:null path:null type:None
[junit4] 2> 257737 T1440 oascc.ConnectionManager.waitForConnected Client is connected to ZooKeeper
[junit4] 2> 257737 T1440 oascc.SolrZkClient.makePath makePath: /solr
[junit4] 2> 257740 T1440 oascc.ConnectionManager.waitForConnected Waiting for client to connect to ZooKeeper
[junit4] 2> 257741 T1449 oascc.ConnectionManager.process Watcher org.apache.solr.common.cloud.ConnectionManager@57a6cbfd name:ZooKeeperConnection Watcher:127.0.0.1:60693/solr got event WatchedEvent state:SyncConnected type:None path:null path:null type:None
[junit4] 2> 257741 T1440 oascc.ConnectionManager.waitForConnected Client is connected to ZooKeeper
[junit4] 2> 257742 T1440 oascc.SolrZkClient.makePath makePath: /collections/collection1
[junit4] 2> 257745 T1440 oascc.SolrZkClient.makePath makePath: /collections/collection1/shards
[junit4] 2> 257747 T1440 oascc.SolrZkClient.makePath makePath: /collections/control_collection
[junit4] 2> 257749 T1440 oascc.SolrZkClient.makePath makePath: /collections/control_collection/shards
[junit4] 2> 257751 T1440 oasc.AbstractZkTestCase.putConfig put /mnt/ssd/jenkins/workspace/Lucene-Solr-4.x-Linux/solr/core/src/test-files/solr/collection1/conf/solrconfig-tlog.xml to /configs/conf1/solrconfig.xml
[junit4] 2> 257751 T1440 oascc.SolrZkClient.makePath makePath: /configs/conf1/solrconfig.xml
[junit4] 2> 257753 T1440 oasc.AbstractZkTestCase.putConfig put /mnt/ssd/jenkins/workspace/Lucene-Solr-4.x-Linux/solr/core/src/test-files/solr/collection1/conf/schema.xml to /configs/conf1/schema.xml
[junit4] 2> 257754 T1440 oascc.SolrZkClient.makePath makePath: /configs/conf1/schema.xml
[junit4] 2> 257755 T1440 oasc.AbstractZkTestCase.putConfig put /mnt/ssd/jenkins/workspace/Lucene-Solr-4.x-Linux/solr/core/src/test-files/solr/collection1/conf/solrconfig.snippet.randomindexconfig.xml to /configs/conf1/solrconfig.snippet.randomindexconfig.xml
[junit4] 2> 257755 T1440 oascc.SolrZkClient.makePath makePath: /configs/conf1/solrconfig.snippet.randomindexconfig.xml
[junit4] 2> 257757 T1440 oasc.AbstractZkTestCase.putConfig put /mnt/ssd/jenkins/workspace/Lucene-Solr-4.x-Linux/solr/core/src/test-files/solr/collection1/conf/stopwords.txt to /configs/conf1/stopwords.txt
[junit4] 2> 257757 T1440 oascc.SolrZkClient.makePath makePath: /configs/conf1/stopwords.txt
[junit4] 2> 257758 T1440 oasc.AbstractZkTestCase.putConfig put /mnt/ssd/jenkins/workspace/Lucene-Solr-4.x-Linux/solr/core/src/test-files/solr/collection1/conf/protwords.txt to /configs/conf1/protwords.txt
[junit4] 2> 257759 T1440 oascc.SolrZkClient.makePath makePath: /configs/conf1/protwords.txt
[junit4] 2> 257760 T1440 oasc.AbstractZkTestCase.putConfig put /mnt/ssd/jenkins/workspace/Lucene-Solr-4.x-Linux/solr/core/src/test-files/solr/collection1/conf/currency.xml to /configs/conf1/currency.xml
[junit4] 2> 257760 T1440 oascc.SolrZkClient.makePath makePath: /configs/conf1/currency.xml
[junit4] 2> 257761 T1440 oasc.AbstractZkTestCase.putConfig put /mnt/ssd/jenkins/workspace/Lucene-Solr-4.x-Linux/solr/core/src/test-files/solr/collection1/conf/enumsConfig.xml to /configs/conf1/enumsConfig.xml
[junit4] 2> 257761 T1440 oascc.SolrZkClient.makePath makePath: /configs/conf1/enumsConfig.xml
[junit4] 2> 257763 T1440 oasc.AbstractZkTestCase.putConfig put /mnt/ssd/jenkins/workspace/Lucene-Solr-4.x-Linux/solr/core/src/test-files/solr/collection1/conf/open-exchange-rates.json to /configs/conf1/open-exchange-rates.json
[junit4] 2> 257763 T1440 oascc.SolrZkClient.makePath makePath: /configs/conf1/open-exchange-rates.json
[junit4] 2> 257764 T1440 oasc.AbstractZkTestCase.putConfig put /mnt/ssd/jenkins/workspace/Lucene-Solr-4.x-Linux/solr/core/src/test-files/solr/collection1/conf/mapping-ISOLatin1Accent.txt to /configs/conf1/mapping-ISOLatin1Accent.txt
[junit4] 2> 257765 T1440 oascc.SolrZkClient.makePath makePath: /configs/conf1/mapping-ISOLatin1Accent.txt
[junit4] 2> 257766 T1440 oasc.AbstractZkTestCase.putConfig put /mnt/ssd/jenkins/workspace/Lucene-Solr-4.x-Linux/solr/core/src/test-files/solr/collection1/conf/old_synonyms.txt to /configs/conf1/old_synonyms.txt
[junit4] 2> 257766 T1440 oascc.SolrZkClient.makePath makePath: /configs/conf1/old_synonyms.txt
[junit4] 2> 257767 T1440 oasc.AbstractZkTestCase.putConfig put /mnt/ssd/jenkins/workspace/Lucene-Solr-4.x-Linux/solr/core/src/test-files/solr/collection1/conf/synonyms.txt to /configs/conf1/synonyms.txt
[junit4] 2> 257768 T1440 oascc.SolrZkClient.makePath makePath: /configs/conf1/synonyms.txt
[junit4] 2> 257769 T1440 oascc.ConnectionManager.waitForConnected Waiting for client to connect to ZooKeeper
[junit4] 2> 257770 T1451 oascc.ConnectionManager.process Watcher org.apache.solr.common.cloud.ConnectionManager@4114c43c name:ZooKeeperConnection Watcher:127.0.0.1:60693/solr got event WatchedEvent state:SyncConnected type:None path:null path:null type:None
[junit4] 2> 257771 T1440 oascc.ConnectionManager.waitForConnected Client is connected to ZooKeeper
[junit4] 2> 257991 T1440 oejs.Server.doStart jetty-8.1.10.v20130312
[junit4] 2> 258002 T1440 oejus.SslContextFactory.doStart Enabled Protocols [SSLv2Hello, SSLv3, TLSv1, TLSv1.1, TLSv1.2] of [SSLv2Hello, SSLv3, TLSv1, TLSv1.1, TLSv1.2]
[junit4] 2> 258006 T1440 oejs.AbstractConnector.doStart Started SslSelectChannelConnector@127.0.0.1:37552
[junit4] 2> 258008 T1440 oass.SolrDispatchFilter.init SolrDispatchFilter.init()
[junit4] 2> 258009 T1440 oasc.SolrResourceLoader.locateSolrHome JNDI not configured for solr (NoInitialContextEx)
[junit4] 2> 258009 T1440 oasc.SolrResourceLoader.locateSolrHome using system property solr.solr.home: ./solr.cloud.SyncSliceTest-464EC46D52D3FA02-001/tempDir-002
[junit4] 2> 258009 T1440 oasc.SolrResourceLoader.<init> new SolrResourceLoader for directory: './solr.cloud.SyncSliceTest-464EC46D52D3FA02-001/tempDir-002/'
[junit4] 2> 258019 T1440 oasc.ConfigSolr.fromFile Loading container configuration from /mnt/ssd/jenkins/workspace/Lucene-Solr-4.x-Linux/solr/build/solr-core/test/J0/./solr.cloud.SyncSliceTest-464EC46D52D3FA02-001/tempDir-002/solr.xml
[junit4] 2> 258026 T1440 oasc.CoreContainer.<init> New CoreContainer 805574561
[junit4] 2> 258027 T1440 oasc.CoreContainer.load Loading cores into CoreContainer [instanceDir=./solr.cloud.SyncSliceTest-464EC46D52D3FA02-001/tempDir-002/]
[junit4] 2> 258027 T1440 oashc.HttpShardHandlerFactory.getParameter Setting socketTimeout to: 90000
[junit4] 2> 258027 T1440 oashc.HttpShardHandlerFactory.getParameter Setting urlScheme to:
[junit4] 2> 258028 T1440 oashc.HttpShardHandlerFactory.getParameter Setting connTimeout to: 15000
[junit4] 2> 258028 T1440 oashc.HttpShardHandlerFactory.getParameter Setting maxConnectionsPerHost to: 20
[junit4] 2> 258028 T1440 oashc.HttpShardHandlerFactory.getParameter Setting corePoolSize to: 0
[junit4] 2> 258028 T1440 oashc.HttpShardHandlerFactory.getParameter Setting maximumPoolSize to: 2147483647
[junit4] 2> 258028 T1440 oashc.HttpShardHandlerFactory.getParameter Setting maxThreadIdleTime to: 5
[junit4] 2> 258029 T1440 oashc.HttpShardHandlerFactory.getParameter Setting sizeOfQueue to: -1
[junit4] 2> 258029 T1440 oashc.HttpShardHandlerFactory.getParameter Setting fairnessPolicy to: false
[junit4] 2> 258030 T1440 oasl.LogWatcher.createWatcher SLF4J impl is org.slf4j.impl.Log4jLoggerFactory
[junit4] 2> 258031 T1440 oasl.LogWatcher.newRegisteredLogWatcher Registering Log Listener [Log4j (org.slf4j.impl.Log4jLoggerFactory)]
[junit4] 2> 258031 T1440 oasc.CoreContainer.load Host Name: 127.0.0.1
[junit4] 2> 258031 T1440 oasc.ZkContainer.initZooKeeper Zookeeper client=127.0.0.1:60693/solr
[junit4] 2> 258031 T1440 oasc.ZkController.checkChrootPath zkHost includes chroot
[junit4] 2> 258032 T1440 oascc.ConnectionManager.waitForConnected Waiting for client to connect to ZooKeeper
[junit4] 2> 258034 T1462 oascc.ConnectionManager.process Watcher org.apache.solr.common.cloud.ConnectionManager@218892c9 name:ZooKeeperConnection Watcher:127.0.0.1:60693 got event WatchedEvent state:SyncConnected type:None path:null path:null type:None
[junit4] 2> 258035 T1440 oascc.ConnectionManager.waitForConnected Client is connected to ZooKeeper
[junit4] 2> 258036 T1440 oascc.ConnectionManager.waitForConnected Waiting for client to connect to ZooKeeper
[junit4] 2> 258037 T1464 oascc.ConnectionManager.process Watcher org.apache.solr.common.cloud.ConnectionManager@ce30120 name:ZooKeeperConnection Watcher:127.0.0.1:60693/solr got event WatchedEvent state:SyncConnected type:None path:null path:null type:None
[junit4] 2> 258037 T1440 oascc.ConnectionManager.waitForConnected Client is connected to ZooKeeper
[junit4] 2> 258038 T1440 oascc.SolrZkClient.makePath makePath: /overseer/queue
[junit4] 2> 258040 T1440 oascc.SolrZkClient.makePath makePath: /overseer/collection-queue-work
[junit4] 2> 258042 T1440 oascc.SolrZkClient.makePath makePath: /overseer/collection-map-running
[junit4] 2> 258043 T1440 oascc.SolrZkClient.makePath makePath: /overseer/collection-map-completed
[junit4] 2> 258048 T1440 oascc.SolrZkClient.makePath makePath: /overseer/collection-map-failure
[junit4] 2> 258050 T1440 oascc.SolrZkClient.makePath makePath: /live_nodes
[junit4] 2> 258051 T1440 oasc.ZkController.createEphemeralLiveNode Register node as live in ZooKeeper:/live_nodes/127.0.0.1:37552_
[junit4] 2> 258052 T1440 oascc.SolrZkClient.makePath makePath: /live_nodes/127.0.0.1:37552_
[junit4] 2> 258053 T1440 oascc.SolrZkClient.makePath makePath: /overseer_elect
[junit4] 2> 258054 T1440 oascc.SolrZkClient.makePath makePath: /overseer_elect/election
[junit4] 2> 258056 T1440 oasc.OverseerElectionContext.runLeaderProcess I am going to be the leader 127.0.0.1:37552_
[junit4] 2> 258057 T1440 oascc.SolrZkClient.makePath makePath: /overseer_elect/leader
[junit4] 2> 258058 T1440 oasc.Overseer.start Overseer (id=91953892699471876-127.0.0.1:37552_-n_0000000000) starting
[junit4] 2> 258060 T1440 oascc.SolrZkClient.makePath makePath: /overseer/queue-work
[junit4] 2> 258069 T1466 oasc.OverseerCollectionProcessor.run Process current queue of collection creations
[junit4] 2> 258069 T1440 oascc.SolrZkClient.makePath makePath: /clusterstate.json
[junit4] 2> 258070 T1440 oascc.SolrZkClient.makePath makePath: /aliases.json
[junit4] 2> 258071 T1440 oascc.ZkStateReader.createClusterStateWatchersAndUpdate Updating cluster state from ZooKeeper...
[junit4] 2> 258072 T1465 oasc.Overseer$ClusterStateUpdater.run Starting to work on the main queue
[junit4] 2> 258073 T1467 oasc.ZkController.publish publishing core=collection1 state=down collection=control_collection
[junit4] 2> 258074 T1467 oasc.ZkController.publish numShards not found on descriptor - reading it from system property
[junit4] 2> 258074 T1464 oasc.DistributedQueue$LatchChildWatcher.process LatchChildWatcher fired on path: /overseer/queue state: SyncConnected type NodeChildrenChanged
[junit4] 2> 258074 T1467 oasc.ZkController.waitForCoreNodeName look for our core node name
[junit4] 2> 258075 T1465 oascc.ZkStateReader.updateClusterState Updating cloud state from ZooKeeper...
[junit4] 2> 258075 T1465 oasc.Overseer$ClusterStateUpdater.updateState Update state numShards=1 message={
[junit4] 2> "operation":"state",
[junit4] 2> "state":"down",
[junit4] 2> "base_url":"https://127.0.0.1:37552",
[junit4] 2> "core":"collection1",
[junit4] 2> "roles":null,
[junit4] 2> "node_name":"127.0.0.1:37552_",
[junit4] 2> "shard":null,
[junit4] 2> "collection":"control_collection",
[junit4] 2> "numShards":"1",
[junit4] 2> "core_node_name":null}
[junit4] 2> 258075 T1465 oasc.Overseer$ClusterStateUpdater.createCollection Create collection control_collection with shards [shard1]
[junit4] 2> 258075 T1465 oasc.Overseer$ClusterStateUpdater.updateState Assigning new node to shard shard=shard1
[junit4] 2> 258077 T1464 oasc.DistributedQueue$LatchChildWatcher.process LatchChildWatcher fired on path: /overseer/queue state: SyncConnected type NodeChildrenChanged
[junit4] 2> 258077 T1464 oascc.ZkStateReader$2.process A cluster state change: WatchedEvent state:SyncConnected type:NodeDataChanged path:/clusterstate.json, has occurred - updating... (live nodes size: 1)
[junit4] 2> 259075 T1467 oasc.ZkController.waitForShardId waiting to find shard id in clusterstate for collection1
[junit4] 2> 259075 T1467 oasc.ZkController.createCollectionZkNode Check for collection zkNode:control_collection
[junit4] 2> 259075 T1467 oasc.ZkController.createCollectionZkNode Collection zkNode exists
[junit4] 2> 259075 T1467 oascc.ZkStateReader.readConfigName Load collection config from:/collections/control_collection
[junit4] 2> 259076 T1467 oascc.ZkStateReader.readConfigName path=/collections/control_collection configName=conf1 specified config exists in ZooKeeper
[junit4] 2> 259076 T1467 oasc.SolrResourceLoader.<init> new SolrResourceLoader for directory: './solr.cloud.SyncSliceTest-464EC46D52D3FA02-001/tempDir-002/collection1/'
[junit4] 2> 259077 T1467 oasc.SolrResourceLoader.replaceClassLoader Adding 'file:/mnt/ssd/jenkins/workspace/Lucene-Solr-4.x-Linux/solr/build/solr-core/test/J0/solr.cloud.SyncSliceTest-464EC46D52D3FA02-001/tempDir-002/collection1/lib/.svn/' to classloader
[junit4] 2> 259077 T1467 oasc.SolrResourceLoader.replaceClassLoader Adding 'file:/mnt/ssd/jenkins/workspace/Lucene-Solr-4.x-Linux/solr/build/solr-core/test/J0/solr.cloud.SyncSliceTest-464EC46D52D3FA02-001/tempDir-002/collection1/lib/classes/' to classloader
[junit4] 2> 259077 T1467 oasc.SolrResourceLoader.replaceClassLoader Adding 'file:/mnt/ssd/jenkins/workspace/Lucene-Solr-4.x-Linux/solr/build/solr-core/test/J0/solr.cloud.SyncSliceTest-464EC46D52D3FA02-001/tempDir-002/collection1/lib/README' to classloader
[junit4] 2> 259094 T1467 oasc.SolrConfig.<init> Using Lucene MatchVersion: LUCENE_4_10
[junit4] 2> 259104 T1467 oasc.SolrConfig.<init> Loaded SolrConfig: solrconfig.xml
[junit4] 2> 259104 T1467 oass.IndexSchema.readSchema Reading Solr Schema from schema.xml
[junit4] 2> 259109 T1467 oass.IndexSchema.readSchema [collection1] Schema name=test
[junit4] 2> 259212 T1467 oass.ByteField.init WARN ByteField is deprecated and will be removed in 5.0. You should use TrieIntField instead.
[junit4] 2> 259212 T1467 oass.ShortField.init WARN ShortField is deprecated and will be removed in 5.0. You should use TrieIntField instead.
[junit4] 2> 259213 T1467 oass.OpenExchangeRatesOrgProvider.init Initialized with rates=open-exchange-rates.json, refreshInterval=1440.
[junit4] 2> 259216 T1467 oass.IndexSchema.readSchema default search field in schema is text
[junit4] 2> 259217 T1467 oass.IndexSchema.readSchema unique key field: id
[junit4] 2> 259224 T1467 oass.FileExchangeRateProvider.reload Reloading exchange rates from file currency.xml
[junit4] 2> 259226 T1467 oass.FileExchangeRateProvider.reload Reloading exchange rates from file currency.xml
[junit4] 2> 259231 T1467 oass.OpenExchangeRatesOrgProvider.reload Reloading exchange rates from open-exchange-rates.json
[junit4] 2> 259233 T1467 oass.OpenExchangeRatesOrgProvider$OpenExchangeRates.<init> WARN Unknown key IMPORTANT NOTE
[junit4] 2> 259233 T1467 oass.OpenExchangeRatesOrgProvider$OpenExchangeRates.<init> WARN Expected key, got STRING
[junit4] 2> 259233 T1467 oass.OpenExchangeRatesOrgProvider.reload Reloading exchange rates from open-exchange-rates.json
[junit4] 2> 259234 T1467 oass.OpenExchangeRatesOrgProvider$OpenExchangeRates.<init> WARN Unknown key IMPORTANT NOTE
[junit4] 2> 259234 T1467 oass.OpenExchangeRatesOrgProvider$OpenExchangeRates.<init> WARN Expected key, got STRING
[junit4] 2> 259234 T1467 oasc.CoreContainer.create Creating SolrCore 'collection1' using configuration from collection control_collection
[junit4] 2> 259234 T1467 oasc.SolrCore.initDirectoryFactory org.apache.solr.core.MockDirectoryFactory
[junit4] 2> 259235 T1467 oasc.SolrCore.<init> [collection1] Opening new SolrCore at ./solr.cloud.SyncSliceTest-464EC46D52D3FA02-001/tempDir-002/collection1/, dataDir=./solr.cloud.SyncSliceTest-464EC46D52D3FA02-001/tempDir-001/control/data/
[junit4] 2> 259235 T1467 oasc.JmxMonitoredMap.<init> JMX monitoring is enabled. Adding Solr mbeans to JMX Server: com.sun.jmx.mbeanserver.JmxMBeanServer@39b9475d
[junit4] 2> 259235 T1467 oasc.CachingDirectoryFactory.get return new directory for ./solr.cloud.SyncSliceTest-464EC46D52D3FA02-001/tempDir-001/control/data
[junit4] 2> 259235 T1467 oasc.SolrCore.getNewIndexDir New index directory detected: old=null new=./solr.cloud.SyncSliceTest-464EC46D52D3FA02-001/tempDir-001/control/data/index/
[junit4] 2> 259235 T1467 oasc.SolrCore.initIndex WARN [collection1] Solr index directory './solr.cloud.SyncSliceTest-464EC46D52D3FA02-001/tempDir-001/control/data/index' doesn't exist. Creating new index...
[junit4] 2> 259236 T1467 oasc.CachingDirectoryFactory.get return new directory for ./solr.cloud.SyncSliceTest-464EC46D52D3FA02-001/tempDir-001/control/data/index
[junit4] 2> 259236 T1467 oasu.RandomMergePolicy.<init> RandomMergePolicy wrapping class org.apache.lucene.index.LogDocMergePolicy: [LogDocMergePolicy: minMergeSize=1000, mergeFactor=39, maxMergeSize=9223372036854775807, maxMergeSizeForForcedMerge=9223372036854775807, calibrateSizeByDeletes=true, maxMergeDocs=2147483647, maxCFSSegmentSizeMB=8.796093022207999E12, noCFSRatio=1.0]
[junit4] 2> 259236 T1467 oasc.SolrDeletionPolicy.onCommit SolrDeletionPolicy.onCommit: commits: num=1
[junit4] 2> commit{dir=MockDirectoryWrapper(RAMDirectory@19257e16 lockFactory=org.apache.lucene.store.SingleInstanceLockFactory@676af1ef),segFN=segments_1,generation=1}
[junit4] 2> 259237 T1467 oasc.SolrDeletionPolicy.updateCommits newest commit generation = 1
[junit4] 2> 259238 T1467 oasup.UpdateRequestProcessorChain.init creating updateRequestProcessorChain "nodistrib"
[junit4] 2> 259238 T1467 oasup.UpdateRequestProcessorChain.init creating updateRequestProcessorChain "dedupe"
[junit4] 2> 259239 T1467 oasup.UpdateRequestProcessorChain.init inserting DistributedUpdateProcessorFactory into updateRequestProcessorChain "dedupe"
[junit4] 2> 259239 T1467 oasup.UpdateRequestProcessorChain.init creating updateRequestProcessorChain "stored_sig"
[junit4] 2> 259239 T1467 oasup.UpdateRequestProcessorChain.init inserting DistributedUpdateProcessorFactory into updateRequestProcessorChain "stored_sig"
[junit4] 2> 259239 T1467 oasup.UpdateRequestProcessorChain.init creating updateRequestProcessorChain "distrib-dup-test-chain-explicit"
[junit4] 2> 259239 T1467 oasup.UpdateRequestProcessorChain.init creating updateRequestProcessorChain "distrib-dup-test-chain-implicit"
[junit4] 2> 259240 T1467 oasup.UpdateRequestProcessorChain.init inserting DistributedUpdateProcessorFactory into updateRequestProcessorChain "distrib-dup-test-chain-implicit"
[junit4] 2> 259240 T1467 oasc.SolrCore.loadUpdateProcessorChains no updateRequestProcessorChain defined as default, creating implicit default
[junit4] 2> 259240 T1467 oasc.RequestHandlers.initHandlersFromConfig created standard: solr.StandardRequestHandler
[junit4] 2> 259240 T1467 oasc.RequestHandlers.initHandlersFromConfig created /get: solr.RealTimeGetHandler
[junit4] 2> 259240 T1467 oasc.RequestHandlers.initHandlersFromConfig adding lazy requestHandler: solr.ReplicationHandler
[junit4] 2> 259240 T1467 oasc.RequestHandlers.initHandlersFromConfig created /replication: solr.ReplicationHandler
[junit4] 2> 259241 T1467 oasc.RequestHandlers.initHandlersFromConfig created /update: solr.UpdateRequestHandler
[junit4] 2> 259241 T1467 oasc.RequestHandlers.initHandlersFromConfig created /admin/: org.apache.solr.handler.admin.AdminHandlers
[junit4] 2> 259241 T1467 oasc.RequestHandlers.initHandlersFromConfig created /admin/file: solr.admin.ShowFileRequestHandler
[junit4] 2> 259243 T1467 oashl.XMLLoader.init xsltCacheLifetimeSeconds=60
[junit4] 2> 259244 T1467 oasu.CommitTracker.<init> Hard AutoCommit: disabled
[junit4] 2> 259244 T1467 oasu.CommitTracker.<init> Soft AutoCommit: disabled
[junit4] 2> 259245 T1467 oasu.RandomMergePolicy.<init> RandomMergePolicy wrapping class org.apache.lucene.index.TieredMergePolicy: [TieredMergePolicy: maxMergeAtOnce=10, maxMergeAtOnceExplicit=23, maxMergedSegmentMB=89.2470703125, floorSegmentMB=1.1689453125, forceMergeDeletesPctAllowed=11.791453770807557, segmentsPerTier=14.0, maxCFSSegmentSizeMB=8.796093022207999E12, noCFSRatio=1.0
[junit4] 2> 259245 T1467 oasc.SolrDeletionPolicy.onInit SolrDeletionPolicy.onInit: commits: num=1
[junit4] 2> commit{dir=MockDirectoryWrapper(RAMDirectory@19257e16 lockFactory=org.apache.lucene.store.SingleInstanceLockFactory@676af1ef),segFN=segments_1,generation=1}
[junit4] 2> 259245 T1467 oasc.SolrDeletionPolicy.updateCommits newest commit generation = 1
[junit4] 2> 259245 T1467 oass.SolrIndexSearcher.<init> Opening Searcher@388f6f74[collection1] main
[junit4] 2> 259246 T1467 oascc.ZkStateReader.readConfigName Load collection config from:/collections/control_collection
[junit4] 2> 259246 T1467 oascc.ZkStateReader.readConfigName path=/collections/control_collection configName=conf1 specified config exists in ZooKeeper
[junit4] 2> 259246 T1467 oasr.ManagedResourceStorage.newStorageIO Setting up ZooKeeper-based storage for the RestManager with znodeBase: /configs/conf1
[junit4] 2> 259247 T1467 oasr.ManagedResourceStorage$ZooKeeperStorageIO.configure Configured ZooKeeperStorageIO with znodeBase: /configs/conf1
[junit4] 2> 259247 T1467 oasr.RestManager.init Initializing RestManager with initArgs: {}
[junit4] 2> 259247 T1467 oasr.ManagedResourceStorage.load Reading _rest_managed.json using ZooKeeperStorageIO:path=/configs/conf1
[junit4] 2> 259247 T1467 oasr.ManagedResourceStorage$ZooKeeperStorageIO.openInputStream No data found for znode /configs/conf1/_rest_managed.json
[junit4] 2> 259248 T1467 oasr.ManagedResourceStorage.load Loaded null at path _rest_managed.json using ZooKeeperStorageIO:path=/configs/conf1
[junit4] 2> 259248 T1467 oasr.ManagedResource.notifyObserversDuringInit WARN No registered observers for /rest/managed
[junit4] 2> 259248 T1467 oasr.RestManager.init Initializing 0 registered ManagedResources
[junit4] 2> 259249 T1468 oasc.SolrCore.registerSearcher [collection1] Registered new searcher Searcher@388f6f74[collection1] main{StandardDirectoryReader(segments_1:1:nrt)}
[junit4] 2> 259250 T1467 oasc.CoreContainer.registerCore registering core: collection1
[junit4] 2> 259252 T1471 oasc.ZkController.register Register replica - core:collection1 address:https://127.0.0.1:37552 collection:control_collection shard:shard1
[junit4] 2> 259253 T1440 oass.SolrDispatchFilter.init user.dir=/mnt/ssd/jenkins/workspace/Lucene-Solr-4.x-Linux/solr/build/solr-core/test/J0
[junit4] 2> 259253 T1440 oass.SolrDispatchFilter.init SolrDispatchFilter.init() done
[junit4] 2> 259255 T1440 oascc.ConnectionManager.waitForConnected Waiting for client to connect to ZooKeeper
[junit4] 2> 259256 T1471 oascc.SolrZkClient.makePath makePath: /collections/control_collection/leader_elect/shard1/election
[junit4] 2> 259278 T1473 oascc.ConnectionManager.process Watcher org.apache.solr.common.cloud.ConnectionManager@124c66df name:ZooKeeperConnection Watcher:127.0.0.1:60693/solr got event WatchedEvent state:SyncConnected type:None path:null path:null type:None
[junit4] 2> 259279 T1440 oascc.ConnectionManager.waitForConnected Client is connected to ZooKeeper
[junit4] 2> 259298 T1440 oascc.ZkStateReader.createClusterStateWatchersAndUpdate Updating cluster state from ZooKeeper...
[junit4] 2> 259330 T1440 oasc.ChaosMonkey.monkeyLog monkey: init - expire sessions:false cause connection loss:false
[junit4] 2> 259336 T1471 oasc.ShardLeaderElectionContext.runLeaderProcess Running the leader process for shard shard1
[junit4] 2> 259338 T1464 oasc.DistributedQueue$LatchChildWatcher.process LatchChildWatcher fired on path: /overseer/queue state: SyncConnected type NodeChildrenChanged
[junit4] 2> 259339 T1471 oasc.ShardLeaderElectionContext.waitForReplicasToComeUp Enough replicas found to continue.
[junit4] 2> 259341 T1471 oasc.ShardLeaderElectionContext.runLeaderProcess I may be the new leader - try and sync
[junit4] 2> ASYNC NEW_CORE C200 name=collection1 org.apache.solr.core.SolrCore@23c9ed87 url=https://127.0.0.1:37552/collection1 node=127.0.0.1:37552_ C200_STATE=coll:control_collection core:collection1 props:{state=down, base_url=https://127.0.0.1:37552, core=collection1, node_name=127.0.0.1:37552_}
[junit4] 2> 259341 T1471 C200 P37552 oasc.SyncStrategy.sync Sync replicas to https://127.0.0.1:37552/collection1/
[junit4] 2> 259342 T1471 C200 P37552 oasc.SyncStrategy.syncReplicas Sync Success - now sync replicas to me
[junit4] 2> 259342 T1471 C200 P37552 oasc.SyncStrategy.syncToMe https://127.0.0.1:37552/collection1/ has no replicas
[junit4] 2> 259342 T1471 oasc.ShardLeaderElectionContext.runLeaderProcess I am the new leader: https://127.0.0.1:37552/collection1/ shard1
[junit4] 2> 259342 T1471 oascc.SolrZkClient.makePath makePath: /collections/control_collection/leaders/shard1
[junit4] 2> 259343 T1465 oascc.ZkStateReader.updateClusterState Updating cloud state from ZooKeeper...
[junit4] 2> 259349 T1464 oasc.DistributedQueue$LatchChildWatcher.process LatchChildWatcher fired on path: /overseer/queue state: SyncConnected type NodeChildrenChanged
[junit4] 2> 259354 T1464 oasc.DistributedQueue$LatchChildWatcher.process LatchChildWatcher fired on path: /overseer/queue state: SyncConnected type NodeChildrenChanged
[junit4] 2> 259357 T1464 oasc.DistributedQueue$LatchChildWatcher.process LatchChildWatcher fired on path: /overseer/queue state: SyncConnected type NodeChildrenChanged
[junit4] 2> 259459 T1464 oascc.ZkStateReader$2.process A cluster state change: WatchedEvent state:SyncConnected type:NodeDataChanged path:/clusterstate.json, has occurred - updating... (live nodes size: 1)
[junit4] 2> 259459 T1473 oascc.ZkStateReader$2.process A cluster state change: WatchedEvent state:SyncConnected type:NodeDataChanged path:/clusterstate.json, has occurred - updating... (live nodes size: 1)
[junit4] 2> 259505 T1471 oasc.ZkController.register We are https://127.0.0.1:37552/collection1/ and leader is https://127.0.0.1:37552/collection1/
[junit4] 2> 259505 T1471 oasc.ZkController.register No LogReplay needed for core=collection1 baseURL=https://127.0.0.1:37552
[junit4] 2> 259506 T1471 oasc.ZkController.checkRecovery I am the leader, no recovery necessary
[junit4] 2> 259506 T1471 oasc.ZkController.publish publishing core=collection1 state=active collection=control_collection
[junit4] 2> 259506 T1471 oasc.ZkController.publish numShards not found on descriptor - reading it from system property
[junit4] 2> 259507 T1464 oasc.DistributedQueue$LatchChildWatcher.process LatchChildWatcher fired on path: /overseer/queue state: SyncConnected type NodeChildrenChanged
[junit4] 2> 259507 T1464 oasc.DistributedQueue$LatchChildWatcher.process LatchChildWatcher fired on path: /overseer/queue state: SyncConnected type NodeChildrenChanged
[junit4] 2> 259507 T1464 oasc.DistributedQueue$LatchChildWatcher.process LatchChildWatcher fired on path: /overseer/queue state: SyncConnected type NodeChildrenChanged
[junit4] 2> 259513 T1471 oascc.ZkStateReader.updateClusterState Updating cloud state from ZooKeeper...
[junit4] 2> 259515 T1465 oascc.ZkStateReader.updateClusterState Updating cloud state from ZooKeeper...
[junit4] 2> 259515 T1465 oasc.Overseer$ClusterStateUpdater.updateState Update state numShards=1 message={
[junit4] 2> "operation":"state",
[junit4] 2> "state":"active",
[junit4] 2> "base_url":"https://127.0.0.1:37552",
[junit4] 2> "core":"collection1",
[junit4] 2> "roles":null,
[junit4] 2> "node_name":"127.0.0.1:37552_",
[junit4] 2> "shard":"shard1",
[junit4] 2> "collection":"control_collection",
[junit4] 2> "numShards":"1",
[junit4] 2> "core_node_name":"core_node1"}
[junit4] 2> 259517 T1464 oasc.DistributedQueue$LatchChildWatcher.process LatchChildWatcher fired on path: /overseer/queue state: SyncConnected type NodeChildrenChanged
[junit4] 2> 259618 T1464 oascc.ZkStateReader$2.process A cluster state change: WatchedEvent state:SyncConnected type:NodeDataChanged path:/clusterstate.json, has occurred - updating... (live nodes size: 1)
[junit4] 2> 259618 T1473 oascc.ZkStateReader$2.process A cluster state change: WatchedEvent state:SyncConnected type:NodeDataChanged path:/clusterstate.json, has occurred - updating... (live nodes size: 1)
[junit4] 2> 259618 T1440 oasc.AbstractFullDistribZkTestBase.createJettys create jetty 1
[junit4] 2> 259620 T1440 oejs.Server.doStart jetty-8.1.10.v20130312
[junit4] 2> 259622 T1440 oejus.SslContextFactory.doStart Enabled Protocols [SSLv2Hello, SSLv3, TLSv1, TLSv1.1, TLSv1.2] of [SSLv2Hello, SSLv3, TLSv1, TLSv1.1, TLSv1.2]
[junit4] 2> 259623 T1440 oejs.AbstractConnector.doStart Started SslSelectChannelConnector@127.0.0.1:47707
[junit4] 2> 259624 T1440 oass.SolrDispatchFilter.init SolrDispatchFilter.init()
[junit4] 2> 259625 T1440 oasc.SolrResourceLoader.locateSolrHome JNDI not configured for solr (NoInitialContextEx)
[junit4] 2> 259625 T1440 oasc.SolrResourceLoader.locateSolrHome using system property solr.solr.home: ../../../../../../../../../../mnt/ssd/jenkins/workspace/Lucene-Solr-4.x-Linux/solr/build/solr-core/test/J0/./solr.cloud.SyncSliceTest-464EC46D52D3FA02-001/tempDir-003
[junit4] 2> 259625 T1440 oasc.SolrResourceLoader.<init> new SolrResourceLoader for directory: '../../../../../../../../../../mnt/ssd/jenkins/workspace/Lucene-Solr-4.x-Linux/solr/build/solr-core/test/J0/./solr.cloud.SyncSliceTest-464EC46D52D3FA02-001/tempDir-003/'
[junit4] 2> 259635 T1440 oasc.ConfigSolr.fromFile Loading container configuration from /mnt/ssd/jenkins/workspace/Lucene-Solr-4.x-Linux/solr/build/solr-core/test/J0/../../../../../../../../../../mnt/ssd/jenkins/workspace/Lucene-Solr-4.x-Linux/solr/build/solr-core/test/J0/./solr.cloud.SyncSliceTest-464EC46D52D3FA02-001/tempDir-003/solr.xml
[junit4] 2> 259649 T1440 oasc.CoreContainer.<init> New CoreContainer 1461557976
[junit4] 2> 259649 T1440 oasc.CoreContainer.load Loading cores into CoreContainer [instanceDir=../../../../../../../../../../mnt/ssd/jenkins/workspace/Lucene-Solr-4.x-Linux/solr/build/solr-core/test/J0/./solr.cloud.SyncSliceTest-464EC46D52D3FA02-001/tempDir-003/]
[junit4] 2> 259650 T1440 oashc.HttpShardHandlerFactory.getParameter Setting socketTimeout to: 90000
[junit4] 2> 259650 T1440 oashc.HttpShardHandlerFactory.getParameter Setting urlScheme to:
[junit4] 2> 259650 T1440 oashc.HttpShardHandlerFactory.getParameter Setting connTimeout to: 15000
[junit4] 2> 259650 T1440 oashc.HttpShardHandlerFactory.getParameter Setting maxConnectionsPerHost to: 20
[junit4] 2> 259651 T1440 oashc.HttpShardHandlerFactory.getParameter Setting corePoolSize to: 0
[junit4] 2> 259651 T1440 oashc.HttpShardHandlerFactory.getParameter Setting maximumPoolSize to: 2147483647
[junit4] 2> 259651 T1440 oashc.HttpShardHandlerFactory.getParameter Setting maxThreadIdleTime to: 5
[junit4] 2> 259651 T1440 oashc.HttpShardHandlerFactory.getParameter Setting sizeOfQueue to: -1
[junit4] 2> 259651 T1440 oashc.HttpShardHandlerFactory.getParameter Setting fairnessPolicy to: false
[junit4] 2> 259653 T1440 oasl.LogWatcher.createWatcher SLF4J impl is org.slf4j.impl.Log4jLoggerFactory
[junit4] 2> 259653 T1440 oasl.LogWatcher.newRegisteredLogWatcher Registering Log Listener [Log4j (org.slf4j.impl.Log4jLoggerFactory)]
[junit4] 2> 259654 T1440 oasc.CoreContainer.load Host Name: 127.0.0.1
[junit4] 2> 259654 T1440 oasc.ZkContainer.initZooKeeper Zookeeper client=127.0.0.1:60693/solr
[junit4] 2> 259654 T1440 oasc.ZkController.checkChrootPath zkHost includes chroot
[junit4] 2> 259655 T1440 oascc.ConnectionManager.waitForConnected Waiting for client to connect to ZooKeeper
[junit4] 2> 259656 T1484 oascc.ConnectionManager.process Watcher org.apache.solr.common.cloud.ConnectionManager@54e88af8 name:ZooKeeperConnection Watcher:127.0.0.1:60693 got event WatchedEvent state:SyncConnected type:None path:null path:null type:None
[junit4] 2> 259656 T1440 oascc.ConnectionManager.waitForConnected Client is connected to ZooKeeper
[junit4] 2> 259658 T1440 oascc.ConnectionManager.waitForConnected Waiting for client to connect to ZooKeeper
[junit4] 2> 259658 T1486 oascc.ConnectionManager.process Watcher org.apache.solr.common.cloud.ConnectionManager@35fa8bdf name:ZooKeeperConnection Watcher:127.0.0.1:60693/solr got event WatchedEvent state:SyncConnected type:None path:null path:null type:None
[junit4] 2> 259659 T1440 oascc.ConnectionManager.waitForConnected Client is connected to ZooKeeper
[junit4] 2> 259666 T1440 oascc.ZkStateReader.createClusterStateWatchersAndUpdate Updating cluster state from ZooKeeper...
[junit4] 2> 260667 T1440 oasc.ZkController.createEphemeralLiveNode Register node as live in ZooKeeper:/live_nodes/127.0.0.1:47707_
[junit4] 2> 260668 T1440 oascc.SolrZkClient.makePath makePath: /live_nodes/127.0.0.1:47707_
[junit4] 2> 260670 T1473 oascc.ZkStateReader$3.process Updating live nodes... (2)
[junit4] 2> 260670 T1464 oascc.ZkStateReader$3.process Updating live nodes... (2)
[junit4] 2> 260670 T1486 oascc.ZkStateReader$3.process Updating live nodes... (2)
[junit4] 2> 260674 T1487 oasc.ZkController.publish publishing core=collection1 state=down collection=collection1
[junit4] 2> 260675 T1487 oasc.ZkController.publish numShards not found on descriptor - reading it from system property
[junit4] 2> 260675 T1464 oasc.DistributedQueue$LatchChildWatcher.process LatchChildWatcher fired on path: /overseer/queue state: SyncConnected type NodeChildrenChanged
[junit4] 2> 260675 T1487 oasc.ZkController.waitForCoreNodeName look for our core node name
[junit4] 2> 260676 T1464 oasc.DistributedQueue$LatchChildWatcher.process LatchChildWatcher fired on path: /overseer/queue state: SyncConnected type NodeChildrenChanged
[junit4] 2> 260676 T1464 oasc.DistributedQueue$LatchChildWatcher.process LatchChildWatcher fired on path: /overseer/queue state: SyncConnected type NodeChildrenChanged
[junit4] 2> 260677 T1465 oascc.ZkStateReader.updateClusterState Updating cloud state from ZooKeeper...
[junit4] 2> 260677 T1465 oasc.Overseer$ClusterStateUpdater.updateState Update state numShards=1 message={
[junit4] 2> "operation":"state",
[junit4] 2> "state":"down",
[junit4] 2> "base_url":"https://127.0.0.1:47707",
[junit4] 2> "core":"collection1",
[junit4] 2> "roles":null,
[junit4] 2> "node_name":"127.0.0.1:47707_",
[junit4] 2> "shard":null,
[junit4] 2> "collection":"collection1",
[junit4] 2> "numShards":"1",
[junit4] 2> "core_node_name":null}
[junit4] 2> 260677 T1465 oasc.Overseer$ClusterStateUpdater.createCollection Create collection collection1 with shards [shard1]
[junit4] 2> 260677 T1465 oasc.Overseer$ClusterStateUpdater.updateState Assigning new node to shard shard=shard1
[junit4] 2> 260679 T1464 oasc.DistributedQueue$LatchChildWatcher.process LatchChildWatcher fired on path: /overseer/queue state: SyncConnected type NodeChildrenChanged
[junit4] 2> 260781 T1486 oascc.ZkStateReader$2.process A cluster state change: WatchedEvent state:SyncConnected type:NodeDataChanged path:/clusterstate.json, has occurred - updating... (live nodes size: 2)
[junit4] 2> 260781 T1473 oascc.ZkStateReader$2.process A cluster state change: WatchedEvent state:SyncConnected type:NodeDataChanged path:/clusterstate.json, has occurred - updating... (live nodes size: 2)
[junit4] 2> 260781 T1464 oascc.ZkStateReader$2.process A cluster state change: WatchedEvent state:SyncConnected type:NodeDataChanged path:/clusterstate.json, has occurred - updating... (live nodes size: 2)
[junit4] 2> 261676 T1487 oasc.ZkController.waitForShardId waiting to find shard id in clusterstate for collection1
[junit4] 2> 261676 T1487 oasc.ZkController.createCollectionZkNode Check for collection zkNode:collection1
[junit4] 2> 261677 T1487 oasc.ZkController.createCollectionZkNode Collection zkNode exists
[junit4] 2> 261677 T1487 oascc.ZkStateReader.readConfigName Load collection config from:/collections/collection1
[junit4] 2> 261677 T1487 oascc.ZkStateReader.readConfigName path=/collections/collection1 configName=conf1 specified config exists in ZooKeeper
[junit4] 2> 261677 T1487 oasc.SolrResourceLoader.<init> new SolrResourceLoader for directory: '../../../../../../../../../../mnt/ssd/jenkins/workspace/Lucene-Solr-4.x-Linux/solr/build/solr-core/test/J0/./solr.cloud.SyncSliceTest-464EC46D52D3FA02-001/tempDir-003/collection1/'
[junit4] 2> 261678 T1487 oasc.SolrResourceLoader.replaceClassLoader Adding 'file:/mnt/ssd/jenkins/workspace/Lucene-Solr-4.x-Linux/solr/build/solr-core/test/J0/solr.cloud.SyncSliceTest-464EC46D52D3FA02-001/tempDir-003/collection1/lib/.svn/' to classloader
[junit4] 2> 261678 T1487 oasc.SolrResourceLoader.replaceClassLoader Adding 'file:/mnt/ssd/jenkins/workspace/Lucene-Solr-4.x-Linux/solr/build/solr-core/test/J0/solr.cloud.SyncSliceTest-464EC46D52D3FA02-001/tempDir-003/collection1/lib/classes/' to classloader
[junit4] 2> 261678 T1487 oasc.SolrResourceLoader.replaceClassLoader Adding 'file:/mnt/ssd/jenkins/workspace/Lucene-Solr-4.x-Linux/solr/build/solr-core/test/J0/solr.cloud.SyncSliceTest-464EC46D52D3FA02-001/tempDir-003/collection1/lib/README' to classloader
[junit4] 2> 261696 T1487 oasc.SolrConfig.<init> Using Lucene MatchVersion: LUCENE_4_10
[junit4] 2> 261704 T1487 oasc.SolrConfig.<init> Loaded SolrConfig: solrconfig.xml
[junit4] 2> 261705 T1487 oass.IndexSchema.readSchema Reading Solr Schema from schema.xml
[junit4] 2> 261709 T1487 oass.IndexSchema.readSchema [collection1] Schema name=test
[junit4] 2> 261803 T1487 oass.ByteField.init WARN ByteField is deprecated and will be removed in 5.0. You should use TrieIntField instead.
[junit4] 2> 261804 T1487 oass.ShortField.init WARN ShortField is deprecated and will be removed in 5.0. You should use TrieIntField instead.
[junit4] 2> 261804 T1487 oass.OpenExchangeRatesOrgProvider.init Initialized with rates=open-exchange-rates.json, refreshInterval=1440.
[junit4] 2> 261807 T1487 oass.IndexSchema.readSchema default search field in schema is text
[junit4] 2> 261809 T1487 oass.IndexSchema.readSchema unique key field: id
[junit4] 2> 261820 T1487 oass.FileExchangeRateProvider.reload Reloading exchange rates from file currency.xml
[junit4] 2> 261822 T1487 oass.FileExchangeRateProvider.reload Reloading exchange rates from file currency.xml
[junit4] 2> 261825 T1487 oass.OpenExchangeRatesOrgProvider.reload Reloading exchange rates from open-exchange-rates.json
[junit4] 2> 261825 T1487 oass.OpenExchangeRatesOrgProvider$OpenExchangeRates.<init> WARN Unknown key IMPORTANT NOTE
[junit4] 2> 261826 T1487 oass.OpenExchangeRatesOrgProvider$OpenExchangeRates.<init> WARN Expected key, got STRING
[junit4] 2> 261826 T1487 oass.OpenExchangeRatesOrgProvider.reload Reloading exchange rates from open-exchange-rates.json
[junit4] 2> 261826 T1487 oass.OpenExchangeRatesOrgProvider$OpenExchangeRates.<init> WARN Unknown key IMPORTANT NOTE
[junit4] 2> 261827 T1487 oass.OpenExchangeRatesOrgProvider$OpenExchangeRates.<init> WARN Expected key, got STRING
[junit4] 2> 261827 T1487 oasc.CoreContainer.create Creating SolrCore 'collection1' using configuration from collection collection1
[junit4] 2> 261827 T1487 oasc.SolrCore.initDirectoryFactory org.apache.solr.core.MockDirectoryFactory
[junit4] 2> 261827 T1487 oasc.SolrCore.<init> [collection1] Opening new SolrCore at ../../../../../../../../../../mnt/ssd/jenkins/workspace/Lucene-Solr-4.x-Linux/solr/build/solr-core/test/J0/./solr.cloud.SyncSliceTest-464EC46D52D3FA02-001/tempDir-003/collection1/, dataDir=./solr.cloud.SyncSliceTest-464EC46D52D3FA02-001/tempDir-001/jetty1/
[junit4] 2> 261828 T1487 oasc.JmxMonitoredMap.<init> JMX monitoring is enabled. Adding Solr mbeans to JMX Server: com.sun.jmx.mbeanserver.JmxMBeanServer@39b9475d
[junit4] 2> 261828 T1487 oasc.CachingDirectoryFactory.get return new directory for ./solr.cloud.SyncSliceTest-464EC46D52D3FA02-001/tempDir-001/jetty1
[junit4] 2> 261828 T1487 oasc.SolrCore.getNewIndexDir New index directory detected: old=null new=./solr.cloud.SyncSliceTest-464EC46D52D3FA02-001/tempDir-001/jetty1/index/
[junit4] 2> 261829 T1487 oasc.SolrCore.initIndex WARN [collection1] Solr index directory './solr.cloud.SyncSliceTest-464EC46D52D3FA02-001/tempDir-001/jetty1/index' doesn't exist. Creating new index...
[junit4] 2> 261829 T1487 oasc.CachingDirectoryFactory.get return new directory for ./solr.cloud.SyncSliceTest-464EC46D52D3FA02-001/tempDir-001/jetty1/index
[junit4] 2> 261829 T1487 oasu.RandomMergePolicy.<init> RandomMergePolicy wrapping class org.apache.lucene.index.LogDocMergePolicy: [LogDocMergePolicy: minMergeSize=1000, mergeFactor=39, maxMergeSize=9223372036854775807, maxMergeSizeForForcedMerge=9223372036854775807, calibrateSizeByDeletes=true, maxMergeDocs=2147483647, maxCFSSegmentSizeMB=8.796093022207999E12, noCFSRatio=1.0]
[junit4] 2> 261830 T1487 oasc.SolrDeletionPolicy.onCommit SolrDeletionPolicy.onCommit: commits: num=1
[junit4] 2> commit{dir=MockDirectoryWrapper(RAMDirectory@4380d2bd lockFactory=org.apache.lucene.store.SingleInstanceLockFactory@2a0117bb),segFN=segments_1,generation=1}
[junit4] 2> 261830 T1487 oasc.SolrDeletionPolicy.updateCommits newest commit generation = 1
[junit4] 2> 261833 T1487 oasup.UpdateRequestProcessorChain.init creating updateRequestProcessorChain "nodistrib"
[junit4] 2> 261833 T1487 oasup.UpdateRequestProcessorChain.init creating updateRequestProcessorChain "dedupe"
[junit4] 2> 261834 T1487 oasup.UpdateRequestProcessorChain.init inserting DistributedUpdateProcessorFactory into updateRequestProcessorChain "dedupe"
[junit4] 2> 261834 T1487 oasup.UpdateRequestProcessorChain.init creating updateRequestProcessorChain "stored_sig"
[junit4] 2> 261834 T1487 oasup.UpdateRequestProcessorChain.init inserting DistributedUpdateProcessorFactory into updateRequestProcessorChain "stored_sig"
[junit4] 2> 261834 T1487 oasup.UpdateRequestProcessorChain.init creating updateRequestProcessorChain "distrib-dup-test-chain-explicit"
[junit4] 2> 261835 T1487 oasup.UpdateRequestProcessorChain.init creating updateRequestProcessorChain "distrib-dup-test-chain-implicit"
[junit4] 2> 261835 T1487 oasup.UpdateRequestProcessorChain.init inserting DistributedUpdateProcessorFactory into updateRequestProcessorChain "distrib-dup-test-chain-implicit"
[junit4] 2> 261835 T1487 oasc.SolrCore.loadUpdateProcessorChains no updateRequestProcessorChain defined as default, creating implicit default
[junit4] 2> 261836 T1487 oasc.RequestHandlers.initHandlersFromConfig created standard: solr.StandardRequestHandler
[junit4] 2> 261836 T1487 oasc.RequestHandlers.initHandlersFromConfig created /get: solr.RealTimeGetHandler
[junit4] 2> 261836 T1487 oasc.RequestHandlers.initHandlersFromConfig adding lazy requestHandler: solr.ReplicationHandler
[junit4] 2> 261837 T1487 oasc.RequestHandlers.initHandlersFromConfig created /replication: solr.ReplicationHandler
[junit4] 2> 261837 T1487 oasc.RequestHandlers.initHandlersFromConfig created /update: solr.UpdateRequestHandler
[junit4] 2> 261837 T1487 oasc.RequestHandlers.initHandlersFromConfig created /admin/: org.apache.solr.handler.admin.AdminHandlers
[junit4] 2> 261838 T1487 oasc.RequestHandlers.initHandlersFromConfig created /admin/file: solr.admin.ShowFileRequestHandler
[junit4] 2> 261840 T1487 oashl.XMLLoader.init xsltCacheLifetimeSeconds=60
[junit4] 2> 261842 T1487 oasu.CommitTracker.<init> Hard AutoCommit: disabled
[junit4] 2> 261842 T1487 oasu.CommitTracker.<init> Soft AutoCommit: disabled
[junit4] 2> 261842 T1487 oasu.RandomMergePolicy.<init> RandomMergePolicy wrapping class org.apache.lucene.index.TieredMergePolicy: [TieredMergePolicy: maxMergeAtOnce=10, maxMergeAtOnceExplicit=23, maxMergedSegmentMB=89.2470703125, floorSegmentMB=1.1689453125, forceMergeDeletesPctAllowed=11.791453770807557, segmentsPerTier=14.0, maxCFSSegmentSizeMB=8.796093022207999E12, noCFSRatio=1.0
[junit4] 2> 261843 T1487 oasc.SolrDeletionPolicy.onInit SolrDeletionPolicy.onInit: commits: num=1
[junit4] 2> commit{dir=MockDirectoryWrapper(RAMDirectory@4380d2bd lockFactory=org.apache.lucene.store.SingleInstanceLockFactory@2a0117bb),segFN=segments_1,generation=1}
[junit4] 2> 261843 T1487 oasc.SolrDeletionPolicy.updateCommits newest commit generation = 1
[junit4] 2> 261844 T1487 oass.SolrIndexSearcher.<init> Opening Searcher@5829715[collection1] main
[junit4] 2> 261844 T1487 oascc.ZkStateReader.readConfigName Load collection config from:/collections/collection1
[junit4] 2> 261845 T1487 oascc.ZkStateReader.readConfigName path=/collections/collection1 configName=conf1 specified config exists in ZooKeeper
[junit4] 2> 261845 T1487 oasr.ManagedResourceStorage.newStorageIO Setting up ZooKeeper-based storage for the RestManager with znodeBase: /configs/conf1
[junit4] 2> 261845 T1487 oasr.ManagedResourceStorage$ZooKeeperStorageIO.configure Configured ZooKeeperStorageIO with znodeBase: /configs/conf1
[junit4] 2> 261845 T1487 oasr.RestManager.init Initializing RestManager with initArgs: {}
[junit4] 2> 261846 T1487 oasr.ManagedResourceStorage.load Reading _rest_managed.json using ZooKeeperStorageIO:path=/configs/conf1
[junit4] 2> 261846 T1487 oasr.ManagedResourceStorage$ZooKeeperStorageIO.openInputStream No data found for znode /configs/conf1/_rest_managed.json
[junit4] 2> 261846 T1487 oasr.ManagedResourceStorage.load Loaded null at path _rest_managed.json using ZooKeeperStorageIO:path=/configs/conf1
[junit4] 2> 261846 T1487 oasr.ManagedResource.notifyObserversDuringInit WARN No registered observers for /rest/managed
[junit4] 2> 261847 T1487 oasr.RestManager.init Initializing 0 registered ManagedResources
[junit4] 2> 261850 T1488 oasc.SolrCore.registerSearcher [collection1] Registered new searcher Searcher@5829715[collection1] main{StandardDirectoryReader(segments_1:1:nrt)}
[junit4] 2> 261851 T1487 oasc.CoreContainer.registerCore registering core: collection1
[junit4] 2> 261852 T1491 oasc.ZkController.register Register replica - core:collection1 address:https://127.0.0.1:47707 collection:collection1 shard:shard1
[junit4] 2> 261852 T1440 oass.SolrDispatchFilter.init user.dir=/mnt/ssd/jenkins/workspace/Lucene-Solr-4.x-Linux/solr/build/solr-core/test/J0
[junit4] 2> 261853 T1440 oass.SolrDispatchFilter.init SolrDispatchFilter.init() done
[junit4] 2> 261856 T1491 oascc.SolrZkClient.makePath makePath: /collections/collection1/leader_elect/shard1/election
[junit4] 2> 261860 T1491 oasc.ShardLeaderElectionContext.runLeaderProcess Running the leader process for shard shard1
[junit4] 2> 261861 T1464 oasc.DistributedQueue$LatchChildWatcher.process LatchChildWatcher fired on path: /overseer/queue state: SyncConnected type NodeChildrenChanged
[junit4] 2> 261861 T1464 oasc.DistributedQueue$LatchChildWatcher.process LatchChildWatcher fired on path: /overseer/queue state: SyncConnected type NodeChildrenChanged
[junit4] 2> 261862 T1491 oasc.ShardLeaderElectionContext.waitForReplicasToComeUp Enough replicas found to continue.
[junit4] 2> 261862 T1464 oasc.DistributedQueue$LatchChildWatcher.process LatchChildWatcher fired on path: /overseer/queue state: SyncConnected type NodeChildrenChanged
[junit4] 2> 261862 T1491 oasc.ShardLeaderElectionContext.runLeaderProcess I may be the new leader - try and sync
[junit4] 2> ASYNC NEW_CORE C201 name=collection1 org.apache.solr.core.SolrCore@4597acb0 url=https://127.0.0.1:47707/collection1 node=127.0.0.1:47707_ C201_STATE=coll:collection1 core:collection1 props:{state=down, base_url=https://127.0.0.1:47707, core=collection1, node_name=127.0.0.1:47707_}
[junit4] 2> 261862 T1491 C201 P47707 oasc.SyncStrategy.sync Sync replicas to https://127.0.0.1:47707/collection1/
[junit4] 2> 261862 T1491 C201 P47707 oasc.SyncStrategy.syncReplicas Sync Success - now sync replicas to me
[junit4] 2> 261863 T1491 C201 P47707 oasc.SyncStrategy.syncToMe https://127.0.0.1:47707/collection1/ has no replicas
[junit4] 2> 261863 T1491 oasc.ShardLeaderElectionContext.runLeaderProcess I am the new leader: https://127.0.0.1:47707/collection1/ shard1
[junit4] 2> 261863 T1491 oascc.SolrZkClient.makePath makePath: /collections/collection1/leaders/shard1
[junit4] 2> 261863 T1465 oascc.ZkStateReader.updateClusterState Updating cloud state from ZooKeeper...
[junit4] 2> 261865 T1464 oasc.DistributedQueue$LatchChildWatcher.process LatchChildWatcher fired on path: /overseer/queue state: SyncConnected type NodeChildrenChanged
[junit4] 2> 261867 T1464 oasc.DistributedQueue$LatchChildWatcher.process LatchChildWatcher fired on path: /overseer/queue state: SyncConnected type NodeChildrenChanged
[junit4] 2> 261869 T1464 oasc.DistributedQueue$LatchChildWatcher.process LatchChildWatcher fired on path: /overseer/queue state: SyncConnected type NodeChildrenChanged
[junit4] 2> 261970 T1473 oascc.ZkStateReader$2.process A cluster state change: WatchedEvent state:SyncConnected type:NodeDataChanged path:/clusterstate.json, has occurred - updating... (live nodes size: 2)
[junit4] 2> 261971 T1486 oascc.ZkStateReader$2.process A cluster state change: WatchedEvent state:SyncConnected type:NodeDataChanged path:/clusterstate.json, has occurred - updating... (live nodes size: 2)
[junit4] 2> 261970 T1464 oascc.ZkStateReader$2.process A cluster state change: WatchedEvent state:SyncConnected type:NodeDataChanged path:/clusterstate.json, has occurred - updating... (live nodes size: 2)
[junit4] 2> 262019 T1491 oasc.ZkController.register We are https://127.0.0.1:47707/collection1/ and leader is https://127.0.0.1:47707/collection1/
[junit4] 2> 262019 T1491 oasc.ZkController.register No LogReplay needed for core=collection1 baseURL=https://127.0.0.1:47707
[junit4] 2> 262019 T1491 oasc.ZkController.checkRecovery I am the leader, no recovery necessary
[junit4] 2> 262020 T1491 oasc.ZkController.publish publishing core=collection1 state=active collection=collection1
[junit4] 2> 262020 T1491 oasc.ZkController.publish numShards not found on descriptor - reading it from system property
[junit4] 2> 262022 T1464 oasc.DistributedQueue$LatchChildWatcher.process LatchChildWatcher fired on path: /overseer/queue state: SyncConnected type NodeChildrenChanged
[junit4] 2> 262022 T1464 oasc.DistributedQueue$LatchChildWatcher.process LatchChildWatcher fired on path: /overseer/queue state: SyncConnected type NodeChildrenChanged
[junit4] 2> 262022 T1464 oasc.DistributedQueue$LatchChildWatcher.process LatchChildWatcher fired on path: /overseer/queue state: SyncConnected type NodeChildrenChanged
[junit4] 2> 262022 T1491 oascc.ZkStateReader.updateClusterState Updating cloud state from ZooKeeper...
[junit4] 2> 262023 T1465 oascc.ZkStateReader.updateClusterState Updating cloud state from ZooKeeper...
[junit4] 2> 262023 T1465 oasc.Overseer$ClusterStateUpdater.updateState Update state numShards=1 message={
[junit4] 2> "operation":"state",
[junit4] 2> "state":"active",
[junit4] 2> "base_url":"https://127.0.0.1:47707",
[junit4] 2> "core":"collection1",
[junit4] 2> "roles":null,
[junit4] 2> "node_name":"127.0.0.1:47707_",
[junit4] 2> "shard":"shard1",
[junit4] 2> "collection":"collection1",
[junit4] 2> "numShards":"1",
[junit4] 2> "core_node_name":"core_node1"}
[junit4] 2> 262025 T1464 oasc.DistributedQueue$LatchChildWatcher.process LatchChildWatcher fired on path: /overseer/queue state: SyncConnected type NodeChildrenChanged
[junit4] 2> 262116 T1440 oasc.AbstractFullDistribZkTestBase.createJettys create jetty 2
[junit4] 2> 262117 T1440 oejs.Server.doStart jetty-8.1.10.v20130312
[junit4] 2> 262119 T1440 oejus.SslContextFactory.doStart Enabled Protocols [SSLv2Hello, SSLv3, TLSv1, TLSv1.1, TLSv1.2] of [SSLv2Hello, SSLv3, TLSv1, TLSv1.1, TLSv1.2]
[junit4] 2> 262120 T1440 oejs.AbstractConnector.doStart Started SslSelectChannelConnector@127.0.0.1:37330
[junit4] 2> 262122 T1440 oass.SolrDispatchFilter.init SolrDispatchFilter.init()
[junit4] 2> 262122 T1440 oasc.SolrResourceLoader.locateSolrHome JNDI not configured for solr (NoInitialContextEx)
[junit4] 2> 262123 T1440 oasc.SolrResourceLoader.locateSolrHome using system property solr.solr.home: ./solr.cloud.SyncSliceTest-464EC46D52D3FA02-001/tempDir-004
[junit4] 2> 262123 T1440 oasc.SolrResourceLoader.<init> new SolrResourceLoader for directory: './solr.cloud.SyncSliceTest-464EC46D52D3FA02-001/tempDir-004/'
[junit4] 2> 262126 T1464 oascc.ZkStateReader$2.process A cluster state change: WatchedEvent state:SyncConnected type:NodeDataChanged path:/clusterstate.json, has occurred - updating... (live nodes size: 2)
[junit4] 2> 262126 T1473 oascc.ZkStateReader$2.process A cluster state change: WatchedEvent state:SyncConnected type:NodeDataChanged path:/clusterstate.json, has occurred - updating... (live nodes size: 2)
[junit4] 2> 262126 T1486 oascc.ZkStateReader$2.process A cluster state change: WatchedEvent state:SyncConnected type:NodeDataChanged path:/clusterstate.json, has occurred - updating... (live nodes size: 2)
[junit4] 2> 262133 T1440 oasc.ConfigSolr.fromFile Loading container configuration from /mnt/ssd/jenkins/workspace/Lucene-Solr-4.x-Linux/solr/build/solr-core/test/J0/./solr.cloud.SyncSliceTest-464EC46D52D3FA02-001/tempDir-004/solr.xml
[junit4] 2> 262150 T1440 oasc.CoreContainer.<init> New CoreContainer 1516786734
[junit4] 2> 262150 T1440 oasc.CoreContainer.load Loading cores into CoreContainer [instanceDir=./solr.cloud.SyncSliceTest-464EC46D52D3FA02-001/tempDir-004/]
[junit4] 2> 262151 T1440 oashc.HttpShardHandlerFactory.getParameter Setting socketTimeout to: 90000
[junit4] 2> 262151 T1440 oashc.HttpShardHandlerFactory.getParameter Setting urlScheme to:
[junit4] 2> 262152 T1440 oashc.HttpShardHandlerFactory.getParameter Setting connTimeout to: 15000
[junit4] 2> 262152 T1440 oashc.HttpShardHandlerFactory.getParameter Setting maxConnectionsPerHost to: 20
[junit4] 2> 262152 T1440 oashc.HttpShardHandlerFactory.getParameter Setting corePoolSize to: 0
[junit4] 2> 262152 T1440 oashc.HttpShardHandlerFactory.getParameter Setting maximumPoolSize to: 2147483647
[junit4] 2> 262153 T1440 oashc.HttpShardHandlerFactory.getParameter Setting maxThreadIdleTime to: 5
[junit4] 2> 262153 T1440 oashc.HttpShardHandlerFactory.getParameter Setting sizeOfQueue to: -1
[junit4] 2> 262153 T1440 oashc.HttpShardHandlerFactory.getParameter Setting fairnessPolicy to: false
[junit4] 2> 262156 T1440 oasl.LogWatcher.createWatcher SLF4J impl is org.slf4j.impl.Log4jLoggerFactory
[junit4] 2> 262156 T1440 oasl.LogWatcher.newRegisteredLogWatcher Registering Log Listener [Log4j (org.slf4j.impl.Log4jLoggerFactory)]
[junit4] 2> 262157 T1440 oasc.CoreContainer.load Host Name: 127.0.0.1
[junit4] 2> 262157 T1440 oasc.ZkContainer.initZooKeeper Zookeeper client=127.0.0.1:60693/solr
[junit4] 2> 262157 T1440 oasc.ZkController.checkChrootPath zkHost includes chroot
[junit4] 2> 262158 T1440 oascc.ConnectionManager.waitForConnected Waiting for client to connect to ZooKeeper
[junit4] 2> 262159 T1502 oascc.ConnectionManager.process Watcher org.apache.solr.common.cloud.ConnectionManager@c1eb19 name:ZooKeeperConnection Watcher:127.0.0.1:60693 got event WatchedEvent state:SyncConnected type:None path:null path:null type:None
[junit4] 2> 262160 T1440 oascc.ConnectionManager.waitForConnected Client is connected to ZooKeeper
[junit4] 2> 262161 T1440 oascc.ConnectionManager.waitForConnected Waiting for client to connect to ZooKeeper
[junit4] 2> 262162 T1504 oascc.ConnectionManager.process Watcher org.apache.solr.common.cloud.ConnectionManager@50b060d7 name:ZooKeeperConnection Watcher:127.0.0.1:60693/solr got event WatchedEvent state:SyncConnected type:None path:null path:null type:None
[junit4] 2> 262162 T1440 oascc.ConnectionManager.waitForConnected Client is connected to ZooKeeper
[junit4] 2> 262166 T1440 oascc.ZkStateReader.createClusterStateWatchersAndUpdate Updating cluster state from ZooKeeper...
[junit4] 2> 263168 T1440 oasc.ZkController.createEphemeralLiveNode Register node as live in ZooKeeper:/live_nodes/127.0.0.1:37330_
[junit4] 2> 263169 T1440 oascc.SolrZkClient.makePath makePath: /live_nodes/127.0.0.1:37330_
[junit4] 2> 263171 T1464 oascc.ZkStateReader$3.process Updating live nodes... (3)
[junit4] 2> 263171 T1473 oascc.ZkStateReader$3.process Updating live nodes... (3)
[junit4] 2> 263172 T1486 oascc.ZkStateReader$3.process Updating live nodes... (3)
[junit4] 2> 263172 T1504 oascc.ZkStateReader$3.process Updating live nodes... (3)
[junit4] 2> 263176 T1505 oasc.ZkController.publish publishing core=collection1 state=down collection=collection1
[junit4] 2> 263176 T1505 oasc.ZkController.publish numShards not found on descriptor - reading it from system property
[junit4] 2> 263177 T1464 oasc.DistributedQueue$LatchChildWatcher.process LatchChildWatcher fired on path: /overseer/queue state: SyncConnected type NodeChildrenChanged
[junit4] 2> 263177 T1464 oasc.DistributedQueue$LatchChildWatcher.process LatchChildWatcher fired on path: /overseer/queue state: SyncConnected type NodeChildrenChanged
[junit4] 2> 263177 T1464 oasc.DistributedQueue$LatchChildWatcher.process LatchChildWatcher fired on path: /overseer/queue state: SyncConnected type NodeChildrenChanged
[junit4] 2> 263177 T1505 oasc.ZkController.waitForCoreNodeName look for our core node name
[junit4] 2> 263178 T1465 oascc.ZkStateReader.updateClusterState Updating cloud state from ZooKeeper...
[junit4] 2> 263179 T1465 oasc.Overseer$ClusterStateUpdater.updateState Update state numShards=1 message={
[junit4] 2> "operation":"state",
[junit4] 2> "state":"down",
[junit4] 2> "base_url":"https://127.0.0.1:37330",
[junit4] 2> "core":"collection1",
[junit4] 2> "roles":null,
[junit4] 2> "node_name":"127.0.0.1:37330_",
[junit4] 2> "shard":null,
[junit4] 2> "collection":"collection1",
[junit4] 2> "numShards":"1",
[junit4] 2> "core_node_name":null}
[junit4] 2> 263180 T1465 oasc.Overseer$ClusterStateUpdater.updateState Collection already exists with numShards=1
[junit4] 2> 263180 T1465 oasc.Overseer$ClusterStateUpdater.updateState Assigning new node to shard shard=shard1
[junit4] 2> 263181 T1464 oasc.DistributedQueue$LatchChildWatcher.process LatchChildWatcher fired on path: /overseer/queue state: SyncConnected type NodeChildrenChanged
[junit4] 2> 263283 T1504 oascc.ZkStateReader$2.process A cluster state change: WatchedEvent state:SyncConnected type:NodeDataChanged path:/clusterstate.json, has occurred - updating... (live nodes size: 3)
[junit4] 2> 263283 T1486 oascc.ZkStateReader$2.process A cluster state change: WatchedEvent state:SyncConnected type:NodeDataChanged path:/clusterstate.json, has occurred - updating... (live nodes size: 3)
[junit4] 2> 263283 T1473 oascc.ZkStateReader$2.process A cluster state change: WatchedEvent state:SyncConnected type:NodeDataChanged path:/clusterstate.json, has occurred - updating... (live nodes size: 3)
[junit4] 2> 263283 T1464 oascc.ZkStateReader$2.process A cluster state change: WatchedEvent state:SyncConnected type:NodeDataChanged path:/clusterstate.json, has occurred - updating... (live nodes size: 3)
[junit4] 2> 264177 T1505 oasc.ZkController.waitForShardId waiting to find shard id in clusterstate for collection1
[junit4] 2> 264178 T1505 oasc.ZkController.createCollectionZkNode Check for collection zkNode:collection1
[junit4] 2> 264178 T1505 oasc.ZkController.createCollectionZkNode Collection zkNode exists
[junit4] 2> 264178 T1505 oascc.ZkStateReader.readConfigName Load collection config from:/collections/collection1
[junit4] 2> 264179 T1505 oascc.ZkStateReader.readConfigName path=/collections/collection1 configName=conf1 specified config exists in ZooKeeper
[junit4] 2> 264179 T1505 oasc.SolrResourceLoader.<init> new SolrResourceLoader for directory: './solr.cloud.SyncSliceTest-464EC46D52D3FA02-001/tempDir-004/collection1/'
[junit4] 2> 264180 T1505 oasc.SolrResourceLoader.replaceClassLoader Adding 'file:/mnt/ssd/jenkins/workspace/Lucene-Solr-4.x-Linux/solr/build/solr-core/test/J0/solr.cloud.SyncSliceTest-464EC46D52D3FA02-001/tempDir-004/collection1/lib/.svn/' to classloader
[junit4] 2> 264180 T1505 oasc.SolrResourceLoader.replaceClassLoader Adding 'file:/mnt/ssd/jenkins/workspace/Lucene-Solr-4.x-Linux/solr/build/solr-core/test/J0/solr.cloud.SyncSliceTest-464EC46D52D3FA02-001/tempDir-004/collection1/lib/classes/' to classloader
[junit4] 2> 264180 T1505 oasc.SolrResourceLoader.replaceClassLoader Adding 'file:/mnt/ssd/jenkins/workspace/Lucene-Solr-4.x-Linux/solr/build/solr-core/test/J0/solr.cloud.SyncSliceTest-464EC46D52D3FA02-001/tempDir-004/collection1/lib/README' to classloader
[junit4] 2> 264197 T1505 oasc.SolrConfig.<init> Using Lucene MatchVersion: LUCENE_4_10
[junit4] 2> 264206 T1505 oasc.SolrConfig.<init> Loaded SolrConfig: solrconfig.xml
[junit4] 2> 264207 T1505 oass.IndexSchema.readSchema Reading Solr Schema from schema.xml
[junit4] 2> 264211 T1505 oass.IndexSchema.readSchema [collection1] Schema name=test
[junit4] 2> 264305 T1505 oass.ByteField.init WARN ByteField is deprecated and will be removed in 5.0. You should use TrieIntField instead.
[junit4] 2> 264305 T1505 oass.ShortField.init WARN ShortField is deprecated and will be removed in 5.0. You should use TrieIntField instead.
[junit4] 2> 264306 T1505 oass.OpenExchangeRatesOrgProvider.init Initialized with rates=open-exchange-rates.json, refreshInterval=1440.
[junit4] 2> 264309 T1505 oass.IndexSchema.readSchema default search field in schema is text
[junit4] 2> 264310 T1505 oass.IndexSchema.readSchema unique key field: id
[junit4] 2> 264316 T1505 oass.FileExchangeRateProvider.reload Reloading exchange rates from file currency.xml
[junit4] 2> 264318 T1505 oass.FileExchangeRateProvider.reload Reloading exchange rates from file currency.xml
[junit4] 2> 264321 T1505 oass.OpenExchangeRatesOrgProvider.reload Reloading exchange rates from open-exchange-rates.json
[junit4] 2> 264322 T1505 oass.OpenExchangeRatesOrgProvider$OpenExchangeRates.<init> WARN Unknown key IMPORTANT NOTE
[junit4] 2> 264322 T1505 oass.OpenExchangeRatesOrgProvider$OpenExchangeRates.<init> WARN Expected key, got STRING
[junit4] 2> 264322 T1505 oass.OpenExchangeRatesOrgProvider.reload Reloading exchange rates from open-exchange-rates.json
[junit4] 2> 264323 T1505 oass.OpenExchangeRatesOrgProvider$OpenExchangeRates.<init> WARN Unknown key IMPORTANT NOTE
[junit4] 2> 264323 T1505 oass.OpenExchangeRatesOrgProvider$OpenExchangeRates.<init> WARN Expected key, got STRING
[junit4] 2> 264324 T1505 oasc.CoreContainer.create Creating SolrCore 'collection1' using configuration from collection collection1
[junit4] 2> 264324 T1505 oasc.SolrCore.initDirectoryFactory org.apache.solr.core.MockDirectoryFactory
[junit4] 2> 264324 T1505 oasc.SolrCore.<init> [collection1] Opening new SolrCore at ./solr.cloud.SyncSliceTest-464EC46D52D3FA02-001/tempDir-004/collection1/, dataDir=./solr.cloud.SyncSliceTest-464EC46D52D3FA02-001/tempDir-001/jetty2/
[junit4] 2> 264324 T1505 oasc.JmxMonitoredMap.<init> JMX monitoring is enabled. Adding Solr mbeans to JMX Server: com.sun.jmx.mbeanserver.JmxMBeanServer@39b9475d
[junit4] 2> 264325 T1505 oasc.CachingDirectoryFactory.get return new directory for ./solr.cloud.SyncSliceTest-464EC46D52D3FA02-001/tempDir-001/jetty2
[junit4] 2> 264325 T1505 oasc.SolrCore.getNewIndexDir New index directory detected: old=null new=./solr.cloud.SyncSliceTest-464EC46D52D3FA02-001/tempDir-001/jetty2/index/
[junit4] 2> 264326 T1505 oasc.SolrCore.initIndex WARN [collection1] Solr index directory './solr.cloud.SyncSliceTest-464EC46D52D3FA02-001/tempDir-001/jetty2/index' doesn't exist. Creating new index...
[junit4] 2> 264326 T1505 oasc.CachingDirectoryFactory.get return new directory for ./solr.cloud.SyncSliceTest-464EC46D52D3FA02-001/tempDir-001/jetty2/index
[junit4] 2> 264326 T1505 oasu.RandomMergePolicy.<init> RandomMergePolicy wrapping class org.apache.lucene.index.LogDocMergePolicy: [LogDocMergePolicy: minMergeSize=1000, mergeFactor=39, maxMergeSize=9223372036854775807, maxMergeSizeForForcedMerge=9223372036854775807, calibrateSizeByDeletes=true, maxMergeDocs=2147483647, maxCFSSegmentSizeMB=8.796093022207999E12, noCFSRatio=1.0]
[junit4] 2> 264327 T1505 oasc.SolrDeletionPolicy.onCommit SolrDeletionPolicy.onCommit: commits: num=1
[junit4] 2> commit{dir=MockDirectoryWrapper(RAMDirectory@2e24a59a lockFactory=org.apache.lucene.store.SingleInstanceLockFactory@5987ed2a),segFN=segments_1,generation=1}
[junit4] 2> 264327 T1505 oasc.SolrDeletionPolicy.updateCommits newest commit generation = 1
[junit4] 2> 264330 T1505 oasup.UpdateRequestProcessorChain.init creating updateRequestProcessorChain "nodistrib"
[junit4] 2> 264331 T1505 oasup.UpdateRequestProcessorChain.init creating updateRequestProcessorChain "dedupe"
[junit4] 2> 264331 T1505 oasup.UpdateRequestProcessorChain.init inserting DistributedUpdateProcessorFactory into updateRequestProcessorChain "dedupe"
[junit4] 2> 264331 T1505 oasup.UpdateRequestProcessorChain.init creating updateRequestProcessorChain "stored_sig"
[junit4] 2> 264331 T1505 oasup.UpdateRequestProcessorChain.init inserting DistributedUpdateProcessorFactory into updateRequestProcessorChain "stored_sig"
[junit4] 2> 264332 T1505 oasup.UpdateRequestProcessorChain.init creating updateRequestProcessorChain "distrib-dup-test-chain-explicit"
[junit4] 2> 264332 T1505 oasup.UpdateRequestProcessorChain.init creating updateRequestProcessorChain "distrib-dup-test-chain-implicit"
[junit4] 2> 264332 T1505 oasup.UpdateRequestProcessorChain.init inserting DistributedUpdateProcessorFactory into updateRequestProcessorChain "distrib-dup-test-chain-implicit"
[junit4] 2> 264333 T1505 oasc.SolrCore.loadUpdateProcessorChains no updateRequestProcessorChain defined as default, creating implicit default
[junit4] 2> 264333 T1505 oasc.RequestHandlers.initHandlersFromConfig created standard: solr.StandardRequestHandler
[junit4] 2> 264333 T1505 oasc.RequestHandlers.initHandlersFromConfig created /get: solr.RealTimeGetHandler
[junit4] 2> 264334 T1505 oasc.RequestHandlers.initHandlersFromConfig adding lazy requestHandler: solr.ReplicationHandler
[junit4] 2> 264334 T1505 oasc.RequestHandlers.initHandlersFromConfig created /replication: solr.ReplicationHandler
[junit4] 2> 264334 T1505 oasc.RequestHandlers.initHandlersFromConfig created /update: solr.UpdateRequestHandler
[junit4] 2> 264335 T1505 oasc.RequestHandlers.initHandlersFromConfig created /admin/: org.apache.solr.handler.admin.AdminHandlers
[junit4] 2> 264335 T1505 oasc.RequestHandlers.initHandlersFromConfig created /admin/file: solr.admin.ShowFileRequestHandler
[junit4] 2> 264337 T1505 oashl.XMLLoader.init xsltCacheLifetimeSeconds=60
[junit4] 2> 264339 T1505 oasu.CommitTracker.<init> Hard AutoCommit: disabled
[junit4] 2> 264339 T1505 oasu.CommitTracker.<init> Soft AutoCommit: disabled
[junit4] 2> 264340 T1505 oasu.RandomMergePolicy.<init> RandomMergePolicy wrapping class org.apache.lucene.index.TieredMergePolicy: [TieredMergePolicy: maxMergeAtOnce=10, maxMergeAtOnceExplicit=23, maxMergedSegmentMB=89.2470703125, floorSegmentMB=1.1689453125, forceMergeDeletesPctAllowed=11.791453770807557, segmentsPerTier=14.0, maxCFSSegmentSizeMB=8.796093022207999E12, noCFSRatio=1.0
[junit4] 2> 264340 T1505 oasc.SolrDeletionPolicy.onInit SolrDeletionPolicy.onInit: commits: num=1
[junit4] 2> commit{dir=MockDirectoryWrapper(RAMDirectory@2e24a59a lockFactory=org.apache.lucene.store.SingleInstanceLockFactory@5987ed2a),segFN=segments_1,generation=1}
[junit4] 2> 264340 T1505 oasc.SolrDeletionPolicy.updateCommits newest commit generation = 1
[junit4] 2> 264341 T1505 oass.SolrIndexSearcher.<init> Opening Searcher@7e6f0a99[collection1] main
[junit4] 2> 264341 T1505 oascc.ZkStateReader.readConfigName Load collection config from:/collections/collection1
[junit4] 2> 264341 T1505 oascc.ZkStateReader.readConfigName path=/collections/collection1 configName=conf1 specified config exists in ZooKeeper
[junit4] 2> 264342 T1505 oasr.ManagedResourceStorage.newStorageIO Setting up ZooKeeper-based storage for the RestManager with znodeBase: /configs/conf1
[junit4] 2> 264342 T1505 oasr.ManagedResourceStorage$ZooKeeperStorageIO.configure Configured ZooKeeperStorageIO with znodeBase: /configs/conf1
[junit4] 2> 264342 T1505 oasr.RestManager.init Initializing RestManager with initArgs: {}
[junit4] 2> 264342 T1505 oasr.ManagedResourceStorage.load Reading _rest_managed.json using ZooKeeperStorageIO:path=/configs/conf1
[junit4] 2> 264343 T1505 oasr.ManagedResourceStorage$ZooKeeperStorageIO.openInputStream No data found for znode /configs/conf1/_rest_managed.json
[junit4] 2> 264343 T1505 oasr.ManagedResourceStorage.load Loaded null at path _rest_managed.json using ZooKeeperStorageIO:path=/configs/conf1
[junit4] 2> 264343 T1505 oasr.ManagedResource.notifyObserversDuringInit WARN No registered observers for /rest/managed
[junit4] 2> 264343 T1505 oasr.RestManager.init Initializing 0 registered ManagedResources
[junit4] 2> 264346 T1506 oasc.SolrCore.registerSearcher [collection1] Registered new searcher Searcher@7e6f0a99[collection1] main{StandardDirectoryReader(segments_1:1:nrt)}
[junit4] 2> 264347 T1505 oasc.CoreContainer.registerCore registering core: collection1
[junit4] 2> 264348 T1509 oasc.ZkController.register Register replica - core:collection1 address:https://127.0.0.1:37330 collection:collection1 shard:shard1
[junit4] 2> 264348 T1440 oass.SolrDispatchFilter.init user.dir=/mnt/ssd/jenkins/workspace/Lucene-Solr-4.x-Linux/solr/build/solr-core/test/J0
[junit4] 2> 264348 T1440 oass.SolrDispatchFilter.init SolrDispatchFilter.init() done
[junit4] 2> 264351 T1509 oasc.ZkController.register We are https://127.0.0.1:37330/collection1/ and leader is https://127.0.0.1:47707/collection1/
[junit4] 2> 264351 T1509 oasc.ZkController.register No LogReplay needed for core=collection1 baseURL=https://127.0.0.1:37330
[junit4] 2> 264351 T1509 oasc.ZkController.checkRecovery Core needs to recover:collection1
[junit4] 2> 264352 T1509 oasu.DefaultSolrCoreState.doRecovery Running recovery - first canceling any ongoing recovery
[junit4] 2> ASYNC NEW_CORE C202 name=collection1 org.apache.solr.core.SolrCore@32d6b49f url=https://127.0.0.1:37330/collection1 node=127.0.0.1:37330_ C202_STATE=coll:collection1 core:collection1 props:{state=down, base_url=https://127.0.0.1:37330, core=collection1, node_name=127.0.0.1:37330_}
[junit4] 2> 264352 T1510 C202 P37330 oasc.RecoveryStrategy.run Starting recovery process. core=collection1 recoveringAfterStartup=true
[junit4] 2> 264352 T1509 oascc.ZkStateReader.updateClusterState Updating cloud state from ZooKeeper...
[junit4] 2> 264353 T1510 C202 P37330 oasc.RecoveryStrategy.doRecovery ###### startupVersions=[]
[junit4] 2> 264353 T1510 C202 P37330 oasc.RecoveryStrategy.doRecovery Publishing state of core collection1 as recovering, leader is https://127.0.0.1:47707/collection1/ and I am https://127.0.0.1:37330/collection1/
[junit4] 2> 264353 T1510 C202 P37330 oasc.ZkController.publish publishing core=collection1 state=recovering collection=collection1
[junit4] 2> 264353 T1510 C202 P37330 oasc.ZkController.publish numShards not found on descriptor - reading it from system property
[junit4] 2> 264354 T1464 oasc.DistributedQueue$LatchChildWatcher.process LatchChildWatcher fired on path: /overseer/queue state: SyncConnected type NodeChildrenChanged
[junit4] 2> 264355 T1464 oasc.DistributedQueue$LatchChildWatcher.process LatchChildWatcher fired on path: /overseer/queue state: SyncConnected type NodeChildrenChanged
[junit4] 2> 264355 T1464 oasc.DistributedQueue$LatchChildWatcher.process LatchChildWatcher fired on path: /overseer/queue state: SyncConnected type NodeChildrenChanged
[junit4] 2> 264356 T1465 oascc.ZkStateReader.updateClusterState Updating cloud state from ZooKeeper...
[junit4] 2> 264360 T1465 oasc.Overseer$ClusterStateUpdater.updateState Update state numShards=1 message={
[junit4] 2> "operation":"state",
[junit4] 2> "state":"recovering",
[junit4] 2> "base_url":"https://127.0.0.1:37330",
[junit4] 2> "core":"collection1",
[junit4] 2> "roles":null,
[junit4] 2> "node_name":"127.0.0.1:37330_",
[junit4] 2> "shard":"shard1",
[junit4] 2> "collection":"collection1",
[junit4] 2> "numShards":"1",
[junit4] 2> "core_node_name":"core_node2"}
[junit4] 2> 264360 T1510 C202 P37330 oasc.RecoveryStrategy.sendPrepRecoveryCmd Sending prep recovery command to https://127.0.0.1:47707; WaitForState: action=PREPRECOVERY&core=collection1&nodeName=127.0.0.1%3A37330_&coreNodeName=core_node2&state=recovering&checkLive=true&onlyIfLeader=true&onlyIfLeaderActive=true
[junit4] 2> 264361 T1464 oasc.DistributedQueue$LatchChildWatcher.process LatchChildWatcher fired on path: /overseer/queue state: SyncConnected type NodeChildrenChanged
[junit4] 2> 264437 T1480 oasha.CoreAdminHandler.handleWaitForStateAction Going to wait for coreNodeName: core_node2, state: recovering, checkLive: true, onlyIfLeader: true, onlyIfLeaderActive: true
[junit4] 2> 264438 T1480 oascc.ZkStateReader.updateClusterState Updating cloud state from ZooKeeper...
[junit4] 2> 264439 T1480 oasha.CoreAdminHandler.handleWaitForStateAction Will wait a max of 183 seconds to see collection1 (shard1 of collection1) have state: recovering
[junit4] 2> 264439 T1480 oasha.CoreAdminHandler.handleWaitForStateAction In WaitForState(recovering): collection=collection1, shard=shard1, thisCore=collection1, leaderDoesNotNeedRecovery=false, isLeader? true, live=true, checkLive=true, currentState=down, localState=active, nodeName=127.0.0.1:37330_, coreNodeName=core_node2, onlyIfActiveCheckResult=false, nodeProps: core_node2:{"state":"down","base_url":"https://127.0.0.1:37330","core":"collection1","node_name":"127.0.0.1:37330_"}
[junit4] 2> 264464 T1504 oascc.ZkStateReader$2.process A cluster state change: WatchedEvent state:SyncConnected type:NodeDataChanged path:/clusterstate.json, has occurred - updating... (live nodes size: 3)
[junit4] 2> 264465 T1486 oascc.ZkStateReader$2.process A cluster state change: WatchedEvent state:SyncConnected type:NodeDataChanged path:/clusterstate.json, has occurred - updating... (live nodes size: 3)
[junit4] 2> 264464 T1464 oascc.ZkStateReader$2.process A cluster state change: WatchedEvent state:SyncConnected type:NodeDataChanged path:/clusterstate.json, has occurred - updating... (live nodes size: 3)
[junit4] 2> 264464 T1473 oascc.ZkStateReader$2.process A cluster state change: WatchedEvent state:SyncConnected type:NodeDataChanged path:/clusterstate.json, has occurred - updating... (live nodes size: 3)
[junit4] 2> 264607 T1440 oasc.AbstractFullDistribZkTestBase.createJettys create jetty 3
[junit4] 2> 264608 T1440 oejs.Server.doStart jetty-8.1.10.v20130312
[junit4] 2> 264611 T1440 oejus.SslContextFactory.doStart Enabled Protocols [SSLv2Hello, SSLv3, TLSv1, TLSv1.1, TLSv1.2] of [SSLv2Hello, SSLv3, TLSv1, TLSv1.1, TLSv1.2]
[junit4] 2> 264616 T1440 oejs.AbstractConnector.doStart Started SslSelectChannelConnector@127.0.0.1:40538
[junit4] 2> 264618 T1440 oass.SolrDispatchFilter.init SolrDispatchFilter.init()
[junit4] 2> 264619 T1440 oasc.SolrResourceLoader.locateSolrHome JNDI not configured for solr (NoInitialContextEx)
[junit4] 2> 264619 T1440 oasc.SolrResourceLoader.locateSolrHome using system property solr.solr.home: ./solr.cloud.SyncSliceTest-464EC46D52D3FA02-001/tempDir-005
[junit4] 2> 264619 T1440 oasc.SolrResourceLoader.<init> new SolrResourceLoader for directory: './solr.cloud.SyncSliceTest-464EC46D52D3FA02-001/tempDir-005/'
[junit4] 2> 264641 T1440 oasc.ConfigSolr.fromFile Loading container configuration from /mnt/ssd/jenkins/workspace/Lucene-Solr-4.x-Linux/solr/build/solr-core/test/J0/./solr.cloud.SyncSliceTest-464EC46D52D3FA02-001/tempDir-005/solr.xml
[junit4] 2> 264659 T1440 oasc.CoreContainer.<init> New CoreContainer 143431393
[junit4] 2> 264660 T1440 oasc.CoreContainer.load Loading cores into CoreContainer [instanceDir=./solr.cloud.SyncSliceTest-464EC46D52D3FA02-001/tempDir-005/]
[junit4] 2> 264660 T1440 oashc.HttpShardHandlerFactory.getParameter Setting socketTimeout to: 90000
[junit4] 2> 264660 T1440 oashc.HttpShardHandlerFactory.getPar
[...truncated too long message...]
onContext.java:294)
[junit4] 2> at org.apache.solr.cloud.LeaderElector.runIamLeaderProcess(LeaderElector.java:163)
[junit4] 2> at org.apache.solr.cloud.LeaderElector.checkIfIamLeader(LeaderElector.java:125)
[junit4] 2> at org.apache.solr.cloud.LeaderElector.access$200(LeaderElector.java:55)
[junit4] 2> at org.apache.solr.cloud.LeaderElector$ElectionWatcher.process(LeaderElector.java:357)
[junit4] 2> at org.apache.zookeeper.ClientCnxn$EventThread.processEvent(ClientCnxn.java:522)
[junit4] 2> at org.apache.zookeeper.ClientCnxn$EventThread.run(ClientCnxn.java:498)
[junit4] 2> Caused by: org.apache.solr.common.SolrException: org.apache.zookeeper.KeeperException$SessionExpiredException: KeeperErrorCode = Session expired for /collections
[junit4] 2> at org.apache.solr.common.util.RetryUtil.retryOnThrowable(RetryUtil.java:40)
[junit4] 2> at org.apache.solr.cloud.ShardLeaderElectionContextBase.runLeaderProcess(ElectionContext.java:126)
[junit4] 2> ... 7 more
[junit4] 2> Caused by: org.apache.zookeeper.KeeperException$SessionExpiredException: KeeperErrorCode = Session expired for /collections
[junit4] 2> at org.apache.zookeeper.KeeperException.create(KeeperException.java:127)
[junit4] 2> at org.apache.zookeeper.KeeperException.create(KeeperException.java:51)
[junit4] 2> at org.apache.zookeeper.ZooKeeper.exists(ZooKeeper.java:1045)
[junit4] 2> at org.apache.solr.common.cloud.SolrZkClient$3.execute(SolrZkClient.java:209)
[junit4] 2> at org.apache.solr.common.cloud.SolrZkClient$3.execute(SolrZkClient.java:206)
[junit4] 2> at org.apache.solr.common.cloud.ZkCmdExecutor.retryOperation(ZkCmdExecutor.java:73)
[junit4] 2> at org.apache.solr.common.cloud.SolrZkClient.exists(SolrZkClient.java:206)
[junit4] 2> at org.apache.solr.common.cloud.SolrZkClient.makePath(SolrZkClient.java:417)
[junit4] 2> at org.apache.solr.common.cloud.SolrZkClient.makePath(SolrZkClient.java:386)
[junit4] 2> at org.apache.solr.common.cloud.SolrZkClient.makePath(SolrZkClient.java:373)
[junit4] 2> at org.apache.solr.cloud.ShardLeaderElectionContextBase$1.execute(ElectionContext.java:131)
[junit4] 2> at org.apache.solr.common.util.RetryUtil.retryOnThrowable(RetryUtil.java:34)
[junit4] 2> ... 8 more
[junit4] 2>
[junit4] 2> 1836413 T5205 oascc.ZkStateReader$3.process WARN ZooKeeper watch triggered, but Solr cannot talk to ZK
[junit4] 2> 1836413 T5205 oasc.LeaderElector$ElectionWatcher.process WARN org.apache.zookeeper.KeeperException$SessionExpiredException: KeeperErrorCode = Session expired for /overseer_elect/election
[junit4] 2> at org.apache.zookeeper.KeeperException.create(KeeperException.java:127)
[junit4] 2> at org.apache.zookeeper.KeeperException.create(KeeperException.java:51)
[junit4] 2> at org.apache.zookeeper.ZooKeeper.getChildren(ZooKeeper.java:1472)
[junit4] 2> at org.apache.solr.common.cloud.SolrZkClient$6.execute(SolrZkClient.java:260)
[junit4] 2> at org.apache.solr.common.cloud.SolrZkClient$6.execute(SolrZkClient.java:257)
[junit4] 2> at org.apache.solr.common.cloud.ZkCmdExecutor.retryOperation(ZkCmdExecutor.java:73)
[junit4] 2> at org.apache.solr.common.cloud.SolrZkClient.getChildren(SolrZkClient.java:257)
[junit4] 2> at org.apache.solr.cloud.LeaderElector.checkIfIamLeader(LeaderElector.java:94)
[junit4] 2> at org.apache.solr.cloud.LeaderElector.access$200(LeaderElector.java:55)
[junit4] 2> at org.apache.solr.cloud.LeaderElector$ElectionWatcher.process(LeaderElector.java:357)
[junit4] 2> at org.apache.zookeeper.ClientCnxn$EventThread.processEvent(ClientCnxn.java:522)
[junit4] 2> at org.apache.zookeeper.ClientCnxn$EventThread.run(ClientCnxn.java:498)
[junit4] 2>
[junit4] 2> NOTE: leaving temporary files on disk at: /mnt/ssd/jenkins/workspace/Lucene-Solr-4.x-Linux/solr/build/solr-core/test/J0/./solr.cloud.OverseerStatusTest-464EC46D52D3FA02-001
[junit4] 2> NOTE: test params are: codec=Lucene45, sim=DefaultSimilarity, locale=de_DE, timezone=Etc/GMT+7
[junit4] 2> NOTE: Linux 3.8.0-41-generic amd64/Oracle Corporation 1.8.0_20-ea (64-bit)/cpus=8,threads=1,free=243707504,total=521666560
[junit4] 2> NOTE: All tests run in this JVM: [SuggesterTest, BasicFunctionalityTest, DirectUpdateHandlerOptimizeTest, PolyFieldTest, TestDocumentBuilder, JsonLoaderTest, SpellPossibilityIteratorTest, TestExtendedDismaxParser, TestLMJelinekMercerSimilarityFactory, TestLMDirichletSimilarityFactory, ZkCLITest, SchemaVersionSpecificBehaviorTest, SampleTest, TestSchemaSimilarityResource, SolrCoreTest, TestSolrXml, TestConfig, TermVectorComponentTest, URLClassifyProcessorTest, TestMaxScoreQueryParser, HdfsChaosMonkeySafeLeaderTest, SoftAutoCommitTest, TestCollationKeyRangeQueries, TestPostingsSolrHighlighter, FastVectorHighlighterTest, DateMathParserTest, AsyncMigrateRouteKeyTest, QueryParsingTest, CursorMarkTest, AutoCommitTest, TestDistribDocBasedVersion, TestTrie, TestCharFilters, TestChildDocTransformer, DistributedQueryElevationComponentTest, CursorPagingTest, TestManagedSynonymFilterFactory, TestPseudoReturnFields, TestCustomSort, TestFieldSortValues, TestSolrDeletionPolicy1, PeerSyncTest, ScriptEngineTest, HdfsBasicDistributedZk2Test, UnloadDistributedZkTest, RecoveryZkTest, TestSearcherReuse, TestManagedSchemaFieldResource, SuggestComponentTest, TestFunctionQuery, TestConfigSets, TestSolrXmlPersistence, HdfsBasicDistributedZkTest, UpdateRequestProcessorFactoryTest, TestAddFieldRealTimeGet, DOMUtilTest, UUIDFieldTest, TestElisionMultitermQuery, TestManagedResourceStorage, SyncSliceTest, TestSolrIndexConfig, SpatialFilterTest, HighlighterMaxOffsetTest, TestJoin, ZkControllerTest, TestCloudManagedSchemaConcurrent, DocValuesTest, FieldMutatingUpdateProcessorTest, MoreLikeThisHandlerTest, TestAnalyzeInfixSuggestions, TestExpandComponent, TestRestManager, TestLFUCache, RankQueryTest, SolrIndexSplitterTest, CoreAdminHandlerTest, PrimitiveFieldTypeTest, InfoHandlerTest, TestDocBasedVersionConstraints, EchoParamsTest, CircularListTest, TestJmxMonitoredMap, DistributedSpellCheckComponentTest, TestOverriddenPrefixQueryForCustomFieldType, TestBlendedInfixSuggestions, QueryEqualityTest, ShardSplitTest, TestValueSourceCache, QueryResultKeyTest, AnalysisErrorHandlingTest, ResponseLogComponentTest, SOLR749Test, AliasIntegrationTest, TestSystemIdResolver, TestCursorMarkWithoutUniqueKey, TestCollationFieldDocValues, OpenCloseCoreStressTest, ShardRoutingTest, FullSolrCloudDistribCmdsTest, TestRandomDVFaceting, TestFaceting, TestStressReorder, TestStressVersions, TestCoreContainer, StatsComponentTest, SpellCheckComponentTest, QueryElevationComponentTest, ConvertedLegacyTest, TestSort, DirectUpdateHandlerTest, TestBadConfig, OverseerCollectionProcessorTest, ShowFileRequestHandlerTest, CurrencyFieldOpenExchangeTest, AnalysisAfterCoreReloadTest, SignatureUpdateProcessorFactoryTest, SpellCheckCollatorTest, SuggesterFSTTest, SuggesterWFSTTest, WordBreakSolrSpellCheckerTest, StatelessScriptUpdateProcessorFactoryTest, SolrInfoMBeanTest, DebugComponentTest, IndexBasedSpellCheckerTest, LukeRequestHandlerTest, TestReversedWildcardFilterFactory, TestOmitPositions, FileBasedSpellCheckerTest, TestIndexingPerformance, FieldAnalysisRequestHandlerTest, TestArbitraryIndexDir, LoggingHandlerTest, IndexSchemaTest, TestJmxIntegration, MBeansHandlerTest, BinaryUpdateRequestHandlerTest, PingRequestHandlerTest, CSVRequestHandlerTest, CoreContainerCoreInitFailuresTest, TestQuerySenderListener, AlternateDirectoryTest, CopyFieldTest, TestMergePolicyConfig, MultiTermTest, TestDocSet, TestSearchPerf, NumericFieldsTest, ExternalFileFieldSortTest, TestSolrCoreProperties, TestLuceneMatchVersion, SynonymTokenizerTest, TestSweetSpotSimilarityFactory, TestDFRSimilarityFactory, TestPerFieldSimilarity, TestIBSimilarityFactory, TestBM25SimilarityFactory, TestDefaultSimilarityFactory, LegacyHTMLStripCharFilterTest, ResourceLoaderTest, OpenExchangeRatesOrgProviderTest, TestSolrXMLSerializer, PrimUtilsTest, TestSuggestSpellingConverter, DateFieldTest, SpellingQueryConverterTest, RAMDirectoryFactoryTest, ClusterStateTest, TestLRUCache, SliceStateTest, SystemInfoHandlerTest, FileUtilsTest, SolrTestCaseJ4Test, TestDistributedMissingSort, ConnectionManagerTest, DeleteInactiveReplicaTest, DeleteReplicaTest, DeleteShardTest, DistribDocExpirationUpdateProcessorTest, MigrateRouteKeyTest, MultiThreadedOCPTest, OverseerStatusTest]
[junit4] Completed on J0 in 526.33s, 1 test, 1 error <<< FAILURES!
[...truncated 11 lines...]
BUILD FAILED
/mnt/ssd/jenkins/workspace/Lucene-Solr-4.x-Linux/build.xml:467: The following error occurred while executing this line:
/mnt/ssd/jenkins/workspace/Lucene-Solr-4.x-Linux/build.xml:447: The following error occurred while executing this line:
/mnt/ssd/jenkins/workspace/Lucene-Solr-4.x-Linux/build.xml:45: The following error occurred while executing this line:
/mnt/ssd/jenkins/workspace/Lucene-Solr-4.x-Linux/extra-targets.xml:37: The following error occurred while executing this line:
/mnt/ssd/jenkins/workspace/Lucene-Solr-4.x-Linux/solr/build.xml:189: The following error occurred while executing this line:
/mnt/ssd/jenkins/workspace/Lucene-Solr-4.x-Linux/solr/common-build.xml:496: The following error occurred while executing this line:
/mnt/ssd/jenkins/workspace/Lucene-Solr-4.x-Linux/lucene/common-build.xml:1297: The following error occurred while executing this line:
/mnt/ssd/jenkins/workspace/Lucene-Solr-4.x-Linux/lucene/common-build.xml:921: There were test failures: 404 suites, 1654 tests, 2 errors, 37 ignored (16 assumptions)
Total time: 70 minutes 28 seconds
Build step 'Invoke Ant' marked build as failure
Description set: Java: 64bit/jdk1.8.0_20-ea-b15 -XX:-UseCompressedOops -XX:+UseParallelGC
Archiving artifacts
Recording test results
Email was triggered for: Failure - Any
Sending email for trigger: Failure - Any
[JENKINS] Lucene-Solr-4.x-Linux (32bit/jdk1.7.0_60) - Build # 10475
- Still Failing!
Posted by Policeman Jenkins Server <je...@thetaphi.de>.
Build: http://jenkins.thetaphi.de/job/Lucene-Solr-4.x-Linux/10475/
Java: 32bit/jdk1.7.0_60 -server -XX:+UseParallelGC
1 tests failed.
FAILED: org.apache.lucene.codecs.lucene3x.TestLucene3xPostingsFormat.testRamBytesUsed
Error Message:
Actual RAM usage 2236, but got 1096, 0.5098389982110912% error
Stack Trace:
java.lang.AssertionError: Actual RAM usage 2236, but got 1096, 0.5098389982110912% error
at __randomizedtesting.SeedInfo.seed([B22949CBF6C565BE:408A5B8B3CBA7AE8]:0)
at org.junit.Assert.fail(Assert.java:93)
at org.junit.Assert.assertTrue(Assert.java:43)
at org.apache.lucene.index.BaseIndexFileFormatTestCase.testRamBytesUsed(BaseIndexFileFormatTestCase.java:235)
at org.apache.lucene.index.BasePostingsFormatTestCase.testRamBytesUsed(BasePostingsFormatTestCase.java:81)
at sun.reflect.NativeMethodAccessorImpl.invoke0(Native Method)
at sun.reflect.NativeMethodAccessorImpl.invoke(NativeMethodAccessorImpl.java:57)
at sun.reflect.DelegatingMethodAccessorImpl.invoke(DelegatingMethodAccessorImpl.java:43)
at java.lang.reflect.Method.invoke(Method.java:606)
at com.carrotsearch.randomizedtesting.RandomizedRunner.invoke(RandomizedRunner.java:1618)
at com.carrotsearch.randomizedtesting.RandomizedRunner$6.evaluate(RandomizedRunner.java:827)
at com.carrotsearch.randomizedtesting.RandomizedRunner$7.evaluate(RandomizedRunner.java:863)
at com.carrotsearch.randomizedtesting.RandomizedRunner$8.evaluate(RandomizedRunner.java:877)
at org.apache.lucene.util.TestRuleSetupTeardownChained$1.evaluate(TestRuleSetupTeardownChained.java:50)
at org.apache.lucene.util.TestRuleFieldCacheSanity$1.evaluate(TestRuleFieldCacheSanity.java:51)
at org.apache.lucene.util.AbstractBeforeAfterRule$1.evaluate(AbstractBeforeAfterRule.java:46)
at com.carrotsearch.randomizedtesting.rules.SystemPropertiesInvariantRule$1.evaluate(SystemPropertiesInvariantRule.java:55)
at org.apache.lucene.util.TestRuleThreadAndTestName$1.evaluate(TestRuleThreadAndTestName.java:49)
at org.apache.lucene.util.TestRuleIgnoreAfterMaxFailures$1.evaluate(TestRuleIgnoreAfterMaxFailures.java:65)
at org.apache.lucene.util.TestRuleMarkFailure$1.evaluate(TestRuleMarkFailure.java:48)
at com.carrotsearch.randomizedtesting.rules.StatementAdapter.evaluate(StatementAdapter.java:36)
at com.carrotsearch.randomizedtesting.ThreadLeakControl$StatementRunner.run(ThreadLeakControl.java:360)
at com.carrotsearch.randomizedtesting.ThreadLeakControl.forkTimeoutingTask(ThreadLeakControl.java:793)
at com.carrotsearch.randomizedtesting.ThreadLeakControl$3.evaluate(ThreadLeakControl.java:453)
at com.carrotsearch.randomizedtesting.RandomizedRunner.runSingleTest(RandomizedRunner.java:836)
at com.carrotsearch.randomizedtesting.RandomizedRunner$3.evaluate(RandomizedRunner.java:738)
at com.carrotsearch.randomizedtesting.RandomizedRunner$4.evaluate(RandomizedRunner.java:772)
at com.carrotsearch.randomizedtesting.RandomizedRunner$5.evaluate(RandomizedRunner.java:783)
at org.apache.lucene.util.AbstractBeforeAfterRule$1.evaluate(AbstractBeforeAfterRule.java:46)
at org.apache.lucene.util.TestRuleStoreClassName$1.evaluate(TestRuleStoreClassName.java:42)
at com.carrotsearch.randomizedtesting.rules.SystemPropertiesInvariantRule$1.evaluate(SystemPropertiesInvariantRule.java:55)
at com.carrotsearch.randomizedtesting.rules.NoShadowingOrOverridesOnMethodsRule$1.evaluate(NoShadowingOrOverridesOnMethodsRule.java:39)
at com.carrotsearch.randomizedtesting.rules.NoShadowingOrOverridesOnMethodsRule$1.evaluate(NoShadowingOrOverridesOnMethodsRule.java:39)
at com.carrotsearch.randomizedtesting.rules.StatementAdapter.evaluate(StatementAdapter.java:36)
at com.carrotsearch.randomizedtesting.rules.StatementAdapter.evaluate(StatementAdapter.java:36)
at com.carrotsearch.randomizedtesting.rules.StatementAdapter.evaluate(StatementAdapter.java:36)
at org.apache.lucene.util.TestRuleAssertionsRequired$1.evaluate(TestRuleAssertionsRequired.java:43)
at org.apache.lucene.util.TestRuleMarkFailure$1.evaluate(TestRuleMarkFailure.java:48)
at org.apache.lucene.util.TestRuleIgnoreAfterMaxFailures$1.evaluate(TestRuleIgnoreAfterMaxFailures.java:65)
at org.apache.lucene.util.TestRuleIgnoreTestSuites$1.evaluate(TestRuleIgnoreTestSuites.java:55)
at com.carrotsearch.randomizedtesting.rules.StatementAdapter.evaluate(StatementAdapter.java:36)
at com.carrotsearch.randomizedtesting.ThreadLeakControl$StatementRunner.run(ThreadLeakControl.java:360)
at java.lang.Thread.run(Thread.java:745)
Build Log:
[...truncated 566 lines...]
[junit4] Suite: org.apache.lucene.codecs.lucene3x.TestLucene3xPostingsFormat
[junit4] 2> NOTE: reproduce with: ant test -Dtestcase=TestLucene3xPostingsFormat -Dtests.method=testRamBytesUsed -Dtests.seed=B22949CBF6C565BE -Dtests.multiplier=3 -Dtests.slow=true -Dtests.locale=ru -Dtests.timezone=SST -Dtests.file.encoding=UTF-8
[junit4] FAILURE 1.82s J0 | TestLucene3xPostingsFormat.testRamBytesUsed <<<
[junit4] > Throwable #1: java.lang.AssertionError: Actual RAM usage 2236, but got 1096, 0.5098389982110912% error
[junit4] > at __randomizedtesting.SeedInfo.seed([B22949CBF6C565BE:408A5B8B3CBA7AE8]:0)
[junit4] > at org.apache.lucene.index.BaseIndexFileFormatTestCase.testRamBytesUsed(BaseIndexFileFormatTestCase.java:235)
[junit4] > at org.apache.lucene.index.BasePostingsFormatTestCase.testRamBytesUsed(BasePostingsFormatTestCase.java:81)
[junit4] > at java.lang.Thread.run(Thread.java:745)
[junit4] 2> NOTE: leaving temporary files on disk at: /mnt/ssd/jenkins/workspace/Lucene-Solr-4.x-Linux/lucene/build/core/test/J0/./lucene.codecs.lucene3x.TestLucene3xPostingsFormat-B22949CBF6C565BE-001
[junit4] 2> NOTE: test params are: codec=CheapBastard, sim=DefaultSimilarity, locale=ru, timezone=SST
[junit4] 2> NOTE: Linux 3.8.0-41-generic i386/Oracle Corporation 1.7.0_60 (32-bit)/cpus=8,threads=1,free=124454144,total=213385216
[junit4] 2> NOTE: All tests run in this JVM: [TestDirectory, TestTermdocPerf, TestBagOfPositions, Test2BSortedDocValues, TestCompoundFile, TestLucene40PostingsReader, TestIntroSorter, TestAutomatonQueryUnicode, TestDocBoost, TestLock, TestBlockPostingsFormat3, TestBooleanCoord, TestSimilarity, TestVersion, TestNot, TestMathUtil, TestIndexWriterMerging, TestIntBlockPool, TestMatchAllDocsQuery, TestCachingTokenFilter, TestRamUsageEstimator, Test2BPostingsBytes, TestNRTReaderWithThreads, TestFilterDirectory, TestBytesStore, TestRollback, TestLucene49NormsFormat, TestExceedMaxTermLength, TestLucene40StoredFieldsFormat, TestSpanFirstQuery, TestCharTermAttributeImpl, TestDocTermOrds, TestSort, TestLucene41StoredFieldsFormat, TestBufferedChecksum, TestLucene3xPostingsFormat]
[junit4] Completed on J0 in 4.11s, 9 tests, 1 failure <<< FAILURES!
[...truncated 1229 lines...]
BUILD FAILED
/mnt/ssd/jenkins/workspace/Lucene-Solr-4.x-Linux/build.xml:467: The following error occurred while executing this line:
/mnt/ssd/jenkins/workspace/Lucene-Solr-4.x-Linux/build.xml:447: The following error occurred while executing this line:
/mnt/ssd/jenkins/workspace/Lucene-Solr-4.x-Linux/build.xml:45: The following error occurred while executing this line:
/mnt/ssd/jenkins/workspace/Lucene-Solr-4.x-Linux/extra-targets.xml:37: The following error occurred while executing this line:
/mnt/ssd/jenkins/workspace/Lucene-Solr-4.x-Linux/lucene/build.xml:49: The following error occurred while executing this line:
/mnt/ssd/jenkins/workspace/Lucene-Solr-4.x-Linux/lucene/common-build.xml:1297: The following error occurred while executing this line:
/mnt/ssd/jenkins/workspace/Lucene-Solr-4.x-Linux/lucene/common-build.xml:921: There were test failures: 413 suites, 3445 tests, 1 failure, 132 ignored (121 assumptions)
Total time: 24 minutes 2 seconds
Build step 'Invoke Ant' marked build as failure
Description set: Java: 32bit/jdk1.7.0_60 -server -XX:+UseParallelGC
Archiving artifacts
Recording test results
Email was triggered for: Failure - Any
Sending email for trigger: Failure - Any