You are viewing a plain text version of this content. The canonical link for it is here.
Posted to builds@solr.apache.org by Apache Jenkins Server <je...@builds.apache.org> on 2024/05/03 16:39:17 UTC

[JENKINS] Lucene » Lucene-Solr-Tests-8.11 - Build # 838 - Still Unstable!

Build: https://ci-builds.apache.org/job/Lucene/job/Lucene-Solr-Tests-8.11/838/

1 tests failed.
FAILED:  org.apache.solr.cloud.api.collections.ShardSplitTest.testSplitMixedReplicaTypes

Error Message:
Timeout occurred while waiting response from server at: http://127.0.0.1:35367/p/f

Stack Trace:
org.apache.solr.client.solrj.SolrServerException: Timeout occurred while waiting response from server at: http://127.0.0.1:35367/p/f
	at __randomizedtesting.SeedInfo.seed([F487E4BABD74F40D:4C44B01A41AF2178]:0)
	at org.apache.solr.client.solrj.impl.HttpSolrClient.executeMethod(HttpSolrClient.java:692)
	at org.apache.solr.client.solrj.impl.HttpSolrClient.request(HttpSolrClient.java:266)
	at org.apache.solr.client.solrj.impl.HttpSolrClient.request(HttpSolrClient.java:248)
	at org.apache.solr.client.solrj.impl.LBSolrClient.doRequest(LBSolrClient.java:369)
	at org.apache.solr.client.solrj.impl.LBSolrClient.request(LBSolrClient.java:297)
	at org.apache.solr.client.solrj.impl.BaseCloudSolrClient.sendRequest(BaseCloudSolrClient.java:1188)
	at org.apache.solr.client.solrj.impl.BaseCloudSolrClient.requestWithRetryOnStaleState(BaseCloudSolrClient.java:934)
	at org.apache.solr.client.solrj.impl.BaseCloudSolrClient.request(BaseCloudSolrClient.java:866)
	at org.apache.solr.client.solrj.SolrRequest.process(SolrRequest.java:225)
	at org.apache.solr.client.solrj.SolrRequest.process(SolrRequest.java:242)
	at org.apache.solr.cloud.api.collections.ShardSplitTest.doSplitMixedReplicaTypes(ShardSplitTest.java:365)
	at org.apache.solr.cloud.api.collections.ShardSplitTest.testSplitMixedReplicaTypes(ShardSplitTest.java:350)
	at sun.reflect.NativeMethodAccessorImpl.invoke0(Native Method)
	at sun.reflect.NativeMethodAccessorImpl.invoke(NativeMethodAccessorImpl.java:62)
	at sun.reflect.DelegatingMethodAccessorImpl.invoke(DelegatingMethodAccessorImpl.java:43)
	at java.lang.reflect.Method.invoke(Method.java:498)
	at com.carrotsearch.randomizedtesting.RandomizedRunner.invoke(RandomizedRunner.java:1758)
	at com.carrotsearch.randomizedtesting.RandomizedRunner$8.evaluate(RandomizedRunner.java:946)
	at com.carrotsearch.randomizedtesting.RandomizedRunner$9.evaluate(RandomizedRunner.java:982)
	at com.carrotsearch.randomizedtesting.RandomizedRunner$10.evaluate(RandomizedRunner.java:996)
	at org.apache.solr.BaseDistributedSearchTestCase$ShardsRepeatRule$ShardsFixedStatement.callStatement(BaseDistributedSearchTestCase.java:1084)
	at org.apache.solr.BaseDistributedSearchTestCase$ShardsRepeatRule$ShardsStatement.evaluate(BaseDistributedSearchTestCase.java:1055)
	at com.carrotsearch.randomizedtesting.rules.SystemPropertiesRestoreRule$1.evaluate(SystemPropertiesRestoreRule.java:80)
	at org.junit.rules.RunRules.evaluate(RunRules.java:20)
	at org.apache.lucene.util.TestRuleSetupTeardownChained$1.evaluate(TestRuleSetupTeardownChained.java:49)
	at org.apache.lucene.util.AbstractBeforeAfterRule$1.evaluate(AbstractBeforeAfterRule.java:45)
	at org.apache.lucene.util.TestRuleThreadAndTestName$1.evaluate(TestRuleThreadAndTestName.java:48)
	at org.apache.lucene.util.TestRuleIgnoreAfterMaxFailures$1.evaluate(TestRuleIgnoreAfterMaxFailures.java:64)
	at org.apache.lucene.util.TestRuleMarkFailure$1.evaluate(TestRuleMarkFailure.java:47)
	at org.junit.rules.RunRules.evaluate(RunRules.java:20)
	at com.carrotsearch.randomizedtesting.rules.StatementAdapter.evaluate(StatementAdapter.java:36)
	at com.carrotsearch.randomizedtesting.ThreadLeakControl$StatementRunner.run(ThreadLeakControl.java:390)
	at com.carrotsearch.randomizedtesting.ThreadLeakControl.forkTimeoutingTask(ThreadLeakControl.java:843)
	at com.carrotsearch.randomizedtesting.ThreadLeakControl$3.evaluate(ThreadLeakControl.java:490)
	at com.carrotsearch.randomizedtesting.RandomizedRunner.runSingleTest(RandomizedRunner.java:955)
	at com.carrotsearch.randomizedtesting.RandomizedRunner$5.evaluate(RandomizedRunner.java:840)
	at com.carrotsearch.randomizedtesting.RandomizedRunner$6.evaluate(RandomizedRunner.java:891)
	at com.carrotsearch.randomizedtesting.RandomizedRunner$7.evaluate(RandomizedRunner.java:902)
	at com.carrotsearch.randomizedtesting.rules.StatementAdapter.evaluate(StatementAdapter.java:36)
	at com.carrotsearch.randomizedtesting.rules.SystemPropertiesRestoreRule$1.evaluate(SystemPropertiesRestoreRule.java:80)
	at org.junit.rules.RunRules.evaluate(RunRules.java:20)
	at org.apache.lucene.util.AbstractBeforeAfterRule$1.evaluate(AbstractBeforeAfterRule.java:45)
	at com.carrotsearch.randomizedtesting.rules.StatementAdapter.evaluate(StatementAdapter.java:36)
	at org.apache.lucene.util.TestRuleStoreClassName$1.evaluate(TestRuleStoreClassName.java:41)
	at com.carrotsearch.randomizedtesting.rules.NoShadowingOrOverridesOnMethodsRule$1.evaluate(NoShadowingOrOverridesOnMethodsRule.java:40)
	at com.carrotsearch.randomizedtesting.rules.NoShadowingOrOverridesOnMethodsRule$1.evaluate(NoShadowingOrOverridesOnMethodsRule.java:40)
	at com.carrotsearch.randomizedtesting.rules.StatementAdapter.evaluate(StatementAdapter.java:36)
	at com.carrotsearch.randomizedtesting.rules.StatementAdapter.evaluate(StatementAdapter.java:36)
	at com.carrotsearch.randomizedtesting.rules.StatementAdapter.evaluate(StatementAdapter.java:36)
	at org.apache.lucene.util.TestRuleAssertionsRequired$1.evaluate(TestRuleAssertionsRequired.java:53)
	at org.apache.lucene.util.TestRuleMarkFailure$1.evaluate(TestRuleMarkFailure.java:47)
	at org.apache.lucene.util.TestRuleIgnoreAfterMaxFailures$1.evaluate(TestRuleIgnoreAfterMaxFailures.java:64)
	at org.apache.lucene.util.TestRuleIgnoreTestSuites$1.evaluate(TestRuleIgnoreTestSuites.java:54)
	at org.junit.rules.RunRules.evaluate(RunRules.java:20)
	at com.carrotsearch.randomizedtesting.rules.StatementAdapter.evaluate(StatementAdapter.java:36)
	at com.carrotsearch.randomizedtesting.ThreadLeakControl$StatementRunner.run(ThreadLeakControl.java:390)
	at com.carrotsearch.randomizedtesting.ThreadLeakControl.lambda$forkTimeoutingTask$0(ThreadLeakControl.java:850)
	at java.lang.Thread.run(Thread.java:750)
Caused by: java.net.SocketTimeoutException: Read timed out
	at java.net.SocketInputStream.socketRead0(Native Method)
	at java.net.SocketInputStream.socketRead(SocketInputStream.java:116)
	at java.net.SocketInputStream.read(SocketInputStream.java:171)
	at java.net.SocketInputStream.read(SocketInputStream.java:141)
	at org.apache.http.impl.io.SessionInputBufferImpl.streamRead(SessionInputBufferImpl.java:137)
	at org.apache.http.impl.io.SessionInputBufferImpl.fillBuffer(SessionInputBufferImpl.java:153)
	at org.apache.http.impl.io.SessionInputBufferImpl.readLine(SessionInputBufferImpl.java:280)
	at org.apache.http.impl.conn.DefaultHttpResponseParser.parseHead(DefaultHttpResponseParser.java:138)
	at org.apache.http.impl.conn.DefaultHttpResponseParser.parseHead(DefaultHttpResponseParser.java:56)
	at org.apache.http.impl.io.AbstractMessageParser.parse(AbstractMessageParser.java:259)
	at org.apache.http.impl.DefaultBHttpClientConnection.receiveResponseHeader(DefaultBHttpClientConnection.java:163)
	at org.apache.http.impl.conn.CPoolProxy.receiveResponseHeader(CPoolProxy.java:157)
	at org.apache.http.protocol.HttpRequestExecutor.doReceiveResponse(HttpRequestExecutor.java:273)
	at org.apache.http.protocol.HttpRequestExecutor.execute(HttpRequestExecutor.java:125)
	at org.apache.http.impl.execchain.MainClientExec.execute(MainClientExec.java:272)
	at org.apache.http.impl.execchain.ProtocolExec.execute(ProtocolExec.java:186)
	at org.apache.http.impl.execchain.RetryExec.execute(RetryExec.java:89)
	at org.apache.http.impl.execchain.RedirectExec.execute(RedirectExec.java:110)
	at org.apache.http.impl.client.InternalHttpClient.doExecute(InternalHttpClient.java:185)
	at org.apache.http.impl.client.CloseableHttpClient.execute(CloseableHttpClient.java:83)
	at org.apache.http.impl.client.CloseableHttpClient.execute(CloseableHttpClient.java:56)
	at org.apache.solr.client.solrj.impl.HttpSolrClient.executeMethod(HttpSolrClient.java:571)
	... 57 more




Build Log:
[...truncated 14730 lines...]
   [junit4] Suite: org.apache.solr.cloud.api.collections.ShardSplitTest
   [junit4]   2> 772947 INFO  (SUITE-ShardSplitTest-seed#[F487E4BABD74F40D]-worker) [     ] o.a.s.SolrTestCase Setting 'solr.default.confdir' system property to test-framework derived value of '/home/jenkins/jenkins-slave/workspace/Lucene/Lucene-Solr-Tests-8.11/solr/server/solr/configsets/_default/conf'
   [junit4]   2> 772948 INFO  (SUITE-ShardSplitTest-seed#[F487E4BABD74F40D]-worker) [     ] o.a.s.u.ErrorLogMuter Closing ErrorLogMuter-regex-154 after mutting 0 log messages
   [junit4]   2> 772948 INFO  (SUITE-ShardSplitTest-seed#[F487E4BABD74F40D]-worker) [     ] o.a.s.u.ErrorLogMuter Creating ErrorLogMuter-regex-155 for ERROR logs matching regex: ignore_exception
   [junit4]   2> 772949 INFO  (SUITE-ShardSplitTest-seed#[F487E4BABD74F40D]-worker) [     ] o.a.s.SolrTestCaseJ4 Created dataDir: /home/jenkins/jenkins-slave/workspace/Lucene/Lucene-Solr-Tests-8.11/solr/build/solr-core/test/J3/temp/solr.cloud.api.collections.ShardSplitTest_F487E4BABD74F40D-001/data-dir-76-001
   [junit4]   2> 772949 WARN  (SUITE-ShardSplitTest-seed#[F487E4BABD74F40D]-worker) [     ] o.a.s.SolrTestCaseJ4 startTrackingSearchers: numOpens=4 numCloses=4
   [junit4]   2> 772949 INFO  (SUITE-ShardSplitTest-seed#[F487E4BABD74F40D]-worker) [     ] o.a.s.SolrTestCaseJ4 Using PointFields (NUMERIC_POINTS_SYSPROP=true) w/NUMERIC_DOCVALUES_SYSPROP=false
   [junit4]   2> 772951 INFO  (SUITE-ShardSplitTest-seed#[F487E4BABD74F40D]-worker) [     ] o.a.s.SolrTestCaseJ4 Randomized ssl (false) and clientAuth (false) via: @org.apache.solr.SolrTestCaseJ4$SuppressSSL(bugUrl=https://issues.apache.org/jira/browse/SOLR-5776)
   [junit4]   2> 772952 INFO  (SUITE-ShardSplitTest-seed#[F487E4BABD74F40D]-worker) [     ] o.a.s.SolrTestCaseJ4 SecureRandom sanity checks: test.solr.allowed.securerandom=null & java.security.egd=file:/dev/./urandom
   [junit4]   2> 772952 INFO  (SUITE-ShardSplitTest-seed#[F487E4BABD74F40D]-worker) [     ] o.a.s.BaseDistributedSearchTestCase Setting hostContext system property: /p/f
   [junit4]   2> 772956 INFO  (TEST-ShardSplitTest.testSplitAfterFailedSplit-seed#[F487E4BABD74F40D]) [     ] o.a.s.u.ErrorLogMuter Closing ErrorLogMuter-regex-155 after mutting 0 log messages
   [junit4]   2> 772957 INFO  (TEST-ShardSplitTest.testSplitAfterFailedSplit-seed#[F487E4BABD74F40D]) [     ] o.a.s.u.ErrorLogMuter Creating ErrorLogMuter-regex-156 for ERROR logs matching regex: ignore_exception
   [junit4]   2> 772957 INFO  (TEST-ShardSplitTest.testSplitAfterFailedSplit-seed#[F487E4BABD74F40D]) [     ] o.a.s.c.ZkTestServer STARTING ZK TEST SERVER
   [junit4]   2> 772958 INFO  (ZkTestServer Run Thread) [     ] o.a.s.c.ZkTestServer client port: 0.0.0.0/0.0.0.0:0
   [junit4]   2> 772958 INFO  (ZkTestServer Run Thread) [     ] o.a.s.c.ZkTestServer Starting server
   [junit4]   2> 772958 WARN  (ZkTestServer Run Thread) [     ] o.a.z.s.ServerCnxnFactory maxCnxns is not configured, using default value 0.
   [junit4]   2> 773058 INFO  (TEST-ShardSplitTest.testSplitAfterFailedSplit-seed#[F487E4BABD74F40D]) [     ] o.a.s.c.ZkTestServer start zk server on port: 44853
   [junit4]   2> 773058 INFO  (TEST-ShardSplitTest.testSplitAfterFailedSplit-seed#[F487E4BABD74F40D]) [     ] o.a.s.c.ZkTestServer waitForServerUp: 127.0.0.1:44853
   [junit4]   2> 773058 INFO  (TEST-ShardSplitTest.testSplitAfterFailedSplit-seed#[F487E4BABD74F40D]) [     ] o.a.s.c.ZkTestServer parse host and port list: 127.0.0.1:44853
   [junit4]   2> 773058 INFO  (TEST-ShardSplitTest.testSplitAfterFailedSplit-seed#[F487E4BABD74F40D]) [     ] o.a.s.c.ZkTestServer connecting to 127.0.0.1 44853
   [junit4]   2> 773059 DEBUG (TEST-ShardSplitTest.testSplitAfterFailedSplit-seed#[F487E4BABD74F40D]) [     ] o.a.s.c.c.SolrZkClient Using default ZkCredentialsProvider
   [junit4]   2> 773061 INFO  (TEST-ShardSplitTest.testSplitAfterFailedSplit-seed#[F487E4BABD74F40D]) [     ] o.a.s.c.c.ConnectionManager Waiting for client to connect to ZooKeeper
   [junit4]   2> 773068 DEBUG (TEST-ShardSplitTest.testSplitAfterFailedSplit-seed#[F487E4BABD74F40D]-EventThread) [     ] o.a.s.c.c.SolrZkClient Submitting job to respond to event WatchedEvent state:SyncConnected type:None path:null
   [junit4]   2> 773068 DEBUG (zkConnectionManagerCallback-6374-thread-1) [     ] o.a.s.c.c.ConnectionManager Watcher org.apache.solr.common.cloud.ConnectionManager@34578542 name: ZooKeeperConnection Watcher:127.0.0.1:44853 got event WatchedEvent state:SyncConnected type:None path:null path: null type: None
   [junit4]   2> 773068 INFO  (zkConnectionManagerCallback-6374-thread-1) [     ] o.a.s.c.c.ConnectionManager zkClient has connected
   [junit4]   2> 773068 INFO  (TEST-ShardSplitTest.testSplitAfterFailedSplit-seed#[F487E4BABD74F40D]) [     ] o.a.s.c.c.ConnectionManager Client is connected to ZooKeeper
   [junit4]   2> 773068 DEBUG (TEST-ShardSplitTest.testSplitAfterFailedSplit-seed#[F487E4BABD74F40D]) [     ] o.a.s.c.c.SolrZkClient Using default ZkACLProvider
   [junit4]   2> 773070 DEBUG (TEST-ShardSplitTest.testSplitAfterFailedSplit-seed#[F487E4BABD74F40D]) [     ] o.a.s.c.c.SolrZkClient makePath: /solr
   [junit4]   2> 773072 DEBUG (TEST-ShardSplitTest.testSplitAfterFailedSplit-seed#[F487E4BABD74F40D]) [     ] o.a.s.c.c.SolrZkClient Using default ZkCredentialsProvider
   [junit4]   2> 773075 INFO  (TEST-ShardSplitTest.testSplitAfterFailedSplit-seed#[F487E4BABD74F40D]) [     ] o.a.s.c.c.ConnectionManager Waiting for client to connect to ZooKeeper
   [junit4]   2> 773078 DEBUG (TEST-ShardSplitTest.testSplitAfterFailedSplit-seed#[F487E4BABD74F40D]-EventThread) [     ] o.a.s.c.c.SolrZkClient Submitting job to respond to event WatchedEvent state:SyncConnected type:None path:null
   [junit4]   2> 773082 DEBUG (zkConnectionManagerCallback-6376-thread-1) [     ] o.a.s.c.c.ConnectionManager Watcher org.apache.solr.common.cloud.ConnectionManager@529896de name: ZooKeeperConnection Watcher:127.0.0.1:44853/solr got event WatchedEvent state:SyncConnected type:None path:null path: null type: None
   [junit4]   2> 773082 INFO  (zkConnectionManagerCallback-6376-thread-1) [     ] o.a.s.c.c.ConnectionManager zkClient has connected
   [junit4]   2> 773082 INFO  (TEST-ShardSplitTest.testSplitAfterFailedSplit-seed#[F487E4BABD74F40D]) [     ] o.a.s.c.c.ConnectionManager Client is connected to ZooKeeper
   [junit4]   2> 773083 DEBUG (TEST-ShardSplitTest.testSplitAfterFailedSplit-seed#[F487E4BABD74F40D]) [     ] o.a.s.c.c.SolrZkClient Using default ZkACLProvider
   [junit4]   2> 773092 DEBUG (TEST-ShardSplitTest.testSplitAfterFailedSplit-seed#[F487E4BABD74F40D]) [     ] o.a.s.c.c.SolrZkClient makePath: /clusterprops.json
   [junit4]   2> 773092 INFO  (TEST-ShardSplitTest.testSplitAfterFailedSplit-seed#[F487E4BABD74F40D]) [     ] o.a.s.c.ZkTestServer put /home/jenkins/jenkins-slave/workspace/Lucene/Lucene-Solr-Tests-8.11/solr/core/src/test-files/solr/collection1/conf/solrconfig-tlog.xml to /configs/conf1/solrconfig.xml
   [junit4]   2> 773092 DEBUG (TEST-ShardSplitTest.testSplitAfterFailedSplit-seed#[F487E4BABD74F40D]) [     ] o.a.s.c.c.SolrZkClient makePath: /configs/conf1/solrconfig.xml
   [junit4]   2> 773094 INFO  (TEST-ShardSplitTest.testSplitAfterFailedSplit-seed#[F487E4BABD74F40D]) [     ] o.a.s.c.ZkTestServer put /home/jenkins/jenkins-slave/workspace/Lucene/Lucene-Solr-Tests-8.11/solr/core/src/test-files/solr/collection1/conf/schema15.xml to /configs/conf1/schema.xml
   [junit4]   2> 773094 DEBUG (TEST-ShardSplitTest.testSplitAfterFailedSplit-seed#[F487E4BABD74F40D]) [     ] o.a.s.c.c.SolrZkClient makePath: /configs/conf1/schema.xml
   [junit4]   2> 773096 INFO  (TEST-ShardSplitTest.testSplitAfterFailedSplit-seed#[F487E4BABD74F40D]) [     ] o.a.s.c.ZkTestServer put /home/jenkins/jenkins-slave/workspace/Lucene/Lucene-Solr-Tests-8.11/solr/core/src/test-files/solr/collection1/conf/solrconfig.snippet.randomindexconfig.xml to /configs/conf1/solrconfig.snippet.randomindexconfig.xml
   [junit4]   2> 773096 DEBUG (TEST-ShardSplitTest.testSplitAfterFailedSplit-seed#[F487E4BABD74F40D]) [     ] o.a.s.c.c.SolrZkClient makePath: /configs/conf1/solrconfig.snippet.randomindexconfig.xml
   [junit4]   2> 773097 INFO  (TEST-ShardSplitTest.testSplitAfterFailedSplit-seed#[F487E4BABD74F40D]) [     ] o.a.s.c.ZkTestServer put /home/jenkins/jenkins-slave/workspace/Lucene/Lucene-Solr-Tests-8.11/solr/core/src/test-files/solr/collection1/conf/stopwords.txt to /configs/conf1/stopwords.txt
   [junit4]   2> 773097 DEBUG (TEST-ShardSplitTest.testSplitAfterFailedSplit-seed#[F487E4BABD74F40D]) [     ] o.a.s.c.c.SolrZkClient makePath: /configs/conf1/stopwords.txt
   [junit4]   2> 773098 INFO  (TEST-ShardSplitTest.testSplitAfterFailedSplit-seed#[F487E4BABD74F40D]) [     ] o.a.s.c.ZkTestServer put /home/jenkins/jenkins-slave/workspace/Lucene/Lucene-Solr-Tests-8.11/solr/core/src/test-files/solr/collection1/conf/protwords.txt to /configs/conf1/protwords.txt
   [junit4]   2> 773098 DEBUG (TEST-ShardSplitTest.testSplitAfterFailedSplit-seed#[F487E4BABD74F40D]) [     ] o.a.s.c.c.SolrZkClient makePath: /configs/conf1/protwords.txt
   [junit4]   2> 773100 INFO  (TEST-ShardSplitTest.testSplitAfterFailedSplit-seed#[F487E4BABD74F40D]) [     ] o.a.s.c.ZkTestServer put /home/jenkins/jenkins-slave/workspace/Lucene/Lucene-Solr-Tests-8.11/solr/core/src/test-files/solr/collection1/conf/currency.xml to /configs/conf1/currency.xml
   [junit4]   2> 773100 DEBUG (TEST-ShardSplitTest.testSplitAfterFailedSplit-seed#[F487E4BABD74F40D]) [     ] o.a.s.c.c.SolrZkClient makePath: /configs/conf1/currency.xml
   [junit4]   2> 773101 INFO  (TEST-ShardSplitTest.testSplitAfterFailedSplit-seed#[F487E4BABD74F40D]) [     ] o.a.s.c.ZkTestServer put /home/jenkins/jenkins-slave/workspace/Lucene/Lucene-Solr-Tests-8.11/solr/core/src/test-files/solr/collection1/conf/enumsConfig.xml to /configs/conf1/enumsConfig.xml
   [junit4]   2> 773101 DEBUG (TEST-ShardSplitTest.testSplitAfterFailedSplit-seed#[F487E4BABD74F40D]) [     ] o.a.s.c.c.SolrZkClient makePath: /configs/conf1/enumsConfig.xml
   [junit4]   2> 773102 INFO  (TEST-ShardSplitTest.testSplitAfterFailedSplit-seed#[F487E4BABD74F40D]) [     ] o.a.s.c.ZkTestServer put /home/jenkins/jenkins-slave/workspace/Lucene/Lucene-Solr-Tests-8.11/solr/core/src/test-files/solr/collection1/conf/open-exchange-rates.json to /configs/conf1/open-exchange-rates.json
   [junit4]   2> 773102 DEBUG (TEST-ShardSplitTest.testSplitAfterFailedSplit-seed#[F487E4BABD74F40D]) [     ] o.a.s.c.c.SolrZkClient makePath: /configs/conf1/open-exchange-rates.json
   [junit4]   2> 773103 INFO  (TEST-ShardSplitTest.testSplitAfterFailedSplit-seed#[F487E4BABD74F40D]) [     ] o.a.s.c.ZkTestServer put /home/jenkins/jenkins-slave/workspace/Lucene/Lucene-Solr-Tests-8.11/solr/core/src/test-files/solr/collection1/conf/mapping-ISOLatin1Accent.txt to /configs/conf1/mapping-ISOLatin1Accent.txt
   [junit4]   2> 773103 DEBUG (TEST-ShardSplitTest.testSplitAfterFailedSplit-seed#[F487E4BABD74F40D]) [     ] o.a.s.c.c.SolrZkClient makePath: /configs/conf1/mapping-ISOLatin1Accent.txt
   [junit4]   2> 773105 INFO  (TEST-ShardSplitTest.testSplitAfterFailedSplit-seed#[F487E4BABD74F40D]) [     ] o.a.s.c.ZkTestServer put /home/jenkins/jenkins-slave/workspace/Lucene/Lucene-Solr-Tests-8.11/solr/core/src/test-files/solr/collection1/conf/old_synonyms.txt to /configs/conf1/old_synonyms.txt
   [junit4]   2> 773105 DEBUG (TEST-ShardSplitTest.testSplitAfterFailedSplit-seed#[F487E4BABD74F40D]) [     ] o.a.s.c.c.SolrZkClient makePath: /configs/conf1/old_synonyms.txt
   [junit4]   2> 773106 INFO  (TEST-ShardSplitTest.testSplitAfterFailedSplit-seed#[F487E4BABD74F40D]) [     ] o.a.s.c.ZkTestServer put /home/jenkins/jenkins-slave/workspace/Lucene/Lucene-Solr-Tests-8.11/solr/core/src/test-files/solr/collection1/conf/synonyms.txt to /configs/conf1/synonyms.txt
   [junit4]   2> 773106 DEBUG (TEST-ShardSplitTest.testSplitAfterFailedSplit-seed#[F487E4BABD74F40D]) [     ] o.a.s.c.c.SolrZkClient makePath: /configs/conf1/synonyms.txt
   [junit4]   2> 773107 INFO  (TEST-ShardSplitTest.testSplitAfterFailedSplit-seed#[F487E4BABD74F40D]) [     ] o.a.s.c.AbstractFullDistribZkTestBase Will use NRT replicas unless explicitly asked otherwise
   [junit4]   2> 773248 INFO  (TEST-ShardSplitTest.testSplitAfterFailedSplit-seed#[F487E4BABD74F40D]) [     ] o.a.s.c.s.e.JettySolrRunner Start Jetty (configured port=0, binding port=0)
   [junit4]   2> 773248 INFO  (TEST-ShardSplitTest.testSplitAfterFailedSplit-seed#[F487E4BABD74F40D]) [     ] o.a.s.c.s.e.JettySolrRunner Trying to start Jetty on port 0 try number 2 ...
   [junit4]   2> 773248 INFO  (TEST-ShardSplitTest.testSplitAfterFailedSplit-seed#[F487E4BABD74F40D]) [     ] o.e.j.s.Server jetty-9.4.53.v20231009; built: 2023-10-09T12:29:09.265Z; git: 27bde00a0b95a1d5bbee0eae7984f891d2d0f8c9; jvm 1.8.0_362-b09
   [junit4]   2> 773249 INFO  (TEST-ShardSplitTest.testSplitAfterFailedSplit-seed#[F487E4BABD74F40D]) [     ] o.e.j.s.session DefaultSessionIdManager workerName=node0
   [junit4]   2> 773249 INFO  (TEST-ShardSplitTest.testSplitAfterFailedSplit-seed#[F487E4BABD74F40D]) [     ] o.e.j.s.session No SessionScavenger set, using defaults
   [junit4]   2> 773249 INFO  (TEST-ShardSplitTest.testSplitAfterFailedSplit-seed#[F487E4BABD74F40D]) [     ] o.e.j.s.session node0 Scavenging every 600000ms
   [junit4]   2> 773249 INFO  (TEST-ShardSplitTest.testSplitAfterFailedSplit-seed#[F487E4BABD74F40D]) [     ] o.e.j.s.h.ContextHandler Started o.e.j.s.ServletContextHandler@78cdda25{/p/f,null,AVAILABLE}
   [junit4]   2> 773250 INFO  (TEST-ShardSplitTest.testSplitAfterFailedSplit-seed#[F487E4BABD74F40D]) [     ] o.e.j.s.AbstractConnector Started ServerConnector@6059082e{HTTP/1.1, (http/1.1, h2c)}{127.0.0.1:39955}
   [junit4]   2> 773250 INFO  (TEST-ShardSplitTest.testSplitAfterFailedSplit-seed#[F487E4BABD74F40D]) [     ] o.e.j.s.Server Started @773281ms
   [junit4]   2> 773250 INFO  (TEST-ShardSplitTest.testSplitAfterFailedSplit-seed#[F487E4BABD74F40D]) [     ] o.a.s.c.s.e.JettySolrRunner Jetty properties: {solr.data.dir=/home/jenkins/jenkins-slave/workspace/Lucene/Lucene-Solr-Tests-8.11/solr/build/solr-core/test/J3/temp/solr.cloud.api.collections.ShardSplitTest_F487E4BABD74F40D-001/tempDir-001/control/data, hostContext=/p/f, hostPort=39955, coreRootDirectory=/home/jenkins/jenkins-slave/workspace/Lucene/Lucene-Solr-Tests-8.11/solr/build/solr-core/test/J3/temp/solr.cloud.api.collections.ShardSplitTest_F487E4BABD74F40D-001/control-001/cores}
   [junit4]   2> 773250 ERROR (TEST-ShardSplitTest.testSplitAfterFailedSplit-seed#[F487E4BABD74F40D]) [     ] o.a.s.u.StartupLoggingUtils Missing Java Option solr.log.dir. Logging may be missing or incomplete.
   [junit4]   2> 773250 INFO  (TEST-ShardSplitTest.testSplitAfterFailedSplit-seed#[F487E4BABD74F40D]) [     ] o.a.s.s.SolrDispatchFilter Using logger factory org.apache.logging.slf4j.Log4jLoggerFactory
   [junit4]   2> 773250 INFO  (TEST-ShardSplitTest.testSplitAfterFailedSplit-seed#[F487E4BABD74F40D]) [     ] o.a.s.s.SolrDispatchFilter  ___      _       Welcome to Apache Solr™ version 8.11.4
   [junit4]   2> 773250 INFO  (TEST-ShardSplitTest.testSplitAfterFailedSplit-seed#[F487E4BABD74F40D]) [     ] o.a.s.s.SolrDispatchFilter / __| ___| |_ _   Starting in cloud mode on port null
   [junit4]   2> 773250 INFO  (TEST-ShardSplitTest.testSplitAfterFailedSplit-seed#[F487E4BABD74F40D]) [     ] o.a.s.s.SolrDispatchFilter \__ \/ _ \ | '_|  Install dir: /home/jenkins/jenkins-slave/workspace/Lucene/Lucene-Solr-Tests-8.11/solr
   [junit4]   2> 773250 INFO  (TEST-ShardSplitTest.testSplitAfterFailedSplit-seed#[F487E4BABD74F40D]) [     ] o.a.s.s.SolrDispatchFilter |___/\___/_|_|    Start time: 2024-05-03T15:48:18.912Z
   [junit4]   2> 773250 DEBUG (TEST-ShardSplitTest.testSplitAfterFailedSplit-seed#[F487E4BABD74F40D]) [     ] o.a.s.c.c.SolrZkClient Using default ZkCredentialsProvider
   [junit4]   2> 773251 INFO  (TEST-ShardSplitTest.testSplitAfterFailedSplit-seed#[F487E4BABD74F40D]) [     ] o.a.s.c.c.ConnectionManager Waiting for client to connect to ZooKeeper
   [junit4]   2> 773252 DEBUG (TEST-ShardSplitTest.testSplitAfterFailedSplit-seed#[F487E4BABD74F40D]-EventThread) [     ] o.a.s.c.c.SolrZkClient Submitting job to respond to event WatchedEvent state:SyncConnected type:None path:null
   [junit4]   2> 773253 DEBUG (zkConnectionManagerCallback-6378-thread-1) [     ] o.a.s.c.c.ConnectionManager Watcher org.apache.solr.common.cloud.ConnectionManager@1d8fcc7 name: ZooKeeperConnection Watcher:127.0.0.1:44853/solr got event WatchedEvent state:SyncConnected type:None path:null path: null type: None
   [junit4]   2> 773253 INFO  (zkConnectionManagerCallback-6378-thread-1) [     ] o.a.s.c.c.ConnectionManager zkClient has connected
   [junit4]   2> 773253 INFO  (TEST-ShardSplitTest.testSplitAfterFailedSplit-seed#[F487E4BABD74F40D]) [     ] o.a.s.c.c.ConnectionManager Client is connected to ZooKeeper
   [junit4]   2> 773254 DEBUG (TEST-ShardSplitTest.testSplitAfterFailedSplit-seed#[F487E4BABD74F40D]) [     ] o.a.s.c.c.SolrZkClient Using default ZkACLProvider
   [junit4]   2> 773254 WARN  (TEST-ShardSplitTest.testSplitAfterFailedSplit-seed#[F487E4BABD74F40D]-SendThread(127.0.0.1:44853)) [     ] o.a.z.ClientCnxn An exception was thrown while closing send thread for session 0x10061a0d8710002.
   [junit4]   2>           => EndOfStreamException: Unable to read additional data from server sessionid 0x10061a0d8710002, likely server has closed socket
   [junit4]   2> 	at org.apache.zookeeper.ClientCnxnSocketNIO.doIO(ClientCnxnSocketNIO.java:77)
   [junit4]   2> org.apache.zookeeper.ClientCnxn$EndOfStreamException: Unable to read additional data from server sessionid 0x10061a0d8710002, likely server has closed socket
   [junit4]   2> 	at org.apache.zookeeper.ClientCnxnSocketNIO.doIO(ClientCnxnSocketNIO.java:77) ~[zookeeper-3.6.2.jar:3.6.2]
   [junit4]   2> 	at org.apache.zookeeper.ClientCnxnSocketNIO.doTransport(ClientCnxnSocketNIO.java:350) ~[zookeeper-3.6.2.jar:3.6.2]
   [junit4]   2> 	at org.apache.zookeeper.ClientCnxn$SendThread.run(ClientCnxn.java:1275) [zookeeper-3.6.2.jar:3.6.2]
   [junit4]   2> 773355 INFO  (TEST-ShardSplitTest.testSplitAfterFailedSplit-seed#[F487E4BABD74F40D]) [     ] o.a.s.s.SolrDispatchFilter Loading solr.xml from SolrHome (not found in ZooKeeper)
   [junit4]   2> 773355 DEBUG (TEST-ShardSplitTest.testSplitAfterFailedSplit-seed#[F487E4BABD74F40D]-EventThread) [     ] o.a.s.c.c.SolrZkClient Submitting job to respond to event WatchedEvent state:Closed type:None path:null
   [junit4]   2> 773355 INFO  (TEST-ShardSplitTest.testSplitAfterFailedSplit-seed#[F487E4BABD74F40D]) [     ] o.a.s.c.SolrXmlConfig Loading container configuration from /home/jenkins/jenkins-slave/workspace/Lucene/Lucene-Solr-Tests-8.11/solr/build/solr-core/test/J3/temp/solr.cloud.api.collections.ShardSplitTest_F487E4BABD74F40D-001/control-001/solr.xml
   [junit4]   2> 773358 INFO  (TEST-ShardSplitTest.testSplitAfterFailedSplit-seed#[F487E4BABD74F40D]) [     ] o.a.s.c.SolrXmlConfig Configuration parameter autoReplicaFailoverWorkLoopDelay is ignored
   [junit4]   2> 773358 INFO  (TEST-ShardSplitTest.testSplitAfterFailedSplit-seed#[F487E4BABD74F40D]) [     ] o.a.s.c.SolrXmlConfig Configuration parameter autoReplicaFailoverBadNodeExpiration is ignored
   [junit4]   2> 773360 INFO  (TEST-ShardSplitTest.testSplitAfterFailedSplit-seed#[F487E4BABD74F40D]) [     ] o.a.s.c.SolrXmlConfig MBean server found: com.sun.jmx.mbeanserver.JmxMBeanServer@76d4feb1, but no JMX reporters were configured - adding default JMX reporter.
   [junit4]   2> 773712 INFO  (TEST-ShardSplitTest.testSplitAfterFailedSplit-seed#[F487E4BABD74F40D]) [     ] o.a.s.h.c.HttpShardHandlerFactory Host whitelist initialized: WhitelistHostChecker [whitelistHosts=null, whitelistHostCheckingEnabled=false]
   [junit4]   2> 773713 WARN  (TEST-ShardSplitTest.testSplitAfterFailedSplit-seed#[F487E4BABD74F40D]) [     ] o.e.j.u.s.S.config Trusting all certificates configured for Client@131bca4e[provider=null,keyStore=null,trustStore=null]
   [junit4]   2> 773713 WARN  (TEST-ShardSplitTest.testSplitAfterFailedSplit-seed#[F487E4BABD74F40D]) [     ] o.e.j.u.s.S.config No Client EndPointIdentificationAlgorithm configured for Client@131bca4e[provider=null,keyStore=null,trustStore=null]
   [junit4]   2> 773716 WARN  (TEST-ShardSplitTest.testSplitAfterFailedSplit-seed#[F487E4BABD74F40D]) [     ] o.e.j.u.s.S.config Trusting all certificates configured for Client@1f317ecc[provider=null,keyStore=null,trustStore=null]
   [junit4]   2> 773716 WARN  (TEST-ShardSplitTest.testSplitAfterFailedSplit-seed#[F487E4BABD74F40D]) [     ] o.e.j.u.s.S.config No Client EndPointIdentificationAlgorithm configured for Client@1f317ecc[provider=null,keyStore=null,trustStore=null]
   [junit4]   2> 773717 INFO  (TEST-ShardSplitTest.testSplitAfterFailedSplit-seed#[F487E4BABD74F40D]) [     ] o.a.s.c.ZkContainer Zookeeper client=127.0.0.1:44853/solr
   [junit4]   2> 773717 DEBUG (TEST-ShardSplitTest.testSplitAfterFailedSplit-seed#[F487E4BABD74F40D]) [     ] o.a.s.c.c.SolrZkClient Using default ZkCredentialsProvider
   [junit4]   2> 773718 INFO  (TEST-ShardSplitTest.testSplitAfterFailedSplit-seed#[F487E4BABD74F40D]) [     ] o.a.s.c.c.ConnectionManager Waiting for client to connect to ZooKeeper
   [junit4]   2> 773719 DEBUG (TEST-ShardSplitTest.testSplitAfterFailedSplit-seed#[F487E4BABD74F40D]-EventThread) [     ] o.a.s.c.c.SolrZkClient Submitting job to respond to event WatchedEvent state:SyncConnected type:None path:null
   [junit4]   2> 773719 DEBUG (zkConnectionManagerCallback-6389-thread-1) [     ] o.a.s.c.c.ConnectionManager Watcher org.apache.solr.common.cloud.ConnectionManager@2d8c236b name: ZooKeeperConnection Watcher:127.0.0.1:44853 got event WatchedEvent state:SyncConnected type:None path:null path: null type: None
   [junit4]   2> 773719 INFO  (zkConnectionManagerCallback-6389-thread-1) [     ] o.a.s.c.c.ConnectionManager zkClient has connected
   [junit4]   2> 773719 INFO  (TEST-ShardSplitTest.testSplitAfterFailedSplit-seed#[F487E4BABD74F40D]) [     ] o.a.s.c.c.ConnectionManager Client is connected to ZooKeeper
   [junit4]   2> 773719 DEBUG (TEST-ShardSplitTest.testSplitAfterFailedSplit-seed#[F487E4BABD74F40D]) [     ] o.a.s.c.c.SolrZkClient Using default ZkACLProvider
   [junit4]   2> 773820 DEBUG (TEST-ShardSplitTest.testSplitAfterFailedSplit-seed#[F487E4BABD74F40D]-EventThread) [     ] o.a.s.c.c.SolrZkClient Submitting job to respond to event WatchedEvent state:Closed type:None path:null
   [junit4]   2> 773821 INFO  (TEST-ShardSplitTest.testSplitAfterFailedSplit-seed#[F487E4BABD74F40D]) [n:127.0.0.1:39955_p%2Ff     ] o.a.s.c.c.ConnectionManager Waiting for client to connect to ZooKeeper
   [junit4]   2> 773822 DEBUG (TEST-ShardSplitTest.testSplitAfterFailedSplit-seed#[F487E4BABD74F40D]-EventThread) [     ] o.a.s.c.c.SolrZkClient Submitting job to respond to event WatchedEvent state:SyncConnected type:None path:null
   [junit4]   2> 773822 DEBUG (zkConnectionManagerCallback-6391-thread-1) [     ] o.a.s.c.c.ConnectionManager Watcher org.apache.solr.common.cloud.ConnectionManager@5f2e6051 name: ZooKeeperConnection Watcher:127.0.0.1:44853/solr got event WatchedEvent state:SyncConnected type:None path:null path: null type: None
   [junit4]   2> 773822 INFO  (zkConnectionManagerCallback-6391-thread-1) [     ] o.a.s.c.c.ConnectionManager zkClient has connected
   [junit4]   2> 773822 INFO  (TEST-ShardSplitTest.testSplitAfterFailedSplit-seed#[F487E4BABD74F40D]) [n:127.0.0.1:39955_p%2Ff     ] o.a.s.c.c.ConnectionManager Client is connected to ZooKeeper
   [junit4]   2> 773823 DEBUG (TEST-ShardSplitTest.testSplitAfterFailedSplit-seed#[F487E4BABD74F40D]) [n:127.0.0.1:39955_p%2Ff     ] o.a.s.c.c.SolrZkClient makePath: /overseer/collection-map-running
   [junit4]   2> 773824 DEBUG (TEST-ShardSplitTest.testSplitAfterFailedSplit-seed#[F487E4BABD74F40D]) [n:127.0.0.1:39955_p%2Ff     ] o.a.s.c.c.SolrZkClient makePath: /overseer/collection-map-completed
   [junit4]   2> 773824 DEBUG (TEST-ShardSplitTest.testSplitAfterFailedSplit-seed#[F487E4BABD74F40D]) [n:127.0.0.1:39955_p%2Ff     ] o.a.s.c.c.SolrZkClient makePath: /overseer/collection-map-failure
   [junit4]   2> 773825 DEBUG (TEST-ShardSplitTest.testSplitAfterFailedSplit-seed#[F487E4BABD74F40D]) [n:127.0.0.1:39955_p%2Ff     ] o.a.s.c.c.SolrZkClient makePath: /overseer/async_ids
   [junit4]   2> 773826 DEBUG (TEST-ShardSplitTest.testSplitAfterFailedSplit-seed#[F487E4BABD74F40D]) [n:127.0.0.1:39955_p%2Ff     ] o.a.s.c.c.SolrZkClient makePath: /live_nodes
   [junit4]   2> 773827 DEBUG (TEST-ShardSplitTest.testSplitAfterFailedSplit-seed#[F487E4BABD74F40D]) [n:127.0.0.1:39955_p%2Ff     ] o.a.s.c.c.SolrZkClient makePath: /node_roles
   [junit4]   2> 773827 DEBUG (TEST-ShardSplitTest.testSplitAfterFailedSplit-seed#[F487E4BABD74F40D]) [n:127.0.0.1:39955_p%2Ff     ] o.a.s.c.c.SolrZkClient makePath: /node_roles/data
   [junit4]   2> 773828 DEBUG (TEST-ShardSplitTest.testSplitAfterFailedSplit-seed#[F487E4BABD74F40D]) [n:127.0.0.1:39955_p%2Ff     ] o.a.s.c.c.SolrZkClient makePath: /node_roles/data/on
   [junit4]   2> 773829 DEBUG (TEST-ShardSplitTest.testSplitAfterFailedSplit-seed#[F487E4BABD74F40D]) [n:127.0.0.1:39955_p%2Ff     ] o.a.s.c.c.SolrZkClient makePath: /node_roles/data/off
   [junit4]   2> 773830 DEBUG (TEST-ShardSplitTest.testSplitAfterFailedSplit-seed#[F487E4BABD74F40D]) [n:127.0.0.1:39955_p%2Ff     ] o.a.s.c.c.SolrZkClient makePath: /node_roles/overseer
   [junit4]   2> 773831 DEBUG (TEST-ShardSplitTest.testSplitAfterFailedSplit-seed#[F487E4BABD74F40D]) [n:127.0.0.1:39955_p%2Ff     ] o.a.s.c.c.SolrZkClient makePath: /node_roles/overseer/allowed
   [junit4]   2> 773832 DEBUG (TEST-ShardSplitTest.testSplitAfterFailedSplit-seed#[F487E4BABD74F40D]) [n:127.0.0.1:39955_p%2Ff     ] o.a.s.c.c.SolrZkClient makePath: /node_roles/overseer/preferred
   [junit4]   2> 773833 DEBUG (TEST-ShardSplitTest.testSplitAfterFailedSplit-seed#[F487E4BABD74F40D]) [n:127.0.0.1:39955_p%2Ff     ] o.a.s.c.c.SolrZkClient makePath: /node_roles/overseer/disallowed
   [junit4]   2> 773834 DEBUG (TEST-ShardSplitTest.testSplitAfterFailedSplit-seed#[F487E4BABD74F40D]) [n:127.0.0.1:39955_p%2Ff     ] o.a.s.c.c.SolrZkClient makePath: /node_roles/coordinator
   [junit4]   2> 773835 DEBUG (TEST-ShardSplitTest.testSplitAfterFailedSplit-seed#[F487E4BABD74F40D]) [n:127.0.0.1:39955_p%2Ff     ] o.a.s.c.c.SolrZkClient makePath: /node_roles/coordinator/on
   [junit4]   2> 773836 DEBUG (TEST-ShardSplitTest.testSplitAfterFailedSplit-seed#[F487E4BABD74F40D]) [n:127.0.0.1:39955_p%2Ff     ] o.a.s.c.c.SolrZkClient makePath: /node_roles/coordinator/off
   [junit4]   2> 773837 DEBUG (TEST-ShardSplitTest.testSplitAfterFailedSplit-seed#[F487E4BABD74F40D]) [n:127.0.0.1:39955_p%2Ff     ] o.a.s.c.c.SolrZkClient makePath: /aliases.json
   [junit4]   2> 773838 DEBUG (TEST-ShardSplitTest.testSplitAfterFailedSplit-seed#[F487E4BABD74F40D]) [n:127.0.0.1:39955_p%2Ff     ] o.a.s.c.c.SolrZkClient makePath: /autoscaling/events
   [junit4]   2> 773839 DEBUG (TEST-ShardSplitTest.testSplitAfterFailedSplit-seed#[F487E4BABD74F40D]) [n:127.0.0.1:39955_p%2Ff     ] o.a.s.c.c.SolrZkClient makePath: /autoscaling/triggerState
   [junit4]   2> 773839 DEBUG (TEST-ShardSplitTest.testSplitAfterFailedSplit-seed#[F487E4BABD74F40D]) [n:127.0.0.1:39955_p%2Ff     ] o.a.s.c.c.SolrZkClient makePath: /autoscaling/nodeAdded
   [junit4]   2> 773840 DEBUG (TEST-ShardSplitTest.testSplitAfterFailedSplit-seed#[F487E4BABD74F40D]) [n:127.0.0.1:39955_p%2Ff     ] o.a.s.c.c.SolrZkClient makePath: /autoscaling/nodeLost
   [junit4]   2> 773841 DEBUG (TEST-ShardSplitTest.testSplitAfterFailedSplit-seed#[F487E4BABD74F40D]) [n:127.0.0.1:39955_p%2Ff     ] o.a.s.c.c.SolrZkClient makePath: /clusterstate.json
   [junit4]   2> 773842 DEBUG (TEST-ShardSplitTest.testSplitAfterFailedSplit-seed#[F487E4BABD74F40D]) [n:127.0.0.1:39955_p%2Ff     ] o.a.s.c.c.SolrZkClient makePath: /autoscaling.json
   [junit4]   2> 773842 DEBUG (TEST-ShardSplitTest.testSplitAfterFailedSplit-seed#[F487E4BABD74F40D]) [n:127.0.0.1:39955_p%2Ff     ] o.a.s.c.c.SolrZkClient makePath: /security.json
   [junit4]   2> 773843 DEBUG (TEST-ShardSplitTest.testSplitAfterFailedSplit-seed#[F487E4BABD74F40D]) [n:127.0.0.1:39955_p%2Ff     ] o.a.s.c.c.SolrZkClient makePath: /configs/_default/protwords.txt
   [junit4]   2> 773844 DEBUG (TEST-ShardSplitTest.testSplitAfterFailedSplit-seed#[F487E4BABD74F40D]) [n:127.0.0.1:39955_p%2Ff     ] o.a.s.c.c.SolrZkClient makePath: /configs/_default/managed-schema
   [junit4]   2> 773846 DEBUG (TEST-ShardSplitTest.testSplitAfterFailedSplit-seed#[F487E4BABD74F40D]) [n:127.0.0.1:39955_p%2Ff     ] o.a.s.c.c.SolrZkClient makePath: /configs/_default/solrconfig.xml
   [junit4]   2> 773847 DEBUG (TEST-ShardSplitTest.testSplitAfterFailedSplit-seed#[F487E4BABD74F40D]) [n:127.0.0.1:39955_p%2Ff     ] o.a.s.c.c.SolrZkClient makePath: /configs/_default/synonyms.txt
   [junit4]   2> 773848 DEBUG (TEST-ShardSplitTest.testSplitAfterFailedSplit-seed#[F487E4BABD74F40D]) [n:127.0.0.1:39955_p%2Ff     ] o.a.s.c.c.SolrZkClient makePath: /configs/_default/lang/stopwords_it.txt
   [junit4]   2> 773850 DEBUG (TEST-ShardSplitTest.testSplitAfterFailedSplit-seed#[F487E4BABD74F40D]) [n:127.0.0.1:39955_p%2Ff     ] o.a.s.c.c.SolrZkClient makePath: /configs/_default/lang/stopwords_cz.txt
   [junit4]   2> 773851 DEBUG (TEST-ShardSplitTest.testSplitAfterFailedSplit-seed#[F487E4BABD74F40D]) [n:127.0.0.1:39955_p%2Ff     ] o.a.s.c.c.SolrZkClient makePath: /configs/_default/lang/stopwords_fr.txt
   [junit4]   2> 773852 DEBUG (TEST-ShardSplitTest.testSplitAfterFailedSplit-seed#[F487E4BABD74F40D]) [n:127.0.0.1:39955_p%2Ff     ] o.a.s.c.c.SolrZkClient makePath: /configs/_default/lang/stopwords_no.txt
   [junit4]   2> 773853 DEBUG (TEST-ShardSplitTest.testSplitAfterFailedSplit-seed#[F487E4BABD74F40D]) [n:127.0.0.1:39955_p%2Ff     ] o.a.s.c.c.SolrZkClient makePath: /configs/_default/lang/contractions_ca.txt
   [junit4]   2> 773854 DEBUG (TEST-ShardSplitTest.testSplitAfterFailedSplit-seed#[F487E4BABD74F40D]) [n:127.0.0.1:39955_p%2Ff     ] o.a.s.c.c.SolrZkClient makePath: /configs/_default/lang/stopwords_sv.txt
   [junit4]   2> 773856 DEBUG (TEST-ShardSplitTest.testSplitAfterFailedSplit-seed#[F487E4BABD74F40D]) [n:127.0.0.1:39955_p%2Ff     ] o.a.s.c.c.SolrZkClient makePath: /configs/_default/lang/stopwords_ca.txt
   [junit4]   2> 773857 DEBUG (TEST-ShardSplitTest.testSplitAfterFailedSplit-seed#[F487E4BABD74F40D]) [n:127.0.0.1:39955_p%2Ff     ] o.a.s.c.c.SolrZkClient makePath: /configs/_default/lang/stopwords_hu.txt
   [junit4]   2> 773858 DEBUG (TEST-ShardSplitTest.testSplitAfterFailedSplit-seed#[F487E4BABD74F40D]) [n:127.0.0.1:39955_p%2Ff     ] o.a.s.c.c.SolrZkClient makePath: /configs/_default/lang/stopwords_gl.txt
   [junit4]   2> 773859 DEBUG (TEST-ShardSplitTest.testSplitAfterFailedSplit-seed#[F487E4BABD74F40D]) [n:127.0.0.1:39955_p%2Ff     ] o.a.s.c.c.SolrZkClient makePath: /configs/_default/lang/stopwords_bg.txt
   [junit4]   2> 773860 DEBUG (TEST-ShardSplitTest.testSplitAfterFailedSplit-seed#[F487E4BABD74F40D]) [n:127.0.0.1:39955_p%2Ff     ] o.a.s.c.c.SolrZkClient makePath: /configs/_default/lang/stopwords_th.txt
   [junit4]   2> 773861 DEBUG (TEST-ShardSplitTest.testSplitAfterFailedSplit-seed#[F487E4BABD74F40D]) [n:127.0.0.1:39955_p%2Ff     ] o.a.s.c.c.SolrZkClient makePath: /configs/_default/lang/stopwords_ga.txt
   [junit4]   2> 773863 DEBUG (TEST-ShardSplitTest.testSplitAfterFailedSplit-seed#[F487E4BABD74F40D]) [n:127.0.0.1:39955_p%2Ff     ] o.a.s.c.c.SolrZkClient makePath: /configs/_default/lang/stopwords_da.txt
   [junit4]   2> 773864 DEBUG (TEST-ShardSplitTest.testSplitAfterFailedSplit-seed#[F487E4BABD74F40D]) [n:127.0.0.1:39955_p%2Ff     ] o.a.s.c.c.SolrZkClient makePath: /configs/_default/lang/stopwords_et.txt
   [junit4]   2> 773865 DEBUG (TEST-ShardSplitTest.testSplitAfterFailedSplit-seed#[F487E4BABD74F40D]) [n:127.0.0.1:39955_p%2Ff     ] o.a.s.c.c.SolrZkClient makePath: /configs/_default/lang/userdict_ja.txt
   [junit4]   2> 773866 DEBUG (TEST-ShardSplitTest.testSplitAfterFailedSplit-seed#[F487E4BABD74F40D]) [n:127.0.0.1:39955_p%2Ff     ] o.a.s.c.c.SolrZkClient makePath: /configs/_default/lang/contractions_ga.txt
   [junit4]   2> 773867 DEBUG (TEST-ShardSplitTest.testSplitAfterFailedSplit-seed#[F487E4BABD74F40D]) [n:127.0.0.1:39955_p%2Ff     ] o.a.s.c.c.SolrZkClient makePath: /configs/_default/lang/stopwords_id.txt
   [junit4]   2> 773868 DEBUG (TEST-ShardSplitTest.testSplitAfterFailedSplit-seed#[F487E4BABD74F40D]) [n:127.0.0.1:39955_p%2Ff     ] o.a.s.c.c.SolrZkClient makePath: /configs/_default/lang/stopwords_tr.txt
   [junit4]   2> 773869 DEBUG (TEST-ShardSplitTest.testSplitAfterFailedSplit-seed#[F487E4BABD74F40D]) [n:127.0.0.1:39955_p%2Ff     ] o.a.s.c.c.SolrZkClient makePath: /configs/_default/lang/stopwords_ja.txt
   [junit4]   2> 773871 DEBUG (TEST-ShardSplitTest.testSplitAfterFailedSplit-seed#[F487E4BABD74F40D]) [n:127.0.0.1:39955_p%2Ff     ] o.a.s.c.c.SolrZkClient makePath: /configs/_default/lang/stopwords_ar.txt
   [junit4]   2> 773872 DEBUG (TEST-ShardSplitTest.testSplitAfterFailedSplit-seed#[F487E4BABD74F40D]) [n:127.0.0.1:39955_p%2Ff     ] o.a.s.c.c.SolrZkClient makePath: /configs/_default/lang/stopwords_ru.txt
   [junit4]   2> 773873 DEBUG (TEST-ShardSplitTest.testSplitAfterFailedSplit-seed#[F487E4BABD74F40D]) [n:127.0.0.1:39955_p%2Ff     ] o.a.s.c.c.SolrZkClient makePath: /configs/_default/lang/hyphenations_ga.txt
   [junit4]   2> 773874 DEBUG (TEST-ShardSplitTest.testSplitAfterFailedSplit-seed#[F487E4BABD74F40D]) [n:127.0.0.1:39955_p%2Ff     ] o.a.s.c.c.SolrZkClient makePath: /configs/_default/lang/stopwords_de.txt
   [junit4]   2> 773875 DEBUG (TEST-ShardSplitTest.testSplitAfterFailedSplit-seed#[F487E4BABD74F40D]) [n:127.0.0.1:39955_p%2Ff     ] o.a.s.c.c.SolrZkClient makePath: /configs/_default/lang/stopwords_en.txt
   [junit4]   2> 773876 DEBUG (TEST-ShardSplitTest.testSplitAfterFailedSplit-seed#[F487E4BABD74F40D]) [n:127.0.0.1:39955_p%2Ff     ] o.a.s.c.c.SolrZkClient makePath: /configs/_default/lang/stemdict_nl.txt
   [junit4]   2> 773878 DEBUG (TEST-ShardSplitTest.testSplitAfterFailedSplit-seed#[F487E4BABD74F40D]) [n:127.0.0.1:39955_p%2Ff     ] o.a.s.c.c.SolrZkClient makePath: /configs/_default/lang/stopwords_ro.txt
   [junit4]   2> 773879 DEBUG (TEST-ShardSplitTest.testSplitAfterFailedSplit-seed#[F487E4BABD74F40D]) [n:127.0.0.1:39955_p%2Ff     ] o.a.s.c.c.SolrZkClient makePath: /configs/_default/lang/stopwords_hy.txt
   [junit4]   2> 773880 DEBUG (TEST-ShardSplitTest.testSplitAfterFailedSplit-seed#[F487E4BABD74F40D]) [n:127.0.0.1:39955_p%2Ff     ] o.a.s.c.c.SolrZkClient makePath: /configs/_default/lang/stopwords_eu.txt
   [junit4]   2> 773881 DEBUG (TEST-ShardSplitTest.testSplitAfterFailedSplit-seed#[F487E4BABD74F40D]) [n:127.0.0.1:39955_p%2Ff     ] o.a.s.c.c.SolrZkClient makePath: /configs/_default/lang/stopwords_hi.txt
   [junit4]   2> 773882 DEBUG (TEST-ShardSplitTest.testSplitAfterFailedSplit-seed#[F487E4BABD74F40D]) [n:127.0.0.1:39955_p%2Ff     ] o.a.s.c.c.SolrZkClient makePath: /configs/_default/lang/stoptags_ja.txt
   [junit4]   2> 773883 DEBUG (TEST-ShardSplitTest.testSplitAfterFailedSplit-seed#[F487E4BABD74F40D]) [n:127.0.0.1:39955_p%2Ff     ] o.a.s.c.c.SolrZkClient makePath: /configs/_default/lang/contractions_fr.txt
   [junit4]   2> 773884 DEBUG (TEST-ShardSplitTest.testSplitAfterFailedSplit-seed#[F487E4BABD74F40D]) [n:127.0.0.1:39955_p%2Ff     ] o.a.s.c.c.SolrZkClient makePath: /configs/_default/lang/stopwords_fi.txt
   [junit4]   2> 773886 DEBUG (TEST-ShardSplitTest.testSplitAfterFailedSplit-seed#[F487E4BABD74F40D]) [n:127.0.0.1:39955_p%2Ff     ] o.a.s.c.c.SolrZkClient makePath: /configs/_default/lang/stopwords_pt.txt
   [junit4]   2> 773887 DEBUG (TEST-ShardSplitTest.testSplitAfterFailedSplit-seed#[F487E4BABD74F40D]) [n:127.0.0.1:39955_p%2Ff     ] o.a.s.c.c.SolrZkClient makePath: /configs/_default/lang/stopwords_lv.txt
   [junit4]   2> 773888 DEBUG (TEST-ShardSplitTest.testSplitAfterFailedSplit-seed#[F487E4BABD74F40D]) [n:127.0.0.1:39955_p%2Ff     ] o.a.s.c.c.SolrZkClient makePath: /configs/_default/lang/stopwords_el.txt
   [junit4]   2> 773889 DEBUG (TEST-ShardSplitTest.testSplitAfterFailedSplit-seed#[F487E4BABD74F40D]) [n:127.0.0.1:39955_p%2Ff     ] o.a.s.c.c.SolrZkClient makePath: /configs/_default/lang/contractions_it.txt
   [junit4]   2> 773891 DEBUG (TEST-ShardSplitTest.testSplitAfterFailedSplit-seed#[F487E4BABD74F40D]) [n:127.0.0.1:39955_p%2Ff     ] o.a.s.c.c.SolrZkClient makePath: /configs/_default/lang/stopwords_nl.txt
   [junit4]   2> 773892 DEBUG (TEST-ShardSplitTest.testSplitAfterFailedSplit-seed#[F487E4BABD74F40D]) [n:127.0.0.1:39955_p%2Ff     ] o.a.s.c.c.SolrZkClient makePath: /configs/_default/lang/stopwords_es.txt
   [junit4]   2> 773893 DEBUG (TEST-ShardSplitTest.testSplitAfterFailedSplit-seed#[F487E4BABD74F40D]) [n:127.0.0.1:39955_p%2Ff     ] o.a.s.c.c.SolrZkClient makePath: /configs/_default/lang/stopwords_fa.txt
   [junit4]   2> 773894 DEBUG (TEST-ShardSplitTest.testSplitAfterFailedSplit-seed#[F487E4BABD74F40D]) [n:127.0.0.1:39955_p%2Ff     ] o.a.s.c.c.SolrZkClient makePath: /configs/_default/stopwords.txt
   [junit4]   2> 773895 WARN  (TEST-ShardSplitTest.testSplitAfterFailedSplit-seed#[F487E4BABD74F40D]) [n:127.0.0.1:39955_p%2Ff     ] o.a.s.c.ZkController Contents of zookeeper /security.json are world-readable; consider setting up ACLs as described in https://solr.apache.org/guide/zookeeper-access-control.html
   [junit4]   2> 773895 DEBUG (TEST-ShardSplitTest.testSplitAfterFailedSplit-seed#[F487E4BABD74F40D]) [n:127.0.0.1:39955_p%2Ff     ] o.a.s.c.c.ZkStateReader Updating cluster state from ZooKeeper... 
   [junit4]   2> 773896 DEBUG (TEST-ShardSplitTest.testSplitAfterFailedSplit-seed#[F487E4BABD74F40D]) [n:127.0.0.1:39955_p%2Ff     ] o.a.s.c.c.ZkStateReader Loaded cluster properties: {legacyCloud=true}
   [junit4]   2> 773896 DEBUG (TEST-ShardSplitTest.testSplitAfterFailedSplit-seed#[F487E4BABD74F40D]) [n:127.0.0.1:39955_p%2Ff     ] o.a.s.c.c.ZkStateReader Updated live nodes from ZooKeeper... [] -> []
   [junit4]   2> 773896 DEBUG (TEST-ShardSplitTest.testSplitAfterFailedSplit-seed#[F487E4BABD74F40D]) [n:127.0.0.1:39955_p%2Ff     ] o.a.s.c.c.ZkStateReader clusterStateSet: legacy [0] interesting [0] watched [0] lazy [2] total [2]
   [junit4]   2> 773897 DEBUG (TEST-ShardSplitTest.testSplitAfterFailedSplit-seed#[F487E4BABD74F40D]) [n:127.0.0.1:39955_p%2Ff     ] o.a.s.c.c.ZkStateReader$AliasesManager Checking ZK for most up to date Aliases /aliases.json
   [junit4]   2> 773897 DEBUG (TEST-ShardSplitTest.testSplitAfterFailedSplit-seed#[F487E4BABD74F40D]) [n:127.0.0.1:39955_p%2Ff     ] o.a.s.c.c.ZkStateReader$AliasesManager Aliases: cmp=-1, new definition is: Aliases{collectionAliases={}, collectionAliasProperties={}, zNodeVersion=0}
   [junit4]   2> 773898 DEBUG (TEST-ShardSplitTest.testSplitAfterFailedSplit-seed#[F487E4BABD74F40D]) [n:127.0.0.1:39955_p%2Ff     ] o.a.s.c.c.SolrZkClient makePath: /overseer_elect
   [junit4]   2> 773899 DEBUG (TEST-ShardSplitTest.testSplitAfterFailedSplit-seed#[F487E4BABD74F40D]) [n:127.0.0.1:39955_p%2Ff     ] o.a.s.c.c.SolrZkClient makePath: /overseer_elect/election
   [junit4]   2> 773900 INFO  (TEST-ShardSplitTest.testSplitAfterFailedSplit-seed#[F487E4BABD74F40D]) [n:127.0.0.1:39955_p%2Ff     ] o.a.s.c.OverseerElectionContext I am going to be the leader 127.0.0.1:39955_p%2Ff
   [junit4]   2> 773900 DEBUG (TEST-ShardSplitTest.testSplitAfterFailedSplit-seed#[F487E4BABD74F40D]) [n:127.0.0.1:39955_p%2Ff     ] o.a.s.c.c.SolrZkClient makePath: /overseer_elect/leader
   [junit4]   2> 773900 INFO  (TEST-ShardSplitTest.testSplitAfterFailedSplit-seed#[F487E4BABD74F40D]) [n:127.0.0.1:39955_p%2Ff     ] o.a.s.c.Overseer Overseer (id=72164937491873796-127.0.0.1:39955_p%2Ff-n_0000000000) starting
   [junit4]   2> 773901 DEBUG (TEST-ShardSplitTest.testSplitAfterFailedSplit-seed#[F487E4BABD74F40D]) [n:127.0.0.1:39955_p%2Ff     ] o.a.s.c.c.SolrZkClient makePath: /overseer/queue
   [junit4]   2> 773902 DEBUG (TEST-ShardSplitTest.testSplitAfterFailedSplit-seed#[F487E4BABD74F40D]) [n:127.0.0.1:39955_p%2Ff     ] o.a.s.c.c.SolrZkClient makePath: /overseer/queue-work
   [junit4]   2> 773903 DEBUG (TEST-ShardSplitTest.testSplitAfterFailedSplit-seed#[F487E4BABD74F40D]) [n:127.0.0.1:39955_p%2Ff     ] o.a.s.c.c.SolrZkClient makePath: /overseer/collection-queue-work
   [junit4]   2> 773905 DEBUG (OverseerCollectionConfigSetProcessor-72164937491873796-127.0.0.1:39955_p%2Ff-n_0000000000) [n:127.0.0.1:39955_p%2Ff     ] o.a.s.c.OverseerTaskProcessor Process current queue of overseer operations
   [junit4]   2> 773905 INFO  (TEST-ShardSplitTest.testSplitAfterFailedSplit-seed#[F487E4BABD74F40D]) [n:127.0.0.1:39955_p%2Ff     ] o.a.s.c.ZkController Register node as live in ZooKeeper:/live_nodes/127.0.0.1:39955_p%2Ff
   [junit4]   2> 773905 INFO  (OverseerStateUpdate-72164937491873796-127.0.0.1:39955_p%2Ff-n_0000000000) [n:127.0.0.1:39955_p%2Ff     ] o.a.s.c.Overseer Starting to work on the main queue : 127.0.0.1:39955_p%2Ff
   [junit4]   2> 773906 DEBUG (TEST-ShardSplitTest.testSplitAfterFailedSplit-seed#[F487E4BABD74F40D]-EventThread) [     ] o.a.s.c.c.SolrZkClient Submitting job to respond to event WatchedEvent state:SyncConnected type:NodeChildrenChanged path:/live_nodes
   [junit4]   2> 773906 DEBUG (OverseerCollectionConfigSetProcessor-72164937491873796-127.0.0.1:39955_p%2Ff-n_0000000000) [n:127.0.0.1:39955_p%2Ff     ] o.a.s.c.OverseerTaskProcessor Cleaning up work-queue. #Running tasks: 0 #Completed tasks: 0
   [junit4]   2> 773906 DEBUG (OverseerCollectionConfigSetProcessor-72164937491873796-127.0.0.1:39955_p%2Ff-n_0000000000) [n:127.0.0.1:39955_p%2Ff     ] o.a.s.c.OverseerTaskProcessor RunningTasks: []
   [junit4]   2> 773906 DEBUG (OverseerCollectionConfigSetProcessor-72164937491873796-127.0.0.1:39955_p%2Ff-n_0000000000) [n:127.0.0.1:39955_p%2Ff     ] o.a.s.c.OverseerTaskProcessor BlockedTasks: []
   [junit4]   2> 773907 DEBUG (OverseerCollectionConfigSetProcessor-72164937491873796-127.0.0.1:39955_p%2Ff-n_0000000000) [n:127.0.0.1:39955_p%2Ff     ] o.a.s.c.OverseerTaskProcessor CompletedTasks: []
   [junit4]   2> 773907 INFO  (OverseerCollectionConfigSetProcessor-72164937491873796-127.0.0.1:39955_p%2Ff-n_0000000000) [n:127.0.0.1:39955_p%2Ff     ] o.a.s.c.OverseerTaskProcessor RunningZKTasks: []
   [junit4]   2> 773907 DEBUG (zkCallback-6390-thread-1) [     ] o.a.s.c.c.ZkStateReader A live node change: [WatchedEvent state:SyncConnected type:NodeChildrenChanged path:/live_nodes], has occurred - updating... (live nodes size: [0])
   [junit4]   2> 773907 INFO  (OverseerStateUpdate-72164937491873796-127.0.0.1:39955_p%2Ff-n_0000000000) [n:127.0.0.1:39955_p%2Ff     ] o.a.s.c.c.ZkStateReader Updated live nodes from ZooKeeper... (0) -> (1)
   [junit4]   2> 773907 DEBUG (OverseerStateUpdate-72164937491873796-127.0.0.1:39955_p%2Ff-n_0000000000) [n:127.0.0.1:39955_p%2Ff     ] o.a.s.c.c.ZkStateReader Updated live nodes from ZooKeeper... [] -> [127.0.0.1:39955_p%2Ff]
   [junit4]   2> 773908 DEBUG (OverseerStateUpdate-72164937491873796-127.0.0.1:39955_p%2Ff-n_0000000000) [n:127.0.0.1:39955_p%2Ff     ] o.a.s.c.c.ZkStateReader clusterStateSet: legacy [0] interesting [0] watched [0] lazy [2] total [2]
   [junit4]   2> 773908 DEBUG (zkCallback-6390-thread-1) [     ] o.a.s.c.c.ZkStateReader Updated live nodes from ZooKeeper... [127.0.0.1:39955_p%2Ff] -> [127.0.0.1:39955_p%2Ff]
   [junit4]   2> 773908 INFO  (TEST-ShardSplitTest.testSplitAfterFailedSplit-seed#[F487E4BABD74F40D]) [n:127.0.0.1:39955_p%2Ff     ] o.a.s.c.ZkController non-data nodes now []
   [junit4]   2> 773909 DEBUG (OverseerAutoScalingTriggerThread-72164937491873796-127.0.0.1:39955_p%2Ff-n_0000000000) [     ] o.a.s.c.c.SolrZkClient makePath: /autoscaling/events/.scheduled_maintenance
   [junit4]   2> 773910 INFO  (TEST-ShardSplitTest.testSplitAfterFailedSplit-seed#[F487E4BABD74F40D]) [n:127.0.0.1:39955_p%2Ff     ] o.a.s.p.PackageLoader /packages.json updated to version -1
   [junit4]   2> 773910 WARN  (TEST-ShardSplitTest.testSplitAfterFailedSplit-seed#[F487E4BABD74F40D]) [n:127.0.0.1:39955_p%2Ff     ] o.a.s.c.CoreContainer Not all security plugins configured!  authentication=disabled authorization=disabled.  Solr is only as secure as you make it. Consider configuring authentication/authorization before exposing Solr to users internal or external.  See https://s.apache.org/solrsecurity for more info
   [junit4]   2> 773916 DEBUG (OverseerAutoScalingTriggerThread-72164937491873796-127.0.0.1:39955_p%2Ff-n_0000000000) [     ] o.a.s.c.c.SolrZkClient makePath: /autoscaling/events/.auto_add_replicas
   [junit4]   2> 773938 INFO  (TEST-ShardSplitTest.testSplitAfterFailedSplit-seed#[F487E4BABD74F40D]) [n:127.0.0.1:39955_p%2Ff     ] o.a.s.h.a.MetricsHistoryHandler No .system collection, keeping metrics history in memory.
   [junit4]   2> 773958 INFO  (TEST-ShardSplitTest.testSplitAfterFailedSplit-seed#[F487E4BABD74F40D]) [n:127.0.0.1:39955_p%2Ff     ] o.a.s.m.r.SolrJmxReporter JMX monitoring for 'solr.node' (registry 'solr.node') enabled at server: com.sun.jmx.mbeanserver.JmxMBeanServer@76d4feb1
   [junit4]   2> 773965 INFO  (TEST-ShardSplitTest.testSplitAfterFailedSplit-seed#[F487E4BABD74F40D]) [n:127.0.0.1:39955_p%2Ff     ] o.a.s.m.r.SolrJmxReporter JMX monitoring for 'solr.jvm' (registry 'solr.jvm') enabled at server: com.sun.jmx.mbeanserver.JmxMBeanServer@76d4feb1
   [junit4]   2> 773965 INFO  (TEST-ShardSplitTest.testSplitAfterFailedSplit-seed#[F487E4BABD74F40D]) [n:127.0.0.1:39955_p%2Ff     ] o.a.s.m.r.SolrJmxReporter JMX monitoring for 'solr.jetty' (registry 'solr.jetty') enabled at server: com.sun.jmx.mbeanserver.JmxMBeanServer@76d4feb1
   [junit4]   2> 773966 INFO  (TEST-ShardSplitTest.testSplitAfterFailedSplit-seed#[F487E4BABD74F40D]) [n:127.0.0.1:39955_p%2Ff     ] o.a.s.c.CorePropertiesLocator Found 0 core definitions underneath /home/jenkins/jenkins-slave/workspace/Lucene/Lucene-Solr-Tests-8.11/solr/build/solr-core/test/J3/temp/solr.cloud.api.collections.ShardSplitTest_F487E4BABD74F40D-001/control-001/cores
   [junit4]   2> 773982 DEBUG (TEST-ShardSplitTest.testSplitAfterFailedSplit-seed#[F487E4BABD74F40D]) [     ] o.a.s.c.c.SolrZkClient Using default ZkCredentialsProvider
   [junit4]   2> 773983 INFO  (TEST-ShardSplitTest.testSplitAfterFailedSplit-seed#[F487E4BABD74F40D]) [     ] o.a.s.c.c.ConnectionManager Waiting for client to connect to ZooKeeper
   [junit4]   2> 773983 DEBUG (TEST-ShardSplitTest.testSplitAfterFailedSplit-seed#[F487E4BABD74F40D]-EventThread) [     ] o.a.s.c.c.SolrZkClient Submitting job to respond to event WatchedEvent state:SyncConnected type:None path:null
   [junit4]   2> 773983 DEBUG (zkConnectionManagerCallback-6408-thread-1) [     ] o.a.s.c.c.ConnectionManager Watcher org.apache.solr.common.cloud.ConnectionManager@4805a108 name: ZooKeeperConnection Watcher:127.0.0.1:44853/solr got event WatchedEvent state:SyncConnected type:None path:null path: null type: None
   [junit4]   2> 773983 INFO  (zkConnectionManagerCallback-6408-thread-1) [     ] o.a.s.c.c.ConnectionManager zkClient has connected
   [junit4]   2> 773983 INFO  (TEST-ShardSplitTest.testSplitAfterFailedSplit-seed#[F487E4BABD74F40D]) [     ] o.a.s.c.c.ConnectionManager Client is connected to ZooKeeper
   [junit4]   2> 773984 DEBUG (TEST-ShardSplitTest.testSplitAfterFailedSplit-seed#[F487E4BABD74F40D]) [     ] o.a.s.c.c.SolrZkClient Using default ZkACLProvider
   [junit4]   2> 773984 DEBUG (TEST-ShardSplitTest.testSplitAfterFailedSplit-seed#[F487E4BABD74F40D]) [     ] o.a.s.c.c.ZkStateReader Updating cluster state from ZooKeeper... 
   [junit4]   2> 773984 DEBUG (TEST-ShardSplitTest.testSplitAfterFailedSplit-seed#[F487E4BABD74F40D]) [     ] o.a.s.c.c.ZkStateReader Loaded cluster properties: {legacyCloud=true}
   [junit4]   2> 773985 INFO  (TEST-ShardSplitTest.testSplitAfterFailedSplit-seed#[F487E4BABD74F40D]) [     ] o.a.s.c.c.ZkStateReader Updated live nodes from ZooKeeper... (0) -> (1)
   [junit4]   2> 773985 DEBUG (TEST-ShardSplitTest.testSplitAfterFailedSplit-seed#[F487E4BABD74F40D]) [     ] o.a.s.c.c.ZkStateReader Updated live nodes from ZooKeeper... [] -> [127.0.0.1:39955_p%2Ff]
   [junit4]   2> 773985 DEBUG (TEST-ShardSplitTest.testSplitAfterFailedSplit-seed#[F487E4BABD74F40D]) [     ] o.a.s.c.c.ZkStateReader clusterStateSet: legacy [0] interesting [0] watched [0] lazy [2] total [2]
   [junit4]   2> 773985 DEBUG (TEST-ShardSplitTest.testSplitAfterFailedSplit-seed#[F487E4BABD74F40D]) [     ] o.a.s.c.c.ZkStateReader$AliasesManager Checking ZK for most up to date Aliases /aliases.json
   [junit4]   2> 773986 DEBUG (TEST-ShardSplitTest.testSplitAfterFailedSplit-seed#[F487E4BABD74F40D]) [     ] o.a.s.c.c.ZkStateReader$AliasesManager Aliases: cmp=-1, new definition is: Aliases{collectionAliases={}, collectionAliasProperties={}, zNodeVersion=0}
   [junit4]   2> 773986 INFO  (TEST-ShardSplitTest.testSplitAfterFailedSplit-seed#[F487E4BABD74F40D]) [     ] o.a.s.c.s.i.ZkClientClusterStateProvider Cluster at 127.0.0.1:44853/solr ready
   [junit4]   2> 773991 INFO  (qtp1380911789-10684) [n:127.0.0.1:39955_p%2Ff     ] o.a.s.s.HttpSolrCall HttpSolrCall.init(http://127.0.0.1:39955/p/f/admin/collections?action=CREATE&name=control_collection&collection.configName=conf1&createNodeSet=127.0.0.1%3A39955_p%252Ff&numShards=1&nrtReplicas=1&wt=javabin&version=2)
   [junit4]   2> 773992 DEBUG (TEST-ShardSplitTest.testSplitAfterFailedSplit-seed#[F487E4BABD74F40D]-EventThread) [     ] o.a.s.c.c.SolrZkClient Submitting job to respond to event WatchedEvent state:SyncConnected type:NodeChildrenChanged path:/overseer/collection-queue-work
   [junit4]   2> 773992 DEBUG (TEST-ShardSplitTest.testSplitAfterFailedSplit-seed#[F487E4BABD74F40D]-EventThread) [     ] o.a.s.c.c.SolrZkClient Submitting job to respond to event WatchedEvent state:SyncConnected type:NodeChildrenChanged path:/overseer/collection-queue-work
   [junit4]   2> 773993 DEBUG (OverseerCollectionConfigSetProcessor-72164937491873796-127.0.0.1:39955_p%2Ff-n_0000000000) [n:127.0.0.1:39955_p%2Ff     ] o.a.s.c.OverseerTaskProcessor Got 1 tasks from work-queue : [[org.apache.solr.cloud.OverseerTaskQueue$QueueEvent@2e684ecf]]
   [junit4]   2> 773993 DEBUG (OverseerCollectionConfigSetProcessor-72164937491873796-127.0.0.1:39955_p%2Ff-n_0000000000) [n:127.0.0.1:39955_p%2Ff     ] o.a.s.c.OverseerTaskProcessor Marked task [/overseer/collection-queue-work/qn-0000000000] as running
   [junit4]   2> 773993 DEBUG (OverseerCollectionConfigSetProcessor-72164937491873796-127.0.0.1:39955_p%2Ff-n_0000000000) [n:127.0.0.1:39955_p%2Ff     ] o.a.s.c.OverseerTaskProcessor Overseer Collection Message Handler: Get the message id: /overseer/collection-queue-work/qn-0000000000 message: {
   [junit4]   2>   "name":"control_collection",
   [junit4]   2>   "fromApi":"true",
   [junit4]   2>   "collection.configName":"conf1",
   [junit4]   2>   "numShards":"1",
   [junit4]   2>   "createNodeSet":"127.0.0.1:39955_p%2Ff",
   [junit4]   2>   "nrtReplicas":"1",
   [junit4]   2>   "stateFormat":"2",
   [junit4]   2>   "replicationFactor":"1",
   [junit4]   2>   "operation":"create"}
   [junit4]   2> 773995 DEBUG (OverseerThreadFactory-6398-thread-1-processing-n:127.0.0.1:39955_p%2Ff) [n:127.0.0.1:39955_p%2Ff     ] o.a.s.c.OverseerTaskProcessor Runner processing /overseer/collection-queue-work/qn-0000000000
   [junit4]   2> 773995 DEBUG (OverseerCollectionConfigSetProcessor-72164937491873796-127.0.0.1:39955_p%2Ff-n_0000000000) [n:127.0.0.1:39955_p%2Ff     ] o.a.s.c.OverseerTaskProcessor Cleaning up work-queue. #Running tasks: 1 #Completed tasks: 0
   [junit4]   2> 773995 DEBUG (OverseerThreadFactory-6398-thread-1-processing-n:127.0.0.1:39955_p%2Ff) [n:127.0.0.1:39955_p%2Ff     ] o.a.s.c.a.c.OverseerCollectionMessageHandler OverseerCollectionMessageHandler.processMessage : create , {
   [junit4]   2>   "name":"control_collection",
   [junit4]   2>   "fromApi":"true",
   [junit4]   2>   "collection.configName":"conf1",
   [junit4]   2>   "numShards":"1",
   [junit4]   2>   "createNodeSet":"127.0.0.1:39955_p%2Ff",
   [junit4]   2>   "nrtReplicas":"1",
   [junit4]   2>   "stateFormat":"2",
   [junit4]   2>   "replicationFactor":"1",
   [junit4]   2>   "operation":"create"}
   [junit4]   2> 773995 DEBUG (OverseerCollectionConfigSetProcessor-72164937491873796-127.0.0.1:39955_p%2Ff-n_0000000000) [n:127.0.0.1:39955_p%2Ff     ] o.a.s.c.OverseerTaskProcessor RunningTasks: [/overseer/collection-queue-work/qn-0000000000]
   [junit4]   2> 773995 DEBUG (OverseerCollectionConfigSetProcessor-72164937491873796-127.0.0.1:39955_p%2Ff-n_0000000000) [n:127.0.0.1:39955_p%2Ff     ] o.a.s.c.OverseerTaskProcessor BlockedTasks: []
   [junit4]   2> 773995 DEBUG (OverseerCollectionConfigSetProcessor-72164937491873796-127.0.0.1:39955_p%2Ff-n_0000000000) [n:127.0.0.1:39955_p%2Ff     ] o.a.s.c.OverseerTaskProcessor CompletedTasks: []
   [junit4]   2> 773995 DEBUG (OverseerThreadFactory-6398-thread-1-processing-n:127.0.0.1:39955_p%2Ff) [n:127.0.0.1:39955_p%2Ff     ] o.a.s.c.c.ZkStateReader$AliasesManager Checking ZK for most up to date Aliases /aliases.json
   [junit4]   2> 773995 INFO  (OverseerCollectionConfigSetProcessor-72164937491873796-127.0.0.1:39955_p%2Ff-n_0000000000) [n:127.0.0.1:39955_p%2Ff     ] o.a.s.c.OverseerTaskProcessor RunningZKTasks: [/overseer/collection-queue-work/qn-0000000000]
   [junit4]   2> 773995 DEBUG (OverseerThreadFactory-6398-thread-1-processing-n:127.0.0.1:39955_p%2Ff) [n:127.0.0.1:39955_p%2Ff     ] o.a.s.c.c.ZkStateReader$AliasesManager Aliases: cmp=0, not overwriting ZK version.
   [junit4]   2> 773995 INFO  (OverseerThreadFactory-6398-thread-1-processing-n:127.0.0.1:39955_p%2Ff) [n:127.0.0.1:39955_p%2Ff     ] o.a.s.c.a.c.CreateCollectionCmd Create collection control_collection
   [junit4]   2> 773996 DEBUG (OverseerThreadFactory-6398-thread-1-processing-n:127.0.0.1:39955_p%2Ff) [n:127.0.0.1:39955_p%2Ff     ] o.a.s.c.a.c.OverseerCollectionMessageHandler creating collections conf node /collections/control_collection 
   [junit4]   2> 773997 DEBUG (OverseerThreadFactory-6398-thread-1-processing-n:127.0.0.1:39955_p%2Ff) [n:127.0.0.1:39955_p%2Ff     ] o.a.s.c.a.c.CreateCollectionCmd Check for collection zkNode: control_collection
   [junit4]   2> 773997 DEBUG (OverseerThreadFactory-6398-thread-1-processing-n:127.0.0.1:39955_p%2Ff) [n:127.0.0.1:39955_p%2Ff     ] o.a.s.c.a.c.CreateCollectionCmd Collection zkNode exists
   [junit4]   2> 773998 DEBUG (TEST-ShardSplitTest.testSplitAfterFailedSplit-seed#[F487E4BABD74F40D]-EventThread) [     ] o.a.s.c.c.SolrZkClient Submitting job to respond to event WatchedEvent state:SyncConnected type:NodeChildrenChanged path:/overseer/queue
   [junit4]   2> 773998 DEBUG (OverseerStateUpdate-72164937491873796-127.0.0.1:39955_p%2Ff-n_0000000000) [n:127.0.0.1:39955_p%2Ff     ] o.a.s.c.Overseer processMessage: queueSize: 1, message = {
   [junit4]   2>   "name":"control_collection",
   [junit4]   2>   "fromApi":"true",
   [junit4]   2>   "collection.configName":"conf1",
   [junit4]   2>   "numShards":"1",
   [junit4]   2>   "createNodeSet":"127.0.0.1:39955_p%2Ff",
   [junit4]   2>   "nrtReplicas":"1",
   [junit4]   2>   "stateFormat":"2",
   [junit4]   2>   "replicationFactor":"1",
   [junit4]   2>   "operation":"create"} current state version: 0
   [junit4]   2> 773998 DEBUG (OverseerStateUpdate-72164937491873796-127.0.0.1:39955_p%2Ff-n_0000000000) [n:127.0.0.1:39955_p%2Ff     ] o.a.s.c.o.ClusterStateMutator building a new cName: control_collection
   [junit4]   2> 773999 DEBUG (OverseerStateUpdate-72164937491873796-127.0.0.1:39955_p%2Ff-n_0000000000) [n:127.0.0.1:39955_p%2Ff     ] o.a.s.c.o.ZkStateWriter going to create_collection /collections/control_collection/state.json
   [junit4]   2> 774000 DEBUG (TEST-ShardSplitTest.testSplitAfterFailedSplit-seed#[F487E4BABD74F40D]-EventThread) [     ] o.a.s.c.c.SolrZkClient Submitting job to respond to event WatchedEvent state:SyncConnected type:NodeChildrenChanged path:/overseer/queue
   [junit4]   2> 774099 DEBUG (OverseerThreadFactory-6398-thread-1-processing-n:127.0.0.1:39955_p%2Ff) [n:127.0.0.1:39955_p%2Ff     ] o.a.s.c.a.c.CreateCollectionCmd Creating SolrCores for new collection control_collection, shardNames [shard1] , message : {
   [junit4]   2>   "name":"control_collection",
   [junit4]   2>   "fromApi":"true",
   [junit4]   2>   "collection.configName":"conf1",
   [junit4]   2>   "numShards":"1",
   [junit4]   2>   "createNodeSet":"127.0.0.1:39955_p%2Ff",
   [junit4]   2>   "nrtReplicas":"1",
   [junit4]   2>   "stateFormat":"2",
   [junit4]   2>   "replicationFactor":"1",
   [junit4]   2>   "operation":"create"}
   [junit4]   2> 774101 DEBUG (OverseerThreadFactory-6398-thread-1-processing-n:127.0.0.1:39955_p%2Ff) [n:127.0.0.1:39955_p%2Ff     ] o.a.s.c.a.c.CreateCollectionCmd Creating core control_collection_shard1_replica_n1 as part of shard shard1 of collection control_collection on 127.0.0.1:39955_p%2Ff
   [junit4]   2> 774102 INFO  (qtp1380911789-10686) [n:127.0.0.1:39955_p%2Ff     ] o.a.s.s.HttpSolrCall HttpSolrCall.init(http://127.0.0.1:39955/p/f/admin/cores?null)
   [junit4]   2> 774102 INFO  (qtp1380911789-10686) [n:127.0.0.1:39955_p%2Ff    x:control_collection_shard1_replica_n1 ] o.a.s.h.a.CoreAdminOperation core create command qt=/admin/cores&collection.configName=conf1&newCollection=true&name=control_collection_shard1_replica_n1&action=CREATE&numShards=1&collection=control_collection&shard=shard1&wt=javabin&version=2&replicaType=NRT
   [junit4]   2> 774103 INFO  (qtp1380911789-10686) [n:127.0.0.1:39955_p%2Ff    x:control_collection_shard1_replica_n1 ] o.a.s.c.TransientSolrCoreCacheDefault Allocating transient core cache for max 4 cores with initial capacity of 4
   [junit4]   2> 774107 DEBUG (TEST-ShardSplitTest.testSplitAfterFailedSplit-seed#[F487E4BABD74F40D]-EventThread) [     ] o.a.s.c.c.SolrZkClient Submitting job to respond to event WatchedEvent state:SyncConnected type:NodeChildrenChanged path:/overseer/queue
   [junit4]   2> 774108 DEBUG (OverseerStateUpdate-72164937491873796-127.0.0.1:39955_p%2Ff-n_0000000000) [n:127.0.0.1:39955_p%2Ff     ] o.a.s.c.Overseer processMessage: queueSize: 1, message = {
   [junit4]   2>   "core":"control_collection_shard1_replica_n1",
   [junit4]   2>   "roles":null,
   [junit4]   2>   "node_name":"127.0.0.1:39955_p%2Ff",
   [junit4]   2>   "base_url":"http://127.0.0.1:39955/p/f",
   [junit4]   2>   "numShards":"1",
   [junit4]   2>   "state":"down",
   [junit4]   2>   "shard":"shard1",
   [junit4]   2>   "collection":"control_collection",
   [junit4]   2>   "type":"NRT",
   [junit4]   2>   "operation":"state"} current state version: 0
   [junit4]   2> 774108 DEBUG (OverseerStateUpdate-72164937491873796-127.0.0.1:39955_p%2Ff-n_0000000000) [n:127.0.0.1:39955_p%2Ff     ] o.a.s.c.o.ReplicaMutator Update state numShards=1 message={
   [junit4]   2>   "core":"control_collection_shard1_replica_n1",
   [junit4]   2>   "roles":null,
   [junit4]   2>   "node_name":"127.0.0.1:39955_p%2Ff",
   [junit4]   2>   "base_url":"http://127.0.0.1:39955/p/f",
   [junit4]   2>   "numShards":"1",
   [junit4]   2>   "state":"down",
   [junit4]   2>   "shard":"shard1",
   [junit4]   2>   "collection":"control_collection",
   [junit4]   2>   "type":"NRT",
   [junit4]   2>   "operation":"state"}
   [junit4]   2> 774109 DEBUG (OverseerStateUpdate-72164937491873796-127.0.0.1:39955_p%2Ff-n_0000000000) [n:127.0.0.1:39955_p%2Ff     ] o.a.s.c.o.ReplicaMutator Will update state for replica: core_node2:{
   [junit4]   2>   "core":"control_collection_shard1_replica_n1",
   [junit4]   2>   "node_name":"127.0.0.1:39955_p%2Ff",
   [junit4]   2>   "base_url":"http://127.0.0.1:39955/p/f",
   [junit4]   2>   "state":"down",
   [junit4]   2>   "type":"NRT"}
   [junit4]   2> 774109 DEBUG (OverseerStateUpdate-72164937491873796-127.0.0.1:39955_p%2Ff-n_0000000000) [n:127.0.0.1:39955_p%2Ff     ] o.a.s.c.o.ReplicaMutator Collection is now: DocCollection(control_collection//collections/control_collection/state.json/0 )={
   [junit4]   2>   "pullReplicas":"0",
   [junit4]   2>   "replicationFactor":"1",
   [junit4]   2>   "router":{"name":"compositeId"},
   [junit4]   2>   "maxShardsPerNode":"1",
   [junit4]   2>   "autoAddReplicas":"false",
   [junit4]   2>   "nrtReplicas":"1",
   [junit4]   2>   "tlogReplicas":"0",
   [junit4]   2>   "shards":{"shard1":{
   [junit4]   2>       "range":"80000000-7fffffff",
   [junit4]   2>       "state":"active",
   [junit4]   2>       "replicas":{"core_node2":{
   [junit4]   2>           "core":"control_collection_shard1_replica_n1",
   [junit4]   2>           "node_name":"127.0.0.1:39955_p%2Ff",
   [junit4]   2>           "base_url":"http://127.0.0.1:39955/p/f",
   [junit4]   2>           "state":"down",
   [junit4]   2>           "type":"NRT"}}}}}
   [junit4]   2> 774210 DEBUG (OverseerStateUpdate-72164937491873796-127.0.0.1:39955_p%2Ff-n_0000000000) [n:127.0.0.1:39955_p%2Ff     ] o.a.s.c.o.ZkStateWriter going to update_collection /collections/control_collection/state.json version: 0
   [junit4]   2> 774210 DEBUG (TEST-ShardSplitTest.testSplitAfterFailedSplit-seed#[F487E4BABD74F40D]-EventThread) [     ] o.a.s.c.c.SolrZkClient Submitting job to respond to event WatchedEvent state:SyncConnected type:NodeChildrenChanged path:/overseer/queue
   [junit4]   2> 775110 DEBUG (qtp1380911789-10686) [n:127.0.0.1:39955_p%2Ff c:control_collection s:shard1  x:control_collection_shard1_replica_n1 ] o.a.s.c.c.ZkStateReader Loading collection config from: [/collections/control_collection]
   [junit4]   2> 775118 INFO  (qtp1380911789-10686) [n:127.0.0.1:39955_p%2Ff c:control_collection s:shard1  x:control_collection_shard1_replica_n1 ] o.a.s.c.SolrConfig Using Lucene MatchVersion: 8.11.4
   [junit4]   2> 775118 WARN  (qtp1380911789-10686) [n:127.0.0.1:39955_p%2Ff c:control_collection s:shard1  x:control_collection_shard1_replica_n1 ] o.a.s.c.SolrConfig solrconfig.xml: <jmx> is no longer supported, use solr.xml:/metrics/reporter section instead
   [junit4]   2> 775121 INFO  (qtp1380911789-10686) [n:127.0.0.1:39955_p%2Ff c:control_collection s:shard1  x:control_collection_shard1_replica_n1 ] o.a.s.s.IndexSchema Schema name=test
   [junit4]   2> 775125 INFO  (qtp1380911789-10686) [n:127.0.0.1:39955_p%2Ff c:control_collection s:shard1  x:control_collection_shard1_replica_n1 ] o.a.s.s.IndexSchema Loaded schema test/1.6 with uniqueid field id
   [junit4]   2> 775145 INFO  (qtp1380911789-10686) [n:127.0.0.1:39955_p%2Ff c:control_collection s:shard1  x:control_collection_shard1_replica_n1 ] o.a.s.c.CoreContainer Creating SolrCore 'control_collection_shard1_replica_n1' using configuration from configset conf1, trusted=true
   [junit4]   2> 775145 INFO  (qtp1380911789-10686) [n:127.0.0.1:39955_p%2Ff c:control_collection s:shard1  x:control_collection_shard1_replica_n1 ] o.a.s.m.r.SolrJmxReporter JMX monitoring for 'solr.core.control_collection.shard1.replica_n1' (registry 'solr.core.control_collection.shard1.replica_n1') enabled at server: com.sun.jmx.mbeanserver.JmxMBeanServer@76d4feb1
   [junit4]   2> 775145 INFO  (qtp1380911789-10686) [n:127.0.0.1:39955_p%2Ff c:control_collection s:shard1  x:control_collection_shard1_replica_n1 ] o.a.s.c.SolrCore [[control_collection_shard1_replica_n1] ] Opening new SolrCore at [/home/jenkins/jenkins-slave/workspace/Lucene/Lucene-Solr-Tests-8.11/solr/build/solr-core/test/J3/temp/solr.cloud.api.collections.ShardSplitTest_F487E4BABD74F40D-001/control-001/cores/control_collection_shard1_replica_n1], dataDir=[/home/jenkins/jenkins-slave/workspace/Lucene/Lucene-Solr-Tests-8.11/solr/build/solr-core/test/J3/temp/solr.cloud.api.collections.ShardSplitTest_F487E4BABD74F40D-001/control-001/cores/control_collection_shard1_replica_n1/data/]
   [junit4]   2> 775148 INFO  (qtp1380911789-10686) [n:127.0.0.1:39955_p%2Ff c:control_collection s:shard1  x:control_collection_shard1_replica_n1 ] o.a.s.u.RandomMergePolicy RandomMergePolicy wrapping class org.apache.lucene.index.LogDocMergePolicy: [LogDocMergePolicy: minMergeSize=1000, mergeFactor=32, maxMergeSize=9223372036854775807, maxMergeSizeForForcedMerge=9223372036854775807, calibrateSizeByDeletes=true, maxMergeDocs=2147483647, maxCFSSegmentSizeMB=8.796093022207999E12, noCFSRatio=0.780896788997155]
   [junit4]   2> 775163 WARN  (qtp1380911789-10686) [n:127.0.0.1:39955_p%2Ff c:control_collection s:shard1  x:control_collection_shard1_replica_n1 ] o.a.s.c.RequestHandlers INVALID paramSet a in requestHandler {type = requestHandler,name = /dump,class = DumpRequestHandler,attributes = {initParams=a, name=/dump, class=DumpRequestHandler},args = {defaults={a=A,b=B}}}
   [junit4]   2> 775207 INFO  (qtp1380911789-10686) [n:127.0.0.1:39955_p%2Ff c:control_collection s:shard1  x:control_collection_shard1_replica_n1 ] o.a.s.u.UpdateHandler Using UpdateLog implementation: org.apache.solr.update.UpdateLog
   [junit4]   2> 775207 INFO  (qtp1380911789-10686) [n:127.0.0.1:39955_p%2Ff c:control_collection s:shard1  x:control_collection_shard1_replica_n1 ] o.a.s.u.UpdateLog Initializing UpdateLog: dataDir= defaultSyncLevel=FLUSH numRecordsToKeep=100 maxNumLogsToKeep=10 numVersionBuckets=65536
   [junit4]   2> 775208 INFO  (qtp1380911789-10686) [n:127.0.0.1:39955_p%2Ff c:control_collection s:shard1  x:control_collection_shard1_replica_n1 ] o.a.s.u.CommitTracker Hard AutoCommit: disabled
   [junit4]   2> 775208 INFO  (qtp1380911789-10686) [n:127.0.0.1:39955_p%2Ff c:control_collection s:shard1  x:control_collection_shard1_replica_n1 ] o.a.s.u.CommitTracker Soft AutoCommit: disabled
   [junit4]   2> 775209 INFO  (qtp1380911789-10686) [n:127.0.0.1:39955_p%2Ff c:control_collection s:shard1  x:control_collection_shard1_replica_n1 ] o.a.s.u.RandomMergePolicy RandomMergePolicy wrapping class org.apache.lucene.index.TieredMergePolicy: [TieredMergePolicy: maxMergeAtOnce=33, maxMergeAtOnceExplicit=34, maxMergedSegmentMB=83.9453125, floorSegmentMB=1.2626953125, forceMergeDeletesPctAllowed=20.01871416338716, segmentsPerTier=17.0, maxCFSSegmentSizeMB=8.796093022207999E12, noCFSRatio=0.0, deletesPctAllowed=32.269825581686696
   [junit4]   2> 775210 DEBUG (qtp1380911789-10686) [n:127.0.0.1:39955_p%2Ff c:control_collection s:shard1  x:control_collection_shard1_replica_n1 ] o.a.s.c.c.ZkStateReader Loading collection config from: [/collections/control_collection]
   [junit4]   2> 775211 INFO  (qtp1380911789-10686) [n:127.0.0.1:39955_p%2Ff c:control_collection s:shard1  x:control_collection_shard1_replica_n1 ] o.a.s.r.ManagedResourceStorage Configured ZooKeeperStorageIO with znodeBase: /configs/conf1
   [junit4]   2> 775211 INFO  (qtp1380911789-10686) [n:127.0.0.1:39955_p%2Ff c:control_collection s:shard1  x:control_collection_shard1_replica_n1 ] o.a.s.r.ManagedResourceStorage Loaded null at path _rest_managed.json using ZooKeeperStorageIO:path=/configs/conf1
   [junit4]   2> 775212 INFO  (qtp1380911789-10686) [n:127.0.0.1:39955_p%2Ff c:control_collection s:shard1  x:control_collection_shard1_replica_n1 ] o.a.s.h.ReplicationHandler Commits will be reserved for 10000 ms
   [junit4]   2> 775212 INFO  (qtp1380911789-10686) [n:127.0.0.1:39955_p%2Ff c:control_collection s:shard1  x:control_collection_shard1_replica_n1 ] o.a.s.u.UpdateLog Could not find max version in index or recent updates, using new clock 1798047060065255424
   [junit4]   2> 775214 DEBUG (qtp1380911789-10686) [n:127.0.0.1:39955_p%2Ff c:control_collection s:shard1  x:control_collection_shard1_replica_n1 ] o.a.s.c.c.ZkStateReader Waiting up to 60000ms for state org.apache.solr.cloud.ZkController$$Lambda$538/1389578270@5cca0927
   [junit4]   2> 775214 DEBUG (qtp1380911789-10686) [n:127.0.0.1:39955_p%2Ff c:control_collection s:shard1  x:control_collection_shard1_replica_n1 ] o.a.s.c.c.ZkStateReader Found org.apache.solr.cloud.ZkController$$Lambda$538/1389578270@5cca0927 directly in clusterState
   [junit4]   2> 775215 DEBUG (qtp1380911789-10686) [n:127.0.0.1:39955_p%2Ff c:control_collection s:shard1  x:control_collection_shard1_replica_n1 ] o.a.s.c.c.SolrZkClient makePath: /collections/control_collection/terms/shard1
   [junit4]   2> 775215 INFO  (searcherExecutor-6410-thread-1-processing-n:127.0.0.1:39955_p%2Ff x:control_collection_shard1_replica_n1 c:control_collection s:shard1) [n:127.0.0.1:39955_p%2Ff c:control_collection s:shard1  x:control_collection_shard1_replica_n1 ] o.a.s.c.SolrCore [control_collection_shard1_replica_n1]  Registered new searcher autowarm time: 0 ms
   [junit4]   2> 775217 DEBUG (TEST-ShardSplitTest.testSplitAfterFailedSplit-seed#[F487E4BABD74F40D]-EventThread) [     ] o.a.s.c.c.SolrZkClient Submitting job to respond to event WatchedEvent state:SyncConnected type:NodeDataChanged path:/collections/control_collection/terms/shard1
   [junit4]   2> 775217 INFO  (qtp1380911789-10686) [n:127.0.0.1:39955_p%2Ff c:control_collection s:shard1  x:control_collection_shard1_replica_n1 ] o.a.s.c.ZkShardTerms Successful update of terms at /collections/control_collection/terms/shard1 to Terms{values={core_node2=0}, version=0}
   [junit4]   2> 775217 INFO  (qtp1380911789-10686) [n:127.0.0.1:39955_p%2Ff c:control_collection s:shard1  x:control_collection_shard1_replica_n1 ] o.a.s.c.ShardLeaderElectionContextBase make sure parent is created /collections/control_collection/leaders/shard1
   [junit4]   2> 775217 DEBUG (qtp1380911789-10686) [n:127.0.0.1:39955_p%2Ff c:control_collection s:shard1  x:control_collection_shard1_replica_n1 ] o.a.s.c.c.SolrZkClient makePath: /collections/control_collection/leaders/shard1
   [junit4]   2> 775218 DEBUG (qtp1380911789-10686) [n:127.0.0.1:39955_p%2Ff c:control_collection s:shard1  x:control_collection_shard1_replica_n1 ] o.a.s.c.c.SolrZkClient makePath: /collections/control_collection/leader_elect/shard1/election
   [junit4]   2> 775220 INFO  (qtp1380911789-10686) [n:127.0.0.1:39955_p%2Ff c:control_collection s:shard1  x:control_collection_shard1_replica_n1 ] o.a.s.c.ShardLeaderElectionContext Enough replicas found to continue.
   [junit4]   2> 775220 INFO  (qtp1380911789-10686) [n:127.0.0.1:39955_p%2Ff c:control_collection s:shard1  x:control_collection_shard1_replica_n1 ] o.a.s.c.ShardLeaderElectionContext I may be the new leader - try and sync
   [junit4]   2> 775220 INFO  (qtp1380911789-10686) [n:127.0.0.1:39955_p%2Ff c:control_collection s:shard1  x:control_collection_shard1_replica_n1 ] o.a.s.c.SyncStrategy Sync replicas to http://127.0.0.1:39955/p/f/control_collection_shard1_replica_n1/
   [junit4]   2> 775221 INFO  (qtp1380911789-10686) [n:127.0.0.1:39955_p%2Ff c:control_collection s:shard1  x:control_collection_shard1_replica_n1 ] o.a.s.c.SyncStrategy Sync Success - now sync replicas to me
   [junit4]   2> 775221 INFO  (qtp1380911789-10686) [n:127.0.0.1:39955_p%2Ff c:control_collection s:shard1  x:control_collection_shard1_replica_n1 ] o.a.s.c.SyncStrategy http://127.0.0.1:39955/p/f/control_collection_shard1_replica_n1/ has no replicas
   [junit4]   2> 775221 INFO  (qtp1380911789-10686) [n:127.0.0.1:39955_p%2Ff c:control_collection s:shard1  x:control_collection_shard1_replica_n1 ] o.a.s.c.ShardLeaderElectionContextBase Creating leader registration node /collections/control_collection/leaders/shard1/leader after winning as /collections/control_collection/leader_elect/shard1/election/72164937491873796-core_node2-n_0000000000
   [junit4]   2> 775223 DEBUG (TEST-ShardSplitTest.testSplitAfterFailedSplit-seed#[F487E4BABD74F40D]-EventThread) [     ] o.a.s.c.c.SolrZkClient Submitting job to respond to event WatchedEvent state:SyncConnected type:NodeChildrenChanged path:/overseer/queue
   [junit4]   2> 775223 INFO  (qtp1380911789-10686) [n:127.0.0.1:39955_p%2Ff c:control_collection s:shard1  x:control_collection_shard1_replica_n1 ] o.a.s.c.ShardLeaderElectionContext I am the new leader: http://127.0.0.1:39955/p/f/control_collection_shard1_replica_n1/ shard1
   [junit4]   2> 775223 DEBUG (qtp1380911789-10686) [n:127.0.0.1:39955_p%2Ff c:control_collection s:shard1  x:control_collection_shard1_replica_n1 ] o.a.s.c.c.ZkStateReader already watching , added to stateWatchers
   [junit4]   2> 775223 DEBUG (OverseerStateUpdate-72164937491873796-127.0.0.1:39955_p%2Ff-n_0000000000) [n:127.0.0.1:39955_p%2Ff     ] o.a.s.c.Overseer processMessage: queueSize: 1, message = {
   [junit4]   2>   "operation":"leader",
   [junit4]   2>   "shard":"shard1",
   [junit4]   2>   "collection":"control_collection",
   [junit4]   2>   "node_name":"127.0.0.1:39955_p%2Ff",
   [junit4]   2>   "base_url":"http://127.0.0.1:39955/p/f",
   [junit4]   2>   "core":"control_collection_shard1_replica_n1",
   [junit4]   2>   "state":"active"} current state version: 0
   [junit4]   2> 775224 DEBUG (qtp1380911789-10686) [n:127.0.0.1:39955_p%2Ff c:control_collection s:shard1  x:control_collection_shard1_replica_n1 ] o.a.s.c.c.ZkStateReader Add data for [control_collection] ver [1]
   [junit4]   2> 775224 DEBUG (qtp1380911789-10686) [n:127.0.0.1:39955_p%2Ff c:control_collection s:shard1  x:control_collection_shard1_replica_n1 ] o.a.s.c.c.ZkStateReader clusterStateSet: legacy [0] interesting [1] watched [1] lazy [2] total [2]
   [junit4]   2> 775224 DEBUG (qtp1380911789-10686) [n:127.0.0.1:39955_p%2Ff c:control_collection s:shard1  x:control_collection_shard1_replica_n1 ] o.a.s.c.c.ZkStateReader updated per-replica states changed for: control_collection, ver: 0 , new vals: []
   [junit4]   2> 775224 DEBUG (watches-6392-thread-1-processing-n:127.0.0.1:39955_p%2Ff x:control_collection_shard1_replica_n1 c:control_collection s:shard1) [n:127.0.0.1:39955_p%2Ff c:control_collection s:shard1  x:control_collection_shard1_replica_n1 ] o.a.s.c.c.ZkStateReader  CollectionStatePredicate failed for control_collection, cversion : -1
   [junit4]   2> 775225 DEBUG (qtp1380911789-10686) [n:127.0.0.1:39955_p%2Ff c:control_collection s:shard1  x:control_collection_shard1_replica_n1 ] o.a.s.c.c.ZkStateReader clusterStateSet: legacy [0] interesting [1] watched [1] lazy [2] total [2]
   [junit4]   2> 775225 DEBUG (qtp1380911789-10686) [n:127.0.0.1:39955_p%2Ff c:control_collection s:shard1  x:control_collection_shard1_replica_n1 ] o.a.s.c.c.ZkStateReader  CollectionStatePredicate failed for control_collection, cversion : -1
   [junit4]   2> 775225 DEBUG (watches-6392-thread-1-processing-n:127.0.0.1:39955_p%2Ff x:control_collection_shard1_replica_n1 c:control_collection s:shard1) [n:127.0.0.1:39955_p%2Ff c:control_collection s:shard1  x:control_collection_shard1_replica_n1 ] o.a.s.c.c.ZkStateReader  CollectionStatePredicate failed for control_collection, cversion : -1
   [junit4]   2> 775225 DEBUG (qtp1380911789-10686) [n:127.0.0.1:39955_p%2Ff c:control_collection s:shard1  x:control_collection_shard1_replica_n1 ] o.a.s.c.c.ZkStateReader  CollectionStatePredicate failed for control_collection, cversion : -1
   [junit4]   2> 775225 DEBUG (qtp1380911789-10686) [n:127.0.0.1:39955_p%2Ff c:control_collection s:shard1  x:control_collection_shard1_replica_n1 ] o.a.s.c.c.ZkStateReader  CollectionStatePredicate failed for control_collection, cversion : -1
   [junit4]   2> 775324 DEBUG (OverseerStateUpdate-72164937491873796-127.0.0.1:39955_p%2Ff-n_0000000000) [n:127.0.0.1:39955_p%2Ff     ] o.a.s.c.o.ZkStateWriter going to update_collection /collections/control_collection/state.json version: 1
   [junit4]   2> 775325 DEBUG (TEST-ShardSplitTest.testSplitAfterFailedSplit-seed#[F487E4BABD74F40D]-EventThread) [     ] o.a.s.c.c.SolrZkClient Submitting job to respond to event WatchedEvent state:SyncConnected type:NodeDataChanged path:/collections/control_collection/state.json
   [junit4]   2> 775325 INFO  (zkCallback-6390-thread-1) [     ] o.a.s.c.c.ZkStateReader A cluster state change: [WatchedEvent state:SyncConnected type:NodeDataChanged path:/collections/control_collection/state.json] for collection [control_collection] has occurred - updating... (live nodes size: [1])
   [junit4]   2> 775325 DEBUG (TEST-ShardSplitTest.testSplitAfterFailedSplit-seed#[F487E4BABD74F40D]-EventThread) [     ] o.a.s.c.c.SolrZkClient Submitting job to respond to event WatchedEvent state:SyncConnected type:NodeChildrenChanged path:/overseer/queue
   [junit4]   2> 775325 DEBUG (zkCallback-6390-thread-1) [     ] o.a.s.c.c.ZkStateReader Updating data for [control_collection] from [1] to [2]
   [junit4]   2> 775325 DEBUG (zkCallback-6390-thread-1) [     ] o.a.s.c.c.ZkStateReader clusterStateSet: legacy [0] interesting [1] watched [1] lazy [2] total [2]
   [junit4]   2> 775325 DEBUG (watches-6392-thread-1) [     ] o.a.s.c.c.ZkStateReader leader found for control_collection/shard1 to be core_node2:{
   [junit4]   2>   "core":"control_collection_shard1_replica_n1",
   [junit4]   2>   "node_name":"127.0.0.1:39955_p%2Ff",
   [junit4]   2>   "base_url":"http://127.0.0.1:39955/p/f",
   [junit4]   2>   "state":"down",
   [junit4]   2>   "type":"NRT",
   [junit4]   2>   "leader":"true"}
   [junit4]   2> 775326 DEBUG (watches-6392-thread-1) [     ] o.a.s.c.c.ZkStateReader clusterStateSet: legacy [0] interesting [0] watched [0] lazy [2] total [2]
   [junit4]   2> 775326 INFO  (qtp1380911789-10686) [n:127.0.0.1:39955_p%2Ff c:control_collection s:shard1  x:control_collection_shard1_replica_n1 ] o.a.s.c.ZkController I am the leader, no recovery necessary
   [junit4]   2> 775327 DEBUG (TEST-ShardSplitTest.testSplitAfterFailedSplit-seed#[F487E4BABD74F40D]-EventThread) [     ] o.a.s.c.c.SolrZkClient Submitting job to respond to event WatchedEvent state:SyncConnected type:NodeChildrenChanged path:/overseer/queue
   [junit4]   2> 775327 DEBUG (qtp1380911789-10686) [n:127.0.0.1:39955_p%2Ff c:control_collection s:shard1  x:control_collection_shard1_replica_n1 ] o.a.s.c.c.ZkStateReader Refreshing lazily-loaded state for collection control_collection
   [junit4]   2> 775327 DEBUG (qtp1380911789-10686) [n:127.0.0.1:39955_p%2Ff c:control_collection s:shard1  x:control_collection_shard1_replica_n1 ] o.a.s.c.c.ZkStateReader already watching , added to stateWatchers
   [junit4]   2> 775327 DEBUG (OverseerStateUpdate-72164937491873796-127.0.0.1:39955_p%2Ff-n_0000000000) [n:127.0.0.1:39955_p%2Ff     ] o.a.s.c.Overseer processMessage: queueSize: 1, message = {
   [junit4]   2>   "core":"control_collection_shard1_replica_n1",
   [junit4]   2>   "core_node_name":"core_node2",
   [junit4]   2>   "roles":null,
   [junit4]   2>   "node_name":"127.0.0.1:39955_p%2Ff",
   [junit4]   2>   "base_url":"http://127.0.0.1:39955/p/f",
   [junit4]   2>   "numShards":"1",
   [junit4]   2>   "state":"active",
   [junit4]   2>   "shard":"shard1",
   [junit4]   2>   "collection":"control_collection",
   [junit4]   2>   "type":"NRT",
   [junit4]   2>   "operation":"state"} current state version: 0
   [junit4]   2> 775327 DEBUG (OverseerStateUpdate-72164937491873796-127.0.0.1:39955_p%2Ff-n_0000000000) [n:127.0.0.1:39955_p%2Ff     ] o.a.s.c.o.ReplicaMutator Update state numShards=1 message={
   [junit4]   2>   "core":"control_collection_shard1_replica_n1",
   [junit4]   2>   "core_node_name":"core_node2",
   [junit4]   2>   "roles":null,
   [junit4]   2>   "node_name":"127.0.0.1:39955_p%2Ff",
   [junit4]   2>   "base_url":"http://127.0.0.1:39955/p/f",
   [junit4]   2>   "numShards":"1",
   [junit4]   2>   "state":"active",
   [junit4]   2>   "shard":"shard1",
   [junit4]   2>   "collection":"control_collection",
   [junit4]   2>   "type":"NRT",
   [junit4]   2>   "operation":"state"}
   [junit4]   2> 775327 DEBUG (OverseerStateUpdate-72164937491873796-127.0.0.1:39955_p%2Ff-n_0000000000) [n:127.0.0.1:39955_p%2Ff     ] o.a.s.c.o.ReplicaMutator Will update state for replica: core_node2:{
   [junit4]   2>   "core":"control_collection_shard1_replica_n1",
   [junit4]   2>   "node_name":"127.0.0.1:39955_p%2Ff",
   [junit4]   2>   "base_url":"http://127.0.0.1:39955/p/f",
   [junit4]   2>   "state":"active",
   [junit4]   2>   "type":"NRT",
   [junit4]   2>   "leader":"true"}
   [junit4]   2> 775327 DEBUG (OverseerStateUpdate-72164937491873796-127.0.0.1:39955_p%2Ff-n_0000000000) [n:127.0.0.1:39955_p%2Ff     ] o.a.s.c.o.ReplicaMutator Collection is now: DocCollection(control_collection//collections/control_collection/state.json/2 )={
   [junit4]   2>   "pullReplicas":"0",
   [junit4]   2>   "replicationFactor":"1",
   [junit4]   2>   "router":{"name":"compositeId"},
   [junit4]   2>   "maxShardsPerNode":"1",
   [junit4]   2>   "autoAddReplicas":"false",
   [junit4]   2>   "nrtReplicas":"1",
   [junit4]   2>   "tlogReplicas":"0",
   [junit4]   2>   "shards":{"shard1":{
   [junit4]   2>       "range":"80000000-7fffffff",
   [junit4]   2>       "state":"active",
   [junit4]   2>       "replicas":{"core_node2":{
   [junit4]   2>           "core":"control_collection_shard1_replica_n1",
   [junit4]   2>           "node_name":"127.0.0.1:39955_p%2Ff",
   [junit4]   2>           "base_url":"http://127.0.0.1:39955/p/f",
   [junit4]   2>           "state":"active",
   [junit4]   2>           "type":"NRT",
   [junit4]   2>           "leader":"true"}}}}}
   [junit4]   2> 775328 DEBUG (qtp1380911789-10686) [n:127.0.0.1:39955_p%2Ff c:control_collection s:shard1  x:control_collection_shard1_replica_n1 ] o.a.s.c.c.ZkStateReader Add data for [control_collection] ver [2]
   [junit4]   2> 775328 DEBUG (qtp1380911789-10686) [n:127.0.0.1:39955_p%2Ff c:control_collection s:shard1  x:control_collection_shard1_replica_n1 ] o.a.s.c.c.ZkStateReader clusterStateSet: legacy [0] interesting [1] watched [1] lazy [2] total [2]
   [junit4]   2> 775328 DEBUG (qtp1380911789-10686) [n:127.0.0.1:39955_p%2Ff c:control_collection s:shard1  x:control_collection_shard1_replica_n1 ] o.a.s.c.c.ZkStateReader updated per-replica states changed for: control_collection, ver: 0 , new vals: []
   [junit4]   2> 775328 DEBUG (qtp1380911789-10686) [n:127.0.0.1:39955_p%2Ff c:control_collection s:shard1  x:control_collection_shard1_replica_n1 ] o.a.s.c.c.ZkStateReader clusterStateSet: legacy [0] interesting [1] watched [1] lazy [2] total [2]
   [junit4]   2> 775329 INFO  (qtp1380911789-10686) [n:127.0.0.1:39955_p%2Ff     ] o.a.s.s.HttpSolrCall [admin] 

[...truncated too long message...]

nt Submitting job to respond to event WatchedEvent state:Closed type:None path:null
   [junit4]   2> 1107625 DEBUG (TEST-ShardSplitTest.testSplitShardWithRuleLink-seed#[F487E4BABD74F40D]-EventThread) [     ] o.a.s.c.c.SolrZkClient Submitting job to respond to event WatchedEvent state:Closed type:None path:null
   [junit4]   2> 1107625 DEBUG (TEST-ShardSplitTest.testSplitShardWithRuleLink-seed#[F487E4BABD74F40D]-EventThread) [     ] o.a.s.c.c.SolrZkClient Submitting job to respond to event WatchedEvent state:Closed type:None path:null
   [junit4]   2> 1107625 DEBUG (TEST-ShardSplitTest.testSplitShardWithRuleLink-seed#[F487E4BABD74F40D]-EventThread) [     ] o.a.s.c.c.SolrZkClient Submitting job to respond to event WatchedEvent state:Closed type:None path:null
   [junit4]   2> 1107625 DEBUG (TEST-ShardSplitTest.testSplitShardWithRuleLink-seed#[F487E4BABD74F40D]-EventThread) [     ] o.a.s.c.c.SolrZkClient Submitting job to respond to event WatchedEvent state:Closed type:None path:null
   [junit4]   2> 1107625 DEBUG (TEST-ShardSplitTest.testSplitShardWithRuleLink-seed#[F487E4BABD74F40D]-EventThread) [     ] o.a.s.c.c.SolrZkClient Submitting job to respond to event WatchedEvent state:Closed type:None path:null
   [junit4]   2> 1107625 DEBUG (TEST-ShardSplitTest.testSplitShardWithRuleLink-seed#[F487E4BABD74F40D]-EventThread) [     ] o.a.s.c.c.SolrZkClient Submitting job to respond to event WatchedEvent state:Closed type:None path:null
   [junit4]   2> 1107625 DEBUG (TEST-ShardSplitTest.testSplitShardWithRuleLink-seed#[F487E4BABD74F40D]-EventThread) [     ] o.a.s.c.c.SolrZkClient Submitting job to respond to event WatchedEvent state:Closed type:None path:null
   [junit4]   2> 1107625 DEBUG (TEST-ShardSplitTest.testSplitShardWithRuleLink-seed#[F487E4BABD74F40D]-EventThread) [     ] o.a.s.c.c.SolrZkClient Submitting job to respond to event WatchedEvent state:Closed type:None path:null
   [junit4]   2> 1107625 DEBUG (TEST-ShardSplitTest.testSplitShardWithRuleLink-seed#[F487E4BABD74F40D]-EventThread) [     ] o.a.s.c.c.SolrZkClient Submitting job to respond to event WatchedEvent state:Closed type:None path:null
   [junit4]   2> 1107625 INFO  (closeThreadPool-8387-thread-2) [     ] o.a.s.c.Overseer Overseer (id=72164958355390468-127.0.0.1:33359_p%2Ff-n_0000000000) closing
   [junit4]   2> 1107626 INFO  (closeThreadPool-8387-thread-2) [     ] o.e.j.s.AbstractConnector Stopped ServerConnector@558c56cf{HTTP/1.1, (http/1.1, h2c)}{127.0.0.1:0}
   [junit4]   2> 1107627 INFO  (closeThreadPool-8387-thread-2) [     ] o.e.j.s.h.ContextHandler Stopped o.e.j.s.ServletContextHandler@3ae00bad{/p/f,null,STOPPED}
   [junit4]   2> 1107627 INFO  (closeThreadPool-8387-thread-2) [     ] o.e.j.s.session node0 Stopped scavenging
   [junit4]   2> 1107633 INFO  (TEST-ShardSplitTest.testSplitShardWithRuleLink-seed#[F487E4BABD74F40D]) [     ] o.a.s.u.ErrorLogMuter Closing ErrorLogMuter-regex-170 after mutting 0 log messages
   [junit4]   2> 1107633 INFO  (TEST-ShardSplitTest.testSplitShardWithRuleLink-seed#[F487E4BABD74F40D]) [     ] o.a.s.u.ErrorLogMuter Creating ErrorLogMuter-regex-171 for ERROR logs matching regex: ignore_exception
   [junit4]   2> 1107634 INFO  (TEST-ShardSplitTest.testSplitShardWithRuleLink-seed#[F487E4BABD74F40D]) [     ] o.a.s.c.ZkTestServer Shutting down ZkTestServer.
   [junit4]   2> 1107736 DEBUG (TEST-ShardSplitTest.testSplitShardWithRuleLink-seed#[F487E4BABD74F40D]-EventThread) [     ] o.a.s.c.c.SolrZkClient Submitting job to respond to event WatchedEvent state:Closed type:None path:null
   [junit4]   2> 1107738 WARN  (TEST-ShardSplitTest.testSplitShardWithRuleLink-seed#[F487E4BABD74F40D]-SendThread(127.0.0.1:33201)) [     ] o.a.z.ClientCnxn An exception was thrown while closing send thread for session 0x10061a5b4010001.
   [junit4]   2>           => EndOfStreamException: Unable to read additional data from server sessionid 0x10061a5b4010001, likely server has closed socket
   [junit4]   2> 	at org.apache.zookeeper.ClientCnxnSocketNIO.doIO(ClientCnxnSocketNIO.java:77)
   [junit4]   2> org.apache.zookeeper.ClientCnxn$EndOfStreamException: Unable to read additional data from server sessionid 0x10061a5b4010001, likely server has closed socket
   [junit4]   2> 	at org.apache.zookeeper.ClientCnxnSocketNIO.doIO(ClientCnxnSocketNIO.java:77) ~[zookeeper-3.6.2.jar:3.6.2]
   [junit4]   2> 	at org.apache.zookeeper.ClientCnxnSocketNIO.doTransport(ClientCnxnSocketNIO.java:350) ~[zookeeper-3.6.2.jar:3.6.2]
   [junit4]   2> 	at org.apache.zookeeper.ClientCnxn$SendThread.run(ClientCnxn.java:1275) [zookeeper-3.6.2.jar:3.6.2]
   [junit4]   2> 1107838 DEBUG (TEST-ShardSplitTest.testSplitShardWithRuleLink-seed#[F487E4BABD74F40D]-EventThread) [     ] o.a.s.c.c.SolrZkClient Submitting job to respond to event WatchedEvent state:Closed type:None path:null
   [junit4]   2> 1107839 WARN  (ZkTestServer Run Thread) [     ] o.a.s.c.ZkTestServer Watch limit violations: 
   [junit4]   2> Maximum concurrent create/delete watches above limit:
   [junit4]   2> 
   [junit4]   2> 	8	/solr/collections/shardSplitWithRule_link/terms/shard1_0
   [junit4]   2> 	8	/solr/collections/shardSplitWithRule_link/terms/shard1_1
   [junit4]   2> 	7	/solr/aliases.json
   [junit4]   2> 	5	/solr/packages.json
   [junit4]   2> 	5	/solr/collections/shardSplitWithRule_link/terms/shard1
   [junit4]   2> 	5	/solr/security.json
   [junit4]   2> 	5	/solr/configs/conf1
   [junit4]   2> 	5	/solr/collections/collection1/terms/shard1
   [junit4]   2> 	5	/solr/collections/collection1/terms/shard2
   [junit4]   2> 	4	/solr/collections/collection1/collectionprops.json
   [junit4]   2> 	4	/solr/collections/shardSplitWithRule_link/collectionprops.json
   [junit4]   2> 	2	/solr/collections/control_collection/terms/shard1
   [junit4]   2> 
   [junit4]   2> Maximum concurrent data watches above limit:
   [junit4]   2> 
   [junit4]   2> 	46	/solr/collections/collection1/state.json
   [junit4]   2> 	34	/solr/collections/shardSplitWithRule_link/state.json
   [junit4]   2> 	13	/solr/clusterprops.json
   [junit4]   2> 	7	/solr/collections/control_collection/state.json
   [junit4]   2> 	7	/solr/clusterstate.json
   [junit4]   2> 	2	/solr/overseer_elect/election/72164958355390476-127.0.0.1:39303_p%2Ff-n_0000000001
   [junit4]   2> 
   [junit4]   2> Maximum concurrent children watches above limit:
   [junit4]   2> 
   [junit4]   2> 	73	/solr/collections/shardSplitWithRule_link/state.json
   [junit4]   2> 	66	/solr/overseer/queue
   [junit4]   2> 	34	/solr/live_nodes
   [junit4]   2> 	21	/solr/overseer/collection-queue-work
   [junit4]   2> 	13	/solr/collections
   [junit4]   2> 	7	/solr/collections/collection1/state.json
   [junit4]   2> 	2	/solr/collections/control_collection/state.json
   [junit4]   2> 
   [junit4]   2> 1107843 INFO  (TEST-ShardSplitTest.testSplitShardWithRuleLink-seed#[F487E4BABD74F40D]) [     ] o.a.s.c.ZkTestServer waitForServerDown: 127.0.0.1:33201
   [junit4]   2> 1107843 INFO  (TEST-ShardSplitTest.testSplitShardWithRuleLink-seed#[F487E4BABD74F40D]) [     ] o.a.s.c.ZkTestServer parse host and port list: 127.0.0.1:33201
   [junit4]   2> 1107843 INFO  (TEST-ShardSplitTest.testSplitShardWithRuleLink-seed#[F487E4BABD74F40D]) [     ] o.a.s.c.ZkTestServer connecting to 127.0.0.1 33201
   [junit4]   2> 1107849 INFO  (SUITE-ShardSplitTest-seed#[F487E4BABD74F40D]-worker) [     ] o.a.s.u.ErrorLogMuter Closing ErrorLogMuter-regex-171 after mutting 0 log messages
   [junit4]   2> 1107849 INFO  (SUITE-ShardSplitTest-seed#[F487E4BABD74F40D]-worker) [     ] o.a.s.u.ErrorLogMuter Creating ErrorLogMuter-regex-172 for ERROR logs matching regex: ignore_exception
   [junit4]   2> NOTE: leaving temporary files on disk at: /home/jenkins/jenkins-slave/workspace/Lucene/Lucene-Solr-Tests-8.11/solr/build/solr-core/test/J3/temp/solr.cloud.api.collections.ShardSplitTest_F487E4BABD74F40D-001
   [junit4]   2> May 03, 2024 3:53:53 PM com.carrotsearch.randomizedtesting.ThreadLeakControl checkThreadLeaks
   [junit4]   2> WARNING: Will linger awaiting termination of 1 leaked thread(s).
   [junit4]   2> NOTE: test params are: codec=Asserting(Lucene87): {rnd_b=FST50, a_t=Lucene84, _root_=Lucene84, id=FST50, foo_s=Lucene84}, docValues:{_version_=DocValuesFormat(name=Lucene80), a_i=DocValuesFormat(name=Asserting)}, maxPointsInLeafNode=1500, maxMBSortInHeap=6.363653651728106, sim=Asserting(RandomSimilarity(queryNorm=false): {}), locale=sr-Latn, timezone=America/Iqaluit
   [junit4]   2> NOTE: Linux 4.15.0-213-generic amd64/Temurin 1.8.0_362 (64-bit)/cpus=4,threads=1,free=115654032,total=513802240
   [junit4]   2> NOTE: All tests run in this JVM: [TestStressIncrementalBackup, TriggerIntegrationTest, TestBadConfig, TestBooleanSimilarityFactory, TestSolrCLIRunExample, TestExactStatsCache, SecurityConfHandlerTest, SuggesterTest, LegacyCloudClusterPropTest, TestMinMaxOnMultiValuedField, ClassificationUpdateProcessorFactoryTest, ComputePlanActionTest, FullHLLTest, HttpPartitionWithTlogReplicasTest, DeleteLastCustomShardedReplicaTest, JvmMetricsTest, AlternateDirectoryTest, TestBulkSchemaAPI, CdcrWithNodesRestartsTest, TestUtilizeNode, TestCSVResponseWriter, TokenizerChainTest, TestIncrementalCoreBackup, DistributedFacetPivotLargeTest, TestMaxScoreQueryParser, NoCacheHeaderTest, FacetPivot2CollectionsTest, OverseerTaskQueueTest, DeleteStatusTest, TestRecovery, TestLeaderElectionZkExpiry, TestInitQParser, ResponseLogComponentTest, TestSolrCloudWithSecureImpersonation, TestConfigSetsAPIExclusivity, TestSchemaNameResource, TestCollationFieldDocValues, TestSubQueryTransformerDistrib, OrderedExecutorTest, TestStandardQParsers, TestFieldCollectionResource, BackupRestoreApiErrorConditionsTest, TestClusterStateMutator, TlogReplayBufferedWhileIndexingTest, TestCloudRecovery2, NodeLostTriggerTest, TermVectorComponentTest, TestHdfsUpdateLog, SOLR749Test, StatsComponentTest, ZkShardTermsTest, ShardSplitTest]
   [junit4] Completed [390/959 (1!)] on J3 in 336.04s, 11 tests, 1 error, 3 skipped <<< FAILURES!

[...truncated 56212 lines...]

[JENKINS] Lucene » Lucene-Solr-Tests-8.11 - Build # 839 - Still Unstable!

Posted by Apache Jenkins Server <je...@builds.apache.org>.
Build: https://ci-builds.apache.org/job/Lucene/job/Lucene-Solr-Tests-8.11/839/

1 tests failed.
FAILED:  org.apache.solr.cloud.api.collections.ShardSplitTest.testSplitMixedReplicaTypes

Error Message:
Timeout occurred while waiting response from server at: http://127.0.0.1:41205

Stack Trace:
org.apache.solr.client.solrj.SolrServerException: Timeout occurred while waiting response from server at: http://127.0.0.1:41205
	at __randomizedtesting.SeedInfo.seed([3E39051B1337B874:86FA51BBEFEC6D01]:0)
	at org.apache.solr.client.solrj.impl.HttpSolrClient.executeMethod(HttpSolrClient.java:692)
	at org.apache.solr.client.solrj.impl.HttpSolrClient.request(HttpSolrClient.java:266)
	at org.apache.solr.client.solrj.impl.HttpSolrClient.request(HttpSolrClient.java:248)
	at org.apache.solr.client.solrj.impl.LBSolrClient.doRequest(LBSolrClient.java:369)
	at org.apache.solr.client.solrj.impl.LBSolrClient.request(LBSolrClient.java:297)
	at org.apache.solr.client.solrj.impl.BaseCloudSolrClient.sendRequest(BaseCloudSolrClient.java:1188)
	at org.apache.solr.client.solrj.impl.BaseCloudSolrClient.requestWithRetryOnStaleState(BaseCloudSolrClient.java:934)
	at org.apache.solr.client.solrj.impl.BaseCloudSolrClient.request(BaseCloudSolrClient.java:866)
	at org.apache.solr.client.solrj.SolrRequest.process(SolrRequest.java:225)
	at org.apache.solr.client.solrj.SolrRequest.process(SolrRequest.java:242)
	at org.apache.solr.cloud.api.collections.ShardSplitTest.doSplitMixedReplicaTypes(ShardSplitTest.java:365)
	at org.apache.solr.cloud.api.collections.ShardSplitTest.testSplitMixedReplicaTypes(ShardSplitTest.java:350)
	at sun.reflect.NativeMethodAccessorImpl.invoke0(Native Method)
	at sun.reflect.NativeMethodAccessorImpl.invoke(NativeMethodAccessorImpl.java:62)
	at sun.reflect.DelegatingMethodAccessorImpl.invoke(DelegatingMethodAccessorImpl.java:43)
	at java.lang.reflect.Method.invoke(Method.java:498)
	at com.carrotsearch.randomizedtesting.RandomizedRunner.invoke(RandomizedRunner.java:1758)
	at com.carrotsearch.randomizedtesting.RandomizedRunner$8.evaluate(RandomizedRunner.java:946)
	at com.carrotsearch.randomizedtesting.RandomizedRunner$9.evaluate(RandomizedRunner.java:982)
	at com.carrotsearch.randomizedtesting.RandomizedRunner$10.evaluate(RandomizedRunner.java:996)
	at org.apache.solr.BaseDistributedSearchTestCase$ShardsRepeatRule$ShardsFixedStatement.callStatement(BaseDistributedSearchTestCase.java:1084)
	at org.apache.solr.BaseDistributedSearchTestCase$ShardsRepeatRule$ShardsStatement.evaluate(BaseDistributedSearchTestCase.java:1055)
	at com.carrotsearch.randomizedtesting.rules.SystemPropertiesRestoreRule$1.evaluate(SystemPropertiesRestoreRule.java:80)
	at org.junit.rules.RunRules.evaluate(RunRules.java:20)
	at org.apache.lucene.util.TestRuleSetupTeardownChained$1.evaluate(TestRuleSetupTeardownChained.java:49)
	at org.apache.lucene.util.AbstractBeforeAfterRule$1.evaluate(AbstractBeforeAfterRule.java:45)
	at org.apache.lucene.util.TestRuleThreadAndTestName$1.evaluate(TestRuleThreadAndTestName.java:48)
	at org.apache.lucene.util.TestRuleIgnoreAfterMaxFailures$1.evaluate(TestRuleIgnoreAfterMaxFailures.java:64)
	at org.apache.lucene.util.TestRuleMarkFailure$1.evaluate(TestRuleMarkFailure.java:47)
	at org.junit.rules.RunRules.evaluate(RunRules.java:20)
	at com.carrotsearch.randomizedtesting.rules.StatementAdapter.evaluate(StatementAdapter.java:36)
	at com.carrotsearch.randomizedtesting.ThreadLeakControl$StatementRunner.run(ThreadLeakControl.java:390)
	at com.carrotsearch.randomizedtesting.ThreadLeakControl.forkTimeoutingTask(ThreadLeakControl.java:843)
	at com.carrotsearch.randomizedtesting.ThreadLeakControl$3.evaluate(ThreadLeakControl.java:490)
	at com.carrotsearch.randomizedtesting.RandomizedRunner.runSingleTest(RandomizedRunner.java:955)
	at com.carrotsearch.randomizedtesting.RandomizedRunner$5.evaluate(RandomizedRunner.java:840)
	at com.carrotsearch.randomizedtesting.RandomizedRunner$6.evaluate(RandomizedRunner.java:891)
	at com.carrotsearch.randomizedtesting.RandomizedRunner$7.evaluate(RandomizedRunner.java:902)
	at com.carrotsearch.randomizedtesting.rules.StatementAdapter.evaluate(StatementAdapter.java:36)
	at com.carrotsearch.randomizedtesting.rules.SystemPropertiesRestoreRule$1.evaluate(SystemPropertiesRestoreRule.java:80)
	at org.junit.rules.RunRules.evaluate(RunRules.java:20)
	at org.apache.lucene.util.AbstractBeforeAfterRule$1.evaluate(AbstractBeforeAfterRule.java:45)
	at com.carrotsearch.randomizedtesting.rules.StatementAdapter.evaluate(StatementAdapter.java:36)
	at org.apache.lucene.util.TestRuleStoreClassName$1.evaluate(TestRuleStoreClassName.java:41)
	at com.carrotsearch.randomizedtesting.rules.NoShadowingOrOverridesOnMethodsRule$1.evaluate(NoShadowingOrOverridesOnMethodsRule.java:40)
	at com.carrotsearch.randomizedtesting.rules.NoShadowingOrOverridesOnMethodsRule$1.evaluate(NoShadowingOrOverridesOnMethodsRule.java:40)
	at com.carrotsearch.randomizedtesting.rules.StatementAdapter.evaluate(StatementAdapter.java:36)
	at com.carrotsearch.randomizedtesting.rules.StatementAdapter.evaluate(StatementAdapter.java:36)
	at com.carrotsearch.randomizedtesting.rules.StatementAdapter.evaluate(StatementAdapter.java:36)
	at org.apache.lucene.util.TestRuleAssertionsRequired$1.evaluate(TestRuleAssertionsRequired.java:53)
	at org.apache.lucene.util.TestRuleMarkFailure$1.evaluate(TestRuleMarkFailure.java:47)
	at org.apache.lucene.util.TestRuleIgnoreAfterMaxFailures$1.evaluate(TestRuleIgnoreAfterMaxFailures.java:64)
	at org.apache.lucene.util.TestRuleIgnoreTestSuites$1.evaluate(TestRuleIgnoreTestSuites.java:54)
	at org.junit.rules.RunRules.evaluate(RunRules.java:20)
	at com.carrotsearch.randomizedtesting.rules.StatementAdapter.evaluate(StatementAdapter.java:36)
	at com.carrotsearch.randomizedtesting.ThreadLeakControl$StatementRunner.run(ThreadLeakControl.java:390)
	at com.carrotsearch.randomizedtesting.ThreadLeakControl.lambda$forkTimeoutingTask$0(ThreadLeakControl.java:850)
	at java.lang.Thread.run(Thread.java:750)
Caused by: java.net.SocketTimeoutException: Read timed out
	at java.net.SocketInputStream.socketRead0(Native Method)
	at java.net.SocketInputStream.socketRead(SocketInputStream.java:116)
	at java.net.SocketInputStream.read(SocketInputStream.java:171)
	at java.net.SocketInputStream.read(SocketInputStream.java:141)
	at org.apache.http.impl.io.SessionInputBufferImpl.streamRead(SessionInputBufferImpl.java:137)
	at org.apache.http.impl.io.SessionInputBufferImpl.fillBuffer(SessionInputBufferImpl.java:153)
	at org.apache.http.impl.io.SessionInputBufferImpl.readLine(SessionInputBufferImpl.java:280)
	at org.apache.http.impl.conn.DefaultHttpResponseParser.parseHead(DefaultHttpResponseParser.java:138)
	at org.apache.http.impl.conn.DefaultHttpResponseParser.parseHead(DefaultHttpResponseParser.java:56)
	at org.apache.http.impl.io.AbstractMessageParser.parse(AbstractMessageParser.java:259)
	at org.apache.http.impl.DefaultBHttpClientConnection.receiveResponseHeader(DefaultBHttpClientConnection.java:163)
	at org.apache.http.impl.conn.CPoolProxy.receiveResponseHeader(CPoolProxy.java:157)
	at org.apache.http.protocol.HttpRequestExecutor.doReceiveResponse(HttpRequestExecutor.java:273)
	at org.apache.http.protocol.HttpRequestExecutor.execute(HttpRequestExecutor.java:125)
	at org.apache.http.impl.execchain.MainClientExec.execute(MainClientExec.java:272)
	at org.apache.http.impl.execchain.ProtocolExec.execute(ProtocolExec.java:186)
	at org.apache.http.impl.execchain.RetryExec.execute(RetryExec.java:89)
	at org.apache.http.impl.execchain.RedirectExec.execute(RedirectExec.java:110)
	at org.apache.http.impl.client.InternalHttpClient.doExecute(InternalHttpClient.java:185)
	at org.apache.http.impl.client.CloseableHttpClient.execute(CloseableHttpClient.java:83)
	at org.apache.http.impl.client.CloseableHttpClient.execute(CloseableHttpClient.java:56)
	at org.apache.solr.client.solrj.impl.HttpSolrClient.executeMethod(HttpSolrClient.java:571)
	... 57 more




Build Log:
[...truncated 15872 lines...]
   [junit4] Suite: org.apache.solr.cloud.api.collections.ShardSplitTest
   [junit4]   2> 1818929 INFO  (SUITE-ShardSplitTest-seed#[3E39051B1337B874]-worker) [     ] o.a.s.SolrTestCase Setting 'solr.default.confdir' system property to test-framework derived value of '/home/jenkins/jenkins-slave/workspace/Lucene/Lucene-Solr-Tests-8.11/solr/server/solr/configsets/_default/conf'
   [junit4]   2> 1818931 INFO  (SUITE-ShardSplitTest-seed#[3E39051B1337B874]-worker) [     ] o.a.s.u.ErrorLogMuter Closing ErrorLogMuter-regex-268 after mutting 0 log messages
   [junit4]   2> 1818931 INFO  (SUITE-ShardSplitTest-seed#[3E39051B1337B874]-worker) [     ] o.a.s.u.ErrorLogMuter Creating ErrorLogMuter-regex-269 for ERROR logs matching regex: ignore_exception
   [junit4]   2> 1818932 INFO  (SUITE-ShardSplitTest-seed#[3E39051B1337B874]-worker) [     ] o.a.s.SolrTestCaseJ4 Created dataDir: /home/jenkins/jenkins-slave/workspace/Lucene/Lucene-Solr-Tests-8.11/solr/build/solr-core/test/J0/temp/solr.cloud.api.collections.ShardSplitTest_3E39051B1337B874-001/data-dir-132-001
   [junit4]   2> 1818932 INFO  (SUITE-ShardSplitTest-seed#[3E39051B1337B874]-worker) [     ] o.a.s.SolrTestCaseJ4 Using PointFields (NUMERIC_POINTS_SYSPROP=true) w/NUMERIC_DOCVALUES_SYSPROP=false
   [junit4]   2> 1818932 INFO  (SUITE-ShardSplitTest-seed#[3E39051B1337B874]-worker) [     ] o.a.s.SolrTestCaseJ4 Randomized ssl (false) and clientAuth (false) via: @org.apache.solr.SolrTestCaseJ4$SuppressSSL(bugUrl=https://issues.apache.org/jira/browse/SOLR-5776)
   [junit4]   2> 1818933 INFO  (SUITE-ShardSplitTest-seed#[3E39051B1337B874]-worker) [     ] o.a.s.SolrTestCaseJ4 SecureRandom sanity checks: test.solr.allowed.securerandom=null & java.security.egd=file:/dev/./urandom
   [junit4]   2> 1818933 INFO  (SUITE-ShardSplitTest-seed#[3E39051B1337B874]-worker) [     ] o.a.s.BaseDistributedSearchTestCase Setting hostContext system property: /
   [junit4]   2> 1818937 INFO  (TEST-ShardSplitTest.testSplitShardWithRuleLink-seed#[3E39051B1337B874]) [     ] o.a.s.u.ErrorLogMuter Closing ErrorLogMuter-regex-269 after mutting 0 log messages
   [junit4]   2> 1818937 INFO  (TEST-ShardSplitTest.testSplitShardWithRuleLink-seed#[3E39051B1337B874]) [     ] o.a.s.u.ErrorLogMuter Creating ErrorLogMuter-regex-270 for ERROR logs matching regex: ignore_exception
   [junit4]   2> 1818938 INFO  (TEST-ShardSplitTest.testSplitShardWithRuleLink-seed#[3E39051B1337B874]) [     ] o.a.s.c.ZkTestServer STARTING ZK TEST SERVER
   [junit4]   2> 1818939 INFO  (ZkTestServer Run Thread) [     ] o.a.s.c.ZkTestServer client port: 0.0.0.0/0.0.0.0:0
   [junit4]   2> 1818939 INFO  (ZkTestServer Run Thread) [     ] o.a.s.c.ZkTestServer Starting server
   [junit4]   2> 1818940 WARN  (ZkTestServer Run Thread) [     ] o.a.z.s.ServerCnxnFactory maxCnxns is not configured, using default value 0.
   [junit4]   2> 1819039 INFO  (TEST-ShardSplitTest.testSplitShardWithRuleLink-seed#[3E39051B1337B874]) [     ] o.a.s.c.ZkTestServer start zk server on port: 43837
   [junit4]   2> 1819039 INFO  (TEST-ShardSplitTest.testSplitShardWithRuleLink-seed#[3E39051B1337B874]) [     ] o.a.s.c.ZkTestServer waitForServerUp: 127.0.0.1:43837
   [junit4]   2> 1819039 INFO  (TEST-ShardSplitTest.testSplitShardWithRuleLink-seed#[3E39051B1337B874]) [     ] o.a.s.c.ZkTestServer parse host and port list: 127.0.0.1:43837
   [junit4]   2> 1819039 INFO  (TEST-ShardSplitTest.testSplitShardWithRuleLink-seed#[3E39051B1337B874]) [     ] o.a.s.c.ZkTestServer connecting to 127.0.0.1 43837
   [junit4]   2> 1819040 DEBUG (TEST-ShardSplitTest.testSplitShardWithRuleLink-seed#[3E39051B1337B874]) [     ] o.a.s.c.c.SolrZkClient Using default ZkCredentialsProvider
   [junit4]   2> 1819040 INFO  (TEST-ShardSplitTest.testSplitShardWithRuleLink-seed#[3E39051B1337B874]) [     ] o.a.s.c.c.ConnectionManager Waiting for client to connect to ZooKeeper
   [junit4]   2> 1819043 DEBUG (TEST-ShardSplitTest.testSplitShardWithRuleLink-seed#[3E39051B1337B874]-EventThread) [     ] o.a.s.c.c.SolrZkClient Submitting job to respond to event WatchedEvent state:SyncConnected type:None path:null
   [junit4]   2> 1819043 DEBUG (zkConnectionManagerCallback-16892-thread-1) [     ] o.a.s.c.c.ConnectionManager Watcher org.apache.solr.common.cloud.ConnectionManager@381c9848 name: ZooKeeperConnection Watcher:127.0.0.1:43837 got event WatchedEvent state:SyncConnected type:None path:null path: null type: None
   [junit4]   2> 1819043 INFO  (zkConnectionManagerCallback-16892-thread-1) [     ] o.a.s.c.c.ConnectionManager zkClient has connected
   [junit4]   2> 1819043 INFO  (TEST-ShardSplitTest.testSplitShardWithRuleLink-seed#[3E39051B1337B874]) [     ] o.a.s.c.c.ConnectionManager Client is connected to ZooKeeper
   [junit4]   2> 1819043 DEBUG (TEST-ShardSplitTest.testSplitShardWithRuleLink-seed#[3E39051B1337B874]) [     ] o.a.s.c.c.SolrZkClient Using default ZkACLProvider
   [junit4]   2> 1819044 DEBUG (TEST-ShardSplitTest.testSplitShardWithRuleLink-seed#[3E39051B1337B874]) [     ] o.a.s.c.c.SolrZkClient makePath: /solr
   [junit4]   2> 1819045 DEBUG (TEST-ShardSplitTest.testSplitShardWithRuleLink-seed#[3E39051B1337B874]) [     ] o.a.s.c.c.SolrZkClient Using default ZkCredentialsProvider
   [junit4]   2> 1819045 INFO  (TEST-ShardSplitTest.testSplitShardWithRuleLink-seed#[3E39051B1337B874]) [     ] o.a.s.c.c.ConnectionManager Waiting for client to connect to ZooKeeper
   [junit4]   2> 1819046 DEBUG (TEST-ShardSplitTest.testSplitShardWithRuleLink-seed#[3E39051B1337B874]-EventThread) [     ] o.a.s.c.c.SolrZkClient Submitting job to respond to event WatchedEvent state:SyncConnected type:None path:null
   [junit4]   2> 1819046 DEBUG (zkConnectionManagerCallback-16894-thread-1) [     ] o.a.s.c.c.ConnectionManager Watcher org.apache.solr.common.cloud.ConnectionManager@6bfcdcfa name: ZooKeeperConnection Watcher:127.0.0.1:43837/solr got event WatchedEvent state:SyncConnected type:None path:null path: null type: None
   [junit4]   2> 1819046 INFO  (zkConnectionManagerCallback-16894-thread-1) [     ] o.a.s.c.c.ConnectionManager zkClient has connected
   [junit4]   2> 1819046 INFO  (TEST-ShardSplitTest.testSplitShardWithRuleLink-seed#[3E39051B1337B874]) [     ] o.a.s.c.c.ConnectionManager Client is connected to ZooKeeper
   [junit4]   2> 1819047 DEBUG (TEST-ShardSplitTest.testSplitShardWithRuleLink-seed#[3E39051B1337B874]) [     ] o.a.s.c.c.SolrZkClient Using default ZkACLProvider
   [junit4]   2> 1819047 DEBUG (TEST-ShardSplitTest.testSplitShardWithRuleLink-seed#[3E39051B1337B874]) [     ] o.a.s.c.c.SolrZkClient makePath: /clusterprops.json
   [junit4]   2> 1819047 INFO  (TEST-ShardSplitTest.testSplitShardWithRuleLink-seed#[3E39051B1337B874]) [     ] o.a.s.c.ZkTestServer put /home/jenkins/jenkins-slave/workspace/Lucene/Lucene-Solr-Tests-8.11/solr/core/src/test-files/solr/collection1/conf/solrconfig-tlog.xml to /configs/conf1/solrconfig.xml
   [junit4]   2> 1819048 DEBUG (TEST-ShardSplitTest.testSplitShardWithRuleLink-seed#[3E39051B1337B874]) [     ] o.a.s.c.c.SolrZkClient makePath: /configs/conf1/solrconfig.xml
   [junit4]   2> 1819049 INFO  (TEST-ShardSplitTest.testSplitShardWithRuleLink-seed#[3E39051B1337B874]) [     ] o.a.s.c.ZkTestServer put /home/jenkins/jenkins-slave/workspace/Lucene/Lucene-Solr-Tests-8.11/solr/core/src/test-files/solr/collection1/conf/schema15.xml to /configs/conf1/schema.xml
   [junit4]   2> 1819049 DEBUG (TEST-ShardSplitTest.testSplitShardWithRuleLink-seed#[3E39051B1337B874]) [     ] o.a.s.c.c.SolrZkClient makePath: /configs/conf1/schema.xml
   [junit4]   2> 1819050 INFO  (TEST-ShardSplitTest.testSplitShardWithRuleLink-seed#[3E39051B1337B874]) [     ] o.a.s.c.ZkTestServer put /home/jenkins/jenkins-slave/workspace/Lucene/Lucene-Solr-Tests-8.11/solr/core/src/test-files/solr/collection1/conf/solrconfig.snippet.randomindexconfig.xml to /configs/conf1/solrconfig.snippet.randomindexconfig.xml
   [junit4]   2> 1819050 DEBUG (TEST-ShardSplitTest.testSplitShardWithRuleLink-seed#[3E39051B1337B874]) [     ] o.a.s.c.c.SolrZkClient makePath: /configs/conf1/solrconfig.snippet.randomindexconfig.xml
   [junit4]   2> 1819051 INFO  (TEST-ShardSplitTest.testSplitShardWithRuleLink-seed#[3E39051B1337B874]) [     ] o.a.s.c.ZkTestServer put /home/jenkins/jenkins-slave/workspace/Lucene/Lucene-Solr-Tests-8.11/solr/core/src/test-files/solr/collection1/conf/stopwords.txt to /configs/conf1/stopwords.txt
   [junit4]   2> 1819051 DEBUG (TEST-ShardSplitTest.testSplitShardWithRuleLink-seed#[3E39051B1337B874]) [     ] o.a.s.c.c.SolrZkClient makePath: /configs/conf1/stopwords.txt
   [junit4]   2> 1819052 INFO  (TEST-ShardSplitTest.testSplitShardWithRuleLink-seed#[3E39051B1337B874]) [     ] o.a.s.c.ZkTestServer put /home/jenkins/jenkins-slave/workspace/Lucene/Lucene-Solr-Tests-8.11/solr/core/src/test-files/solr/collection1/conf/protwords.txt to /configs/conf1/protwords.txt
   [junit4]   2> 1819052 DEBUG (TEST-ShardSplitTest.testSplitShardWithRuleLink-seed#[3E39051B1337B874]) [     ] o.a.s.c.c.SolrZkClient makePath: /configs/conf1/protwords.txt
   [junit4]   2> 1819053 INFO  (TEST-ShardSplitTest.testSplitShardWithRuleLink-seed#[3E39051B1337B874]) [     ] o.a.s.c.ZkTestServer put /home/jenkins/jenkins-slave/workspace/Lucene/Lucene-Solr-Tests-8.11/solr/core/src/test-files/solr/collection1/conf/currency.xml to /configs/conf1/currency.xml
   [junit4]   2> 1819053 DEBUG (TEST-ShardSplitTest.testSplitShardWithRuleLink-seed#[3E39051B1337B874]) [     ] o.a.s.c.c.SolrZkClient makePath: /configs/conf1/currency.xml
   [junit4]   2> 1819053 INFO  (TEST-ShardSplitTest.testSplitShardWithRuleLink-seed#[3E39051B1337B874]) [     ] o.a.s.c.ZkTestServer put /home/jenkins/jenkins-slave/workspace/Lucene/Lucene-Solr-Tests-8.11/solr/core/src/test-files/solr/collection1/conf/enumsConfig.xml to /configs/conf1/enumsConfig.xml
   [junit4]   2> 1819054 DEBUG (TEST-ShardSplitTest.testSplitShardWithRuleLink-seed#[3E39051B1337B874]) [     ] o.a.s.c.c.SolrZkClient makePath: /configs/conf1/enumsConfig.xml
   [junit4]   2> 1819054 INFO  (TEST-ShardSplitTest.testSplitShardWithRuleLink-seed#[3E39051B1337B874]) [     ] o.a.s.c.ZkTestServer put /home/jenkins/jenkins-slave/workspace/Lucene/Lucene-Solr-Tests-8.11/solr/core/src/test-files/solr/collection1/conf/open-exchange-rates.json to /configs/conf1/open-exchange-rates.json
   [junit4]   2> 1819054 DEBUG (TEST-ShardSplitTest.testSplitShardWithRuleLink-seed#[3E39051B1337B874]) [     ] o.a.s.c.c.SolrZkClient makePath: /configs/conf1/open-exchange-rates.json
   [junit4]   2> 1819055 INFO  (TEST-ShardSplitTest.testSplitShardWithRuleLink-seed#[3E39051B1337B874]) [     ] o.a.s.c.ZkTestServer put /home/jenkins/jenkins-slave/workspace/Lucene/Lucene-Solr-Tests-8.11/solr/core/src/test-files/solr/collection1/conf/mapping-ISOLatin1Accent.txt to /configs/conf1/mapping-ISOLatin1Accent.txt
   [junit4]   2> 1819055 DEBUG (TEST-ShardSplitTest.testSplitShardWithRuleLink-seed#[3E39051B1337B874]) [     ] o.a.s.c.c.SolrZkClient makePath: /configs/conf1/mapping-ISOLatin1Accent.txt
   [junit4]   2> 1819056 INFO  (TEST-ShardSplitTest.testSplitShardWithRuleLink-seed#[3E39051B1337B874]) [     ] o.a.s.c.ZkTestServer put /home/jenkins/jenkins-slave/workspace/Lucene/Lucene-Solr-Tests-8.11/solr/core/src/test-files/solr/collection1/conf/old_synonyms.txt to /configs/conf1/old_synonyms.txt
   [junit4]   2> 1819057 DEBUG (TEST-ShardSplitTest.testSplitShardWithRuleLink-seed#[3E39051B1337B874]) [     ] o.a.s.c.c.SolrZkClient makePath: /configs/conf1/old_synonyms.txt
   [junit4]   2> 1819058 INFO  (TEST-ShardSplitTest.testSplitShardWithRuleLink-seed#[3E39051B1337B874]) [     ] o.a.s.c.ZkTestServer put /home/jenkins/jenkins-slave/workspace/Lucene/Lucene-Solr-Tests-8.11/solr/core/src/test-files/solr/collection1/conf/synonyms.txt to /configs/conf1/synonyms.txt
   [junit4]   2> 1819058 DEBUG (TEST-ShardSplitTest.testSplitShardWithRuleLink-seed#[3E39051B1337B874]) [     ] o.a.s.c.c.SolrZkClient makePath: /configs/conf1/synonyms.txt
   [junit4]   2> 1819059 INFO  (TEST-ShardSplitTest.testSplitShardWithRuleLink-seed#[3E39051B1337B874]) [     ] o.a.s.c.AbstractFullDistribZkTestBase Will use NRT replicas unless explicitly asked otherwise
   [junit4]   2> 1819204 INFO  (TEST-ShardSplitTest.testSplitShardWithRuleLink-seed#[3E39051B1337B874]) [     ] o.a.s.c.s.e.JettySolrRunner Start Jetty (configured port=0, binding port=0)
   [junit4]   2> 1819204 INFO  (TEST-ShardSplitTest.testSplitShardWithRuleLink-seed#[3E39051B1337B874]) [     ] o.a.s.c.s.e.JettySolrRunner Trying to start Jetty on port 0 try number 2 ...
   [junit4]   2> 1819204 INFO  (TEST-ShardSplitTest.testSplitShardWithRuleLink-seed#[3E39051B1337B874]) [     ] o.e.j.s.Server jetty-9.4.53.v20231009; built: 2023-10-09T12:29:09.265Z; git: 27bde00a0b95a1d5bbee0eae7984f891d2d0f8c9; jvm 1.8.0_362-b09
   [junit4]   2> 1819207 INFO  (TEST-ShardSplitTest.testSplitShardWithRuleLink-seed#[3E39051B1337B874]) [     ] o.e.j.s.session DefaultSessionIdManager workerName=node0
   [junit4]   2> 1819207 INFO  (TEST-ShardSplitTest.testSplitShardWithRuleLink-seed#[3E39051B1337B874]) [     ] o.e.j.s.session No SessionScavenger set, using defaults
   [junit4]   2> 1819207 INFO  (TEST-ShardSplitTest.testSplitShardWithRuleLink-seed#[3E39051B1337B874]) [     ] o.e.j.s.session node0 Scavenging every 660000ms
   [junit4]   2> 1819211 INFO  (TEST-ShardSplitTest.testSplitShardWithRuleLink-seed#[3E39051B1337B874]) [     ] o.e.j.s.h.ContextHandler Started o.e.j.s.ServletContextHandler@9b72c6f{/,null,AVAILABLE}
   [junit4]   2> 1819212 INFO  (TEST-ShardSplitTest.testSplitShardWithRuleLink-seed#[3E39051B1337B874]) [     ] o.e.j.s.AbstractConnector Started ServerConnector@51e9f6d7{HTTP/1.1, (http/1.1, h2c)}{127.0.0.1:33525}
   [junit4]   2> 1819212 INFO  (TEST-ShardSplitTest.testSplitShardWithRuleLink-seed#[3E39051B1337B874]) [     ] o.e.j.s.Server Started @1819244ms
   [junit4]   2> 1819212 INFO  (TEST-ShardSplitTest.testSplitShardWithRuleLink-seed#[3E39051B1337B874]) [     ] o.a.s.c.s.e.JettySolrRunner Jetty properties: {solr.data.dir=/home/jenkins/jenkins-slave/workspace/Lucene/Lucene-Solr-Tests-8.11/solr/build/solr-core/test/J0/temp/solr.cloud.api.collections.ShardSplitTest_3E39051B1337B874-001/tempDir-001/control/data, replicaType=NRT, hostContext=/, hostPort=33525, coreRootDirectory=/home/jenkins/jenkins-slave/workspace/Lucene/Lucene-Solr-Tests-8.11/solr/build/solr-core/test/J0/../../../../../../../../../../../home/jenkins/jenkins-slave/workspace/Lucene/Lucene-Solr-Tests-8.11/solr/build/solr-core/test/J0/temp/solr.cloud.api.collections.ShardSplitTest_3E39051B1337B874-001/control-001/cores}
   [junit4]   2> 1819212 ERROR (TEST-ShardSplitTest.testSplitShardWithRuleLink-seed#[3E39051B1337B874]) [     ] o.a.s.u.StartupLoggingUtils Missing Java Option solr.log.dir. Logging may be missing or incomplete.
   [junit4]   2> 1819212 INFO  (TEST-ShardSplitTest.testSplitShardWithRuleLink-seed#[3E39051B1337B874]) [     ] o.a.s.s.SolrDispatchFilter Using logger factory org.apache.logging.slf4j.Log4jLoggerFactory
   [junit4]   2> 1819212 INFO  (TEST-ShardSplitTest.testSplitShardWithRuleLink-seed#[3E39051B1337B874]) [     ] o.a.s.s.SolrDispatchFilter  ___      _       Welcome to Apache Solr™ version 8.11.4
   [junit4]   2> 1819212 INFO  (TEST-ShardSplitTest.testSplitShardWithRuleLink-seed#[3E39051B1337B874]) [     ] o.a.s.s.SolrDispatchFilter / __| ___| |_ _   Starting in cloud mode on port null
   [junit4]   2> 1819212 INFO  (TEST-ShardSplitTest.testSplitShardWithRuleLink-seed#[3E39051B1337B874]) [     ] o.a.s.s.SolrDispatchFilter \__ \/ _ \ | '_|  Install dir: /home/jenkins/jenkins-slave/workspace/Lucene/Lucene-Solr-Tests-8.11/solr
   [junit4]   2> 1819212 INFO  (TEST-ShardSplitTest.testSplitShardWithRuleLink-seed#[3E39051B1337B874]) [     ] o.a.s.s.SolrDispatchFilter |___/\___/_|_|    Start time: 2024-05-04T21:41:24.157Z
   [junit4]   2> 1819212 DEBUG (TEST-ShardSplitTest.testSplitShardWithRuleLink-seed#[3E39051B1337B874]) [     ] o.a.s.c.c.SolrZkClient Using default ZkCredentialsProvider
   [junit4]   2> 1819213 INFO  (TEST-ShardSplitTest.testSplitShardWithRuleLink-seed#[3E39051B1337B874]) [     ] o.a.s.c.c.ConnectionManager Waiting for client to connect to ZooKeeper
   [junit4]   2> 1819214 DEBUG (TEST-ShardSplitTest.testSplitShardWithRuleLink-seed#[3E39051B1337B874]-EventThread) [     ] o.a.s.c.c.SolrZkClient Submitting job to respond to event WatchedEvent state:SyncConnected type:None path:null
   [junit4]   2> 1819215 DEBUG (zkConnectionManagerCallback-16896-thread-1) [     ] o.a.s.c.c.ConnectionManager Watcher org.apache.solr.common.cloud.ConnectionManager@7d57eea1 name: ZooKeeperConnection Watcher:127.0.0.1:43837/solr got event WatchedEvent state:SyncConnected type:None path:null path: null type: None
   [junit4]   2> 1819215 INFO  (zkConnectionManagerCallback-16896-thread-1) [     ] o.a.s.c.c.ConnectionManager zkClient has connected
   [junit4]   2> 1819215 INFO  (TEST-ShardSplitTest.testSplitShardWithRuleLink-seed#[3E39051B1337B874]) [     ] o.a.s.c.c.ConnectionManager Client is connected to ZooKeeper
   [junit4]   2> 1819216 DEBUG (TEST-ShardSplitTest.testSplitShardWithRuleLink-seed#[3E39051B1337B874]) [     ] o.a.s.c.c.SolrZkClient Using default ZkACLProvider
   [junit4]   2> 1819317 DEBUG (TEST-ShardSplitTest.testSplitShardWithRuleLink-seed#[3E39051B1337B874]-EventThread) [     ] o.a.s.c.c.SolrZkClient Submitting job to respond to event WatchedEvent state:Closed type:None path:null
   [junit4]   2> 1819317 INFO  (TEST-ShardSplitTest.testSplitShardWithRuleLink-seed#[3E39051B1337B874]) [     ] o.a.s.s.SolrDispatchFilter Loading solr.xml from SolrHome (not found in ZooKeeper)
   [junit4]   2> 1819317 INFO  (TEST-ShardSplitTest.testSplitShardWithRuleLink-seed#[3E39051B1337B874]) [     ] o.a.s.c.SolrXmlConfig Loading container configuration from /home/jenkins/jenkins-slave/workspace/Lucene/Lucene-Solr-Tests-8.11/solr/build/solr-core/test/J0/../../../../../../../../../../../home/jenkins/jenkins-slave/workspace/Lucene/Lucene-Solr-Tests-8.11/solr/build/solr-core/test/J0/temp/solr.cloud.api.collections.ShardSplitTest_3E39051B1337B874-001/control-001/solr.xml
   [junit4]   2> 1819319 INFO  (TEST-ShardSplitTest.testSplitShardWithRuleLink-seed#[3E39051B1337B874]) [     ] o.a.s.c.SolrXmlConfig Configuration parameter autoReplicaFailoverWorkLoopDelay is ignored
   [junit4]   2> 1819320 INFO  (TEST-ShardSplitTest.testSplitShardWithRuleLink-seed#[3E39051B1337B874]) [     ] o.a.s.c.SolrXmlConfig Configuration parameter autoReplicaFailoverBadNodeExpiration is ignored
   [junit4]   2> 1819321 INFO  (TEST-ShardSplitTest.testSplitShardWithRuleLink-seed#[3E39051B1337B874]) [     ] o.a.s.c.SolrXmlConfig MBean server found: com.sun.jmx.mbeanserver.JmxMBeanServer@6db183cf, but no JMX reporters were configured - adding default JMX reporter.
   [junit4]   2> 1820926 INFO  (TEST-ShardSplitTest.testSplitShardWithRuleLink-seed#[3E39051B1337B874]) [     ] o.a.s.h.c.HttpShardHandlerFactory Host whitelist initialized: WhitelistHostChecker [whitelistHosts=null, whitelistHostCheckingEnabled=false]
   [junit4]   2> 1820927 WARN  (TEST-ShardSplitTest.testSplitShardWithRuleLink-seed#[3E39051B1337B874]) [     ] o.e.j.u.s.S.config Trusting all certificates configured for Client@1a14197e[provider=null,keyStore=null,trustStore=null]
   [junit4]   2> 1820927 WARN  (TEST-ShardSplitTest.testSplitShardWithRuleLink-seed#[3E39051B1337B874]) [     ] o.e.j.u.s.S.config No Client EndPointIdentificationAlgorithm configured for Client@1a14197e[provider=null,keyStore=null,trustStore=null]
   [junit4]   2> 1820930 WARN  (TEST-ShardSplitTest.testSplitShardWithRuleLink-seed#[3E39051B1337B874]) [     ] o.e.j.u.s.S.config Trusting all certificates configured for Client@60a2b8d3[provider=null,keyStore=null,trustStore=null]
   [junit4]   2> 1820930 WARN  (TEST-ShardSplitTest.testSplitShardWithRuleLink-seed#[3E39051B1337B874]) [     ] o.e.j.u.s.S.config No Client EndPointIdentificationAlgorithm configured for Client@60a2b8d3[provider=null,keyStore=null,trustStore=null]
   [junit4]   2> 1820931 INFO  (TEST-ShardSplitTest.testSplitShardWithRuleLink-seed#[3E39051B1337B874]) [     ] o.a.s.c.ZkContainer Zookeeper client=127.0.0.1:43837/solr
   [junit4]   2> 1820931 DEBUG (TEST-ShardSplitTest.testSplitShardWithRuleLink-seed#[3E39051B1337B874]) [     ] o.a.s.c.c.SolrZkClient Using default ZkCredentialsProvider
   [junit4]   2> 1820932 INFO  (TEST-ShardSplitTest.testSplitShardWithRuleLink-seed#[3E39051B1337B874]) [     ] o.a.s.c.c.ConnectionManager Waiting for client to connect to ZooKeeper
   [junit4]   2> 1820933 DEBUG (TEST-ShardSplitTest.testSplitShardWithRuleLink-seed#[3E39051B1337B874]-EventThread) [     ] o.a.s.c.c.SolrZkClient Submitting job to respond to event WatchedEvent state:SyncConnected type:None path:null
   [junit4]   2> 1820933 DEBUG (zkConnectionManagerCallback-16907-thread-1) [     ] o.a.s.c.c.ConnectionManager Watcher org.apache.solr.common.cloud.ConnectionManager@617e72b5 name: ZooKeeperConnection Watcher:127.0.0.1:43837 got event WatchedEvent state:SyncConnected type:None path:null path: null type: None
   [junit4]   2> 1820933 INFO  (zkConnectionManagerCallback-16907-thread-1) [     ] o.a.s.c.c.ConnectionManager zkClient has connected
   [junit4]   2> 1820933 INFO  (TEST-ShardSplitTest.testSplitShardWithRuleLink-seed#[3E39051B1337B874]) [     ] o.a.s.c.c.ConnectionManager Client is connected to ZooKeeper
   [junit4]   2> 1820933 DEBUG (TEST-ShardSplitTest.testSplitShardWithRuleLink-seed#[3E39051B1337B874]) [     ] o.a.s.c.c.SolrZkClient Using default ZkACLProvider
   [junit4]   2> 1821034 DEBUG (TEST-ShardSplitTest.testSplitShardWithRuleLink-seed#[3E39051B1337B874]-EventThread) [     ] o.a.s.c.c.SolrZkClient Submitting job to respond to event WatchedEvent state:Closed type:None path:null
   [junit4]   2> 1821035 INFO  (TEST-ShardSplitTest.testSplitShardWithRuleLink-seed#[3E39051B1337B874]) [n:127.0.0.1:33525_     ] o.a.s.c.c.ConnectionManager Waiting for client to connect to ZooKeeper
   [junit4]   2> 1821036 DEBUG (TEST-ShardSplitTest.testSplitShardWithRuleLink-seed#[3E39051B1337B874]-EventThread) [     ] o.a.s.c.c.SolrZkClient Submitting job to respond to event WatchedEvent state:SyncConnected type:None path:null
   [junit4]   2> 1821036 DEBUG (zkConnectionManagerCallback-16909-thread-1) [     ] o.a.s.c.c.ConnectionManager Watcher org.apache.solr.common.cloud.ConnectionManager@65c4a2a name: ZooKeeperConnection Watcher:127.0.0.1:43837/solr got event WatchedEvent state:SyncConnected type:None path:null path: null type: None
   [junit4]   2> 1821036 INFO  (zkConnectionManagerCallback-16909-thread-1) [     ] o.a.s.c.c.ConnectionManager zkClient has connected
   [junit4]   2> 1821036 INFO  (TEST-ShardSplitTest.testSplitShardWithRuleLink-seed#[3E39051B1337B874]) [n:127.0.0.1:33525_     ] o.a.s.c.c.ConnectionManager Client is connected to ZooKeeper
   [junit4]   2> 1821037 DEBUG (TEST-ShardSplitTest.testSplitShardWithRuleLink-seed#[3E39051B1337B874]) [n:127.0.0.1:33525_     ] o.a.s.c.c.SolrZkClient makePath: /overseer/collection-map-running
   [junit4]   2> 1821038 DEBUG (TEST-ShardSplitTest.testSplitShardWithRuleLink-seed#[3E39051B1337B874]) [n:127.0.0.1:33525_     ] o.a.s.c.c.SolrZkClient makePath: /overseer/collection-map-completed
   [junit4]   2> 1821039 DEBUG (TEST-ShardSplitTest.testSplitShardWithRuleLink-seed#[3E39051B1337B874]) [n:127.0.0.1:33525_     ] o.a.s.c.c.SolrZkClient makePath: /overseer/collection-map-failure
   [junit4]   2> 1821040 DEBUG (TEST-ShardSplitTest.testSplitShardWithRuleLink-seed#[3E39051B1337B874]) [n:127.0.0.1:33525_     ] o.a.s.c.c.SolrZkClient makePath: /overseer/async_ids
   [junit4]   2> 1821041 DEBUG (TEST-ShardSplitTest.testSplitShardWithRuleLink-seed#[3E39051B1337B874]) [n:127.0.0.1:33525_     ] o.a.s.c.c.SolrZkClient makePath: /live_nodes
   [junit4]   2> 1821041 DEBUG (TEST-ShardSplitTest.testSplitShardWithRuleLink-seed#[3E39051B1337B874]) [n:127.0.0.1:33525_     ] o.a.s.c.c.SolrZkClient makePath: /node_roles
   [junit4]   2> 1821042 DEBUG (TEST-ShardSplitTest.testSplitShardWithRuleLink-seed#[3E39051B1337B874]) [n:127.0.0.1:33525_     ] o.a.s.c.c.SolrZkClient makePath: /node_roles/data
   [junit4]   2> 1821042 DEBUG (TEST-ShardSplitTest.testSplitShardWithRuleLink-seed#[3E39051B1337B874]) [n:127.0.0.1:33525_     ] o.a.s.c.c.SolrZkClient makePath: /node_roles/data/on
   [junit4]   2> 1821043 DEBUG (TEST-ShardSplitTest.testSplitShardWithRuleLink-seed#[3E39051B1337B874]) [n:127.0.0.1:33525_     ] o.a.s.c.c.SolrZkClient makePath: /node_roles/data/off
   [junit4]   2> 1821044 DEBUG (TEST-ShardSplitTest.testSplitShardWithRuleLink-seed#[3E39051B1337B874]) [n:127.0.0.1:33525_     ] o.a.s.c.c.SolrZkClient makePath: /node_roles/overseer
   [junit4]   2> 1821045 DEBUG (TEST-ShardSplitTest.testSplitShardWithRuleLink-seed#[3E39051B1337B874]) [n:127.0.0.1:33525_     ] o.a.s.c.c.SolrZkClient makePath: /node_roles/overseer/allowed
   [junit4]   2> 1821046 DEBUG (TEST-ShardSplitTest.testSplitShardWithRuleLink-seed#[3E39051B1337B874]) [n:127.0.0.1:33525_     ] o.a.s.c.c.SolrZkClient makePath: /node_roles/overseer/preferred
   [junit4]   2> 1821047 DEBUG (TEST-ShardSplitTest.testSplitShardWithRuleLink-seed#[3E39051B1337B874]) [n:127.0.0.1:33525_     ] o.a.s.c.c.SolrZkClient makePath: /node_roles/overseer/disallowed
   [junit4]   2> 1821048 DEBUG (TEST-ShardSplitTest.testSplitShardWithRuleLink-seed#[3E39051B1337B874]) [n:127.0.0.1:33525_     ] o.a.s.c.c.SolrZkClient makePath: /node_roles/coordinator
   [junit4]   2> 1821049 DEBUG (TEST-ShardSplitTest.testSplitShardWithRuleLink-seed#[3E39051B1337B874]) [n:127.0.0.1:33525_     ] o.a.s.c.c.SolrZkClient makePath: /node_roles/coordinator/on
   [junit4]   2> 1821050 DEBUG (TEST-ShardSplitTest.testSplitShardWithRuleLink-seed#[3E39051B1337B874]) [n:127.0.0.1:33525_     ] o.a.s.c.c.SolrZkClient makePath: /node_roles/coordinator/off
   [junit4]   2> 1821051 DEBUG (TEST-ShardSplitTest.testSplitShardWithRuleLink-seed#[3E39051B1337B874]) [n:127.0.0.1:33525_     ] o.a.s.c.c.SolrZkClient makePath: /aliases.json
   [junit4]   2> 1821051 DEBUG (TEST-ShardSplitTest.testSplitShardWithRuleLink-seed#[3E39051B1337B874]) [n:127.0.0.1:33525_     ] o.a.s.c.c.SolrZkClient makePath: /autoscaling/events
   [junit4]   2> 1821052 DEBUG (TEST-ShardSplitTest.testSplitShardWithRuleLink-seed#[3E39051B1337B874]) [n:127.0.0.1:33525_     ] o.a.s.c.c.SolrZkClient makePath: /autoscaling/triggerState
   [junit4]   2> 1821053 DEBUG (TEST-ShardSplitTest.testSplitShardWithRuleLink-seed#[3E39051B1337B874]) [n:127.0.0.1:33525_     ] o.a.s.c.c.SolrZkClient makePath: /autoscaling/nodeAdded
   [junit4]   2> 1821054 DEBUG (TEST-ShardSplitTest.testSplitShardWithRuleLink-seed#[3E39051B1337B874]) [n:127.0.0.1:33525_     ] o.a.s.c.c.SolrZkClient makePath: /autoscaling/nodeLost
   [junit4]   2> 1821054 DEBUG (TEST-ShardSplitTest.testSplitShardWithRuleLink-seed#[3E39051B1337B874]) [n:127.0.0.1:33525_     ] o.a.s.c.c.SolrZkClient makePath: /clusterstate.json
   [junit4]   2> 1821055 DEBUG (TEST-ShardSplitTest.testSplitShardWithRuleLink-seed#[3E39051B1337B874]) [n:127.0.0.1:33525_     ] o.a.s.c.c.SolrZkClient makePath: /autoscaling.json
   [junit4]   2> 1821055 DEBUG (TEST-ShardSplitTest.testSplitShardWithRuleLink-seed#[3E39051B1337B874]) [n:127.0.0.1:33525_     ] o.a.s.c.c.SolrZkClient makePath: /security.json
   [junit4]   2> 1821056 DEBUG (TEST-ShardSplitTest.testSplitShardWithRuleLink-seed#[3E39051B1337B874]) [n:127.0.0.1:33525_     ] o.a.s.c.c.SolrZkClient makePath: /configs/_default/protwords.txt
   [junit4]   2> 1821057 DEBUG (TEST-ShardSplitTest.testSplitShardWithRuleLink-seed#[3E39051B1337B874]) [n:127.0.0.1:33525_     ] o.a.s.c.c.SolrZkClient makePath: /configs/_default/managed-schema
   [junit4]   2> 1821058 DEBUG (TEST-ShardSplitTest.testSplitShardWithRuleLink-seed#[3E39051B1337B874]) [n:127.0.0.1:33525_     ] o.a.s.c.c.SolrZkClient makePath: /configs/_default/solrconfig.xml
   [junit4]   2> 1821060 DEBUG (TEST-ShardSplitTest.testSplitShardWithRuleLink-seed#[3E39051B1337B874]) [n:127.0.0.1:33525_     ] o.a.s.c.c.SolrZkClient makePath: /configs/_default/synonyms.txt
   [junit4]   2> 1821061 DEBUG (TEST-ShardSplitTest.testSplitShardWithRuleLink-seed#[3E39051B1337B874]) [n:127.0.0.1:33525_     ] o.a.s.c.c.SolrZkClient makePath: /configs/_default/lang/stopwords_it.txt
   [junit4]   2> 1821062 DEBUG (TEST-ShardSplitTest.testSplitShardWithRuleLink-seed#[3E39051B1337B874]) [n:127.0.0.1:33525_     ] o.a.s.c.c.SolrZkClient makePath: /configs/_default/lang/stopwords_cz.txt
   [junit4]   2> 1821064 DEBUG (TEST-ShardSplitTest.testSplitShardWithRuleLink-seed#[3E39051B1337B874]) [n:127.0.0.1:33525_     ] o.a.s.c.c.SolrZkClient makePath: /configs/_default/lang/stopwords_fr.txt
   [junit4]   2> 1821065 DEBUG (TEST-ShardSplitTest.testSplitShardWithRuleLink-seed#[3E39051B1337B874]) [n:127.0.0.1:33525_     ] o.a.s.c.c.SolrZkClient makePath: /configs/_default/lang/stopwords_no.txt
   [junit4]   2> 1821066 DEBUG (TEST-ShardSplitTest.testSplitShardWithRuleLink-seed#[3E39051B1337B874]) [n:127.0.0.1:33525_     ] o.a.s.c.c.SolrZkClient makePath: /configs/_default/lang/contractions_ca.txt
   [junit4]   2> 1821067 DEBUG (TEST-ShardSplitTest.testSplitShardWithRuleLink-seed#[3E39051B1337B874]) [n:127.0.0.1:33525_     ] o.a.s.c.c.SolrZkClient makePath: /configs/_default/lang/stopwords_sv.txt
   [junit4]   2> 1821068 DEBUG (TEST-ShardSplitTest.testSplitShardWithRuleLink-seed#[3E39051B1337B874]) [n:127.0.0.1:33525_     ] o.a.s.c.c.SolrZkClient makePath: /configs/_default/lang/stopwords_ca.txt
   [junit4]   2> 1821069 DEBUG (TEST-ShardSplitTest.testSplitShardWithRuleLink-seed#[3E39051B1337B874]) [n:127.0.0.1:33525_     ] o.a.s.c.c.SolrZkClient makePath: /configs/_default/lang/stopwords_hu.txt
   [junit4]   2> 1821070 DEBUG (TEST-ShardSplitTest.testSplitShardWithRuleLink-seed#[3E39051B1337B874]) [n:127.0.0.1:33525_     ] o.a.s.c.c.SolrZkClient makePath: /configs/_default/lang/stopwords_gl.txt
   [junit4]   2> 1821072 DEBUG (TEST-ShardSplitTest.testSplitShardWithRuleLink-seed#[3E39051B1337B874]) [n:127.0.0.1:33525_     ] o.a.s.c.c.SolrZkClient makePath: /configs/_default/lang/stopwords_bg.txt
   [junit4]   2> 1821073 DEBUG (TEST-ShardSplitTest.testSplitShardWithRuleLink-seed#[3E39051B1337B874]) [n:127.0.0.1:33525_     ] o.a.s.c.c.SolrZkClient makePath: /configs/_default/lang/stopwords_th.txt
   [junit4]   2> 1821074 DEBUG (TEST-ShardSplitTest.testSplitShardWithRuleLink-seed#[3E39051B1337B874]) [n:127.0.0.1:33525_     ] o.a.s.c.c.SolrZkClient makePath: /configs/_default/lang/stopwords_ga.txt
   [junit4]   2> 1821076 DEBUG (TEST-ShardSplitTest.testSplitShardWithRuleLink-seed#[3E39051B1337B874]) [n:127.0.0.1:33525_     ] o.a.s.c.c.SolrZkClient makePath: /configs/_default/lang/stopwords_da.txt
   [junit4]   2> 1821077 DEBUG (TEST-ShardSplitTest.testSplitShardWithRuleLink-seed#[3E39051B1337B874]) [n:127.0.0.1:33525_     ] o.a.s.c.c.SolrZkClient makePath: /configs/_default/lang/stopwords_et.txt
   [junit4]   2> 1821078 DEBUG (TEST-ShardSplitTest.testSplitShardWithRuleLink-seed#[3E39051B1337B874]) [n:127.0.0.1:33525_     ] o.a.s.c.c.SolrZkClient makePath: /configs/_default/lang/userdict_ja.txt
   [junit4]   2> 1821079 DEBUG (TEST-ShardSplitTest.testSplitShardWithRuleLink-seed#[3E39051B1337B874]) [n:127.0.0.1:33525_     ] o.a.s.c.c.SolrZkClient makePath: /configs/_default/lang/contractions_ga.txt
   [junit4]   2> 1821080 DEBUG (TEST-ShardSplitTest.testSplitShardWithRuleLink-seed#[3E39051B1337B874]) [n:127.0.0.1:33525_     ] o.a.s.c.c.SolrZkClient makePath: /configs/_default/lang/stopwords_id.txt
   [junit4]   2> 1821082 DEBUG (TEST-ShardSplitTest.testSplitShardWithRuleLink-seed#[3E39051B1337B874]) [n:127.0.0.1:33525_     ] o.a.s.c.c.SolrZkClient makePath: /configs/_default/lang/stopwords_tr.txt
   [junit4]   2> 1821083 DEBUG (TEST-ShardSplitTest.testSplitShardWithRuleLink-seed#[3E39051B1337B874]) [n:127.0.0.1:33525_     ] o.a.s.c.c.SolrZkClient makePath: /configs/_default/lang/stopwords_ja.txt
   [junit4]   2> 1821084 DEBUG (TEST-ShardSplitTest.testSplitShardWithRuleLink-seed#[3E39051B1337B874]) [n:127.0.0.1:33525_     ] o.a.s.c.c.SolrZkClient makePath: /configs/_default/lang/stopwords_ar.txt
   [junit4]   2> 1821085 DEBUG (TEST-ShardSplitTest.testSplitShardWithRuleLink-seed#[3E39051B1337B874]) [n:127.0.0.1:33525_     ] o.a.s.c.c.SolrZkClient makePath: /configs/_default/lang/stopwords_ru.txt
   [junit4]   2> 1821086 DEBUG (TEST-ShardSplitTest.testSplitShardWithRuleLink-seed#[3E39051B1337B874]) [n:127.0.0.1:33525_     ] o.a.s.c.c.SolrZkClient makePath: /configs/_default/lang/hyphenations_ga.txt
   [junit4]   2> 1821088 DEBUG (TEST-ShardSplitTest.testSplitShardWithRuleLink-seed#[3E39051B1337B874]) [n:127.0.0.1:33525_     ] o.a.s.c.c.SolrZkClient makePath: /configs/_default/lang/stopwords_de.txt
   [junit4]   2> 1821089 DEBUG (TEST-ShardSplitTest.testSplitShardWithRuleLink-seed#[3E39051B1337B874]) [n:127.0.0.1:33525_     ] o.a.s.c.c.SolrZkClient makePath: /configs/_default/lang/stopwords_en.txt
   [junit4]   2> 1821090 DEBUG (TEST-ShardSplitTest.testSplitShardWithRuleLink-seed#[3E39051B1337B874]) [n:127.0.0.1:33525_     ] o.a.s.c.c.SolrZkClient makePath: /configs/_default/lang/stemdict_nl.txt
   [junit4]   2> 1821092 DEBUG (TEST-ShardSplitTest.testSplitShardWithRuleLink-seed#[3E39051B1337B874]) [n:127.0.0.1:33525_     ] o.a.s.c.c.SolrZkClient makePath: /configs/_default/lang/stopwords_ro.txt
   [junit4]   2> 1821094 DEBUG (TEST-ShardSplitTest.testSplitShardWithRuleLink-seed#[3E39051B1337B874]) [n:127.0.0.1:33525_     ] o.a.s.c.c.SolrZkClient makePath: /configs/_default/lang/stopwords_hy.txt
   [junit4]   2> 1821095 DEBUG (TEST-ShardSplitTest.testSplitShardWithRuleLink-seed#[3E39051B1337B874]) [n:127.0.0.1:33525_     ] o.a.s.c.c.SolrZkClient makePath: /configs/_default/lang/stopwords_eu.txt
   [junit4]   2> 1821096 DEBUG (TEST-ShardSplitTest.testSplitShardWithRuleLink-seed#[3E39051B1337B874]) [n:127.0.0.1:33525_     ] o.a.s.c.c.SolrZkClient makePath: /configs/_default/lang/stopwords_hi.txt
   [junit4]   2> 1821097 DEBUG (TEST-ShardSplitTest.testSplitShardWithRuleLink-seed#[3E39051B1337B874]) [n:127.0.0.1:33525_     ] o.a.s.c.c.SolrZkClient makePath: /configs/_default/lang/stoptags_ja.txt
   [junit4]   2> 1821099 DEBUG (TEST-ShardSplitTest.testSplitShardWithRuleLink-seed#[3E39051B1337B874]) [n:127.0.0.1:33525_     ] o.a.s.c.c.SolrZkClient makePath: /configs/_default/lang/contractions_fr.txt
   [junit4]   2> 1821102 DEBUG (TEST-ShardSplitTest.testSplitShardWithRuleLink-seed#[3E39051B1337B874]) [n:127.0.0.1:33525_     ] o.a.s.c.c.SolrZkClient makePath: /configs/_default/lang/stopwords_fi.txt
   [junit4]   2> 1821109 DEBUG (TEST-ShardSplitTest.testSplitShardWithRuleLink-seed#[3E39051B1337B874]) [n:127.0.0.1:33525_     ] o.a.s.c.c.SolrZkClient makePath: /configs/_default/lang/stopwords_pt.txt
   [junit4]   2> 1821111 DEBUG (TEST-ShardSplitTest.testSplitShardWithRuleLink-seed#[3E39051B1337B874]) [n:127.0.0.1:33525_     ] o.a.s.c.c.SolrZkClient makePath: /configs/_default/lang/stopwords_lv.txt
   [junit4]   2> 1821112 DEBUG (TEST-ShardSplitTest.testSplitShardWithRuleLink-seed#[3E39051B1337B874]) [n:127.0.0.1:33525_     ] o.a.s.c.c.SolrZkClient makePath: /configs/_default/lang/stopwords_el.txt
   [junit4]   2> 1821117 DEBUG (TEST-ShardSplitTest.testSplitShardWithRuleLink-seed#[3E39051B1337B874]) [n:127.0.0.1:33525_     ] o.a.s.c.c.SolrZkClient makePath: /configs/_default/lang/contractions_it.txt
   [junit4]   2> 1821119 DEBUG (TEST-ShardSplitTest.testSplitShardWithRuleLink-seed#[3E39051B1337B874]) [n:127.0.0.1:33525_     ] o.a.s.c.c.SolrZkClient makePath: /configs/_default/lang/stopwords_nl.txt
   [junit4]   2> 1821120 DEBUG (TEST-ShardSplitTest.testSplitShardWithRuleLink-seed#[3E39051B1337B874]) [n:127.0.0.1:33525_     ] o.a.s.c.c.SolrZkClient makePath: /configs/_default/lang/stopwords_es.txt
   [junit4]   2> 1821121 DEBUG (TEST-ShardSplitTest.testSplitShardWithRuleLink-seed#[3E39051B1337B874]) [n:127.0.0.1:33525_     ] o.a.s.c.c.SolrZkClient makePath: /configs/_default/lang/stopwords_fa.txt
   [junit4]   2> 1821123 DEBUG (TEST-ShardSplitTest.testSplitShardWithRuleLink-seed#[3E39051B1337B874]) [n:127.0.0.1:33525_     ] o.a.s.c.c.SolrZkClient makePath: /configs/_default/stopwords.txt
   [junit4]   2> 1821127 WARN  (TEST-ShardSplitTest.testSplitShardWithRuleLink-seed#[3E39051B1337B874]) [n:127.0.0.1:33525_     ] o.a.s.c.ZkController Contents of zookeeper /security.json are world-readable; consider setting up ACLs as described in https://solr.apache.org/guide/zookeeper-access-control.html
   [junit4]   2> 1821127 DEBUG (TEST-ShardSplitTest.testSplitShardWithRuleLink-seed#[3E39051B1337B874]) [n:127.0.0.1:33525_     ] o.a.s.c.c.ZkStateReader Updating cluster state from ZooKeeper... 
   [junit4]   2> 1821128 DEBUG (TEST-ShardSplitTest.testSplitShardWithRuleLink-seed#[3E39051B1337B874]) [n:127.0.0.1:33525_     ] o.a.s.c.c.ZkStateReader Loaded cluster properties: {legacyCloud=true}
   [junit4]   2> 1821128 DEBUG (TEST-ShardSplitTest.testSplitShardWithRuleLink-seed#[3E39051B1337B874]) [n:127.0.0.1:33525_     ] o.a.s.c.c.ZkStateReader Updated live nodes from ZooKeeper... [] -> []
   [junit4]   2> 1821129 DEBUG (TEST-ShardSplitTest.testSplitShardWithRuleLink-seed#[3E39051B1337B874]) [n:127.0.0.1:33525_     ] o.a.s.c.c.ZkStateReader clusterStateSet: legacy [0] interesting [0] watched [0] lazy [2] total [2]
   [junit4]   2> 1821129 DEBUG (TEST-ShardSplitTest.testSplitShardWithRuleLink-seed#[3E39051B1337B874]) [n:127.0.0.1:33525_     ] o.a.s.c.c.ZkStateReader$AliasesManager Checking ZK for most up to date Aliases /aliases.json
   [junit4]   2> 1821129 DEBUG (TEST-ShardSplitTest.testSplitShardWithRuleLink-seed#[3E39051B1337B874]) [n:127.0.0.1:33525_     ] o.a.s.c.c.ZkStateReader$AliasesManager Aliases: cmp=-1, new definition is: Aliases{collectionAliases={}, collectionAliasProperties={}, zNodeVersion=0}
   [junit4]   2> 1821131 DEBUG (TEST-ShardSplitTest.testSplitShardWithRuleLink-seed#[3E39051B1337B874]) [n:127.0.0.1:33525_     ] o.a.s.c.c.SolrZkClient makePath: /overseer_elect
   [junit4]   2> 1821134 DEBUG (TEST-ShardSplitTest.testSplitShardWithRuleLink-seed#[3E39051B1337B874]) [n:127.0.0.1:33525_     ] o.a.s.c.c.SolrZkClient makePath: /overseer_elect/election
   [junit4]   2> 1821135 INFO  (TEST-ShardSplitTest.testSplitShardWithRuleLink-seed#[3E39051B1337B874]) [n:127.0.0.1:33525_     ] o.a.s.c.OverseerElectionContext I am going to be the leader 127.0.0.1:33525_
   [junit4]   2> 1821135 DEBUG (TEST-ShardSplitTest.testSplitShardWithRuleLink-seed#[3E39051B1337B874]) [n:127.0.0.1:33525_     ] o.a.s.c.c.SolrZkClient makePath: /overseer_elect/leader
   [junit4]   2> 1821136 INFO  (TEST-ShardSplitTest.testSplitShardWithRuleLink-seed#[3E39051B1337B874]) [n:127.0.0.1:33525_     ] o.a.s.c.Overseer Overseer (id=72171988199735300-127.0.0.1:33525_-n_0000000000) starting
   [junit4]   2> 1821136 DEBUG (TEST-ShardSplitTest.testSplitShardWithRuleLink-seed#[3E39051B1337B874]) [n:127.0.0.1:33525_     ] o.a.s.c.c.SolrZkClient makePath: /overseer/queue
   [junit4]   2> 1821137 DEBUG (TEST-ShardSplitTest.testSplitShardWithRuleLink-seed#[3E39051B1337B874]) [n:127.0.0.1:33525_     ] o.a.s.c.c.SolrZkClient makePath: /overseer/queue-work
   [junit4]   2> 1821139 DEBUG (TEST-ShardSplitTest.testSplitShardWithRuleLink-seed#[3E39051B1337B874]) [n:127.0.0.1:33525_     ] o.a.s.c.c.SolrZkClient makePath: /overseer/collection-queue-work
   [junit4]   2> 1821141 DEBUG (OverseerCollectionConfigSetProcessor-72171988199735300-127.0.0.1:33525_-n_0000000000) [n:127.0.0.1:33525_     ] o.a.s.c.OverseerTaskProcessor Process current queue of overseer operations
   [junit4]   2> 1821141 INFO  (OverseerStateUpdate-72171988199735300-127.0.0.1:33525_-n_0000000000) [n:127.0.0.1:33525_     ] o.a.s.c.Overseer Starting to work on the main queue : 127.0.0.1:33525_
   [junit4]   2> 1821141 INFO  (TEST-ShardSplitTest.testSplitShardWithRuleLink-seed#[3E39051B1337B874]) [n:127.0.0.1:33525_     ] o.a.s.c.ZkController Register node as live in ZooKeeper:/live_nodes/127.0.0.1:33525_
   [junit4]   2> 1821142 DEBUG (TEST-ShardSplitTest.testSplitShardWithRuleLink-seed#[3E39051B1337B874]-EventThread) [     ] o.a.s.c.c.SolrZkClient Submitting job to respond to event WatchedEvent state:SyncConnected type:NodeChildrenChanged path:/live_nodes
   [junit4]   2> 1821142 INFO  (OverseerStateUpdate-72171988199735300-127.0.0.1:33525_-n_0000000000) [n:127.0.0.1:33525_     ] o.a.s.c.c.ZkStateReader Updated live nodes from ZooKeeper... (0) -> (1)
   [junit4]   2> 1821142 DEBUG (OverseerStateUpdate-72171988199735300-127.0.0.1:33525_-n_0000000000) [n:127.0.0.1:33525_     ] o.a.s.c.c.ZkStateReader Updated live nodes from ZooKeeper... [] -> [127.0.0.1:33525_]
   [junit4]   2> 1821142 DEBUG (zkCallback-16908-thread-1) [     ] o.a.s.c.c.ZkStateReader A live node change: [WatchedEvent state:SyncConnected type:NodeChildrenChanged path:/live_nodes], has occurred - updating... (live nodes size: [1])
   [junit4]   2> 1821142 DEBUG (OverseerStateUpdate-72171988199735300-127.0.0.1:33525_-n_0000000000) [n:127.0.0.1:33525_     ] o.a.s.c.c.ZkStateReader clusterStateSet: legacy [0] interesting [0] watched [0] lazy [2] total [2]
   [junit4]   2> 1821143 DEBUG (zkCallback-16908-thread-1) [     ] o.a.s.c.c.ZkStateReader Updated live nodes from ZooKeeper... [127.0.0.1:33525_] -> [127.0.0.1:33525_]
   [junit4]   2> 1821143 DEBUG (OverseerCollectionConfigSetProcessor-72171988199735300-127.0.0.1:33525_-n_0000000000) [n:127.0.0.1:33525_     ] o.a.s.c.OverseerTaskProcessor Cleaning up work-queue. #Running tasks: 0 #Completed tasks: 0
   [junit4]   2> 1821143 DEBUG (OverseerCollectionConfigSetProcessor-72171988199735300-127.0.0.1:33525_-n_0000000000) [n:127.0.0.1:33525_     ] o.a.s.c.OverseerTaskProcessor RunningTasks: []
   [junit4]   2> 1821143 DEBUG (OverseerCollectionConfigSetProcessor-72171988199735300-127.0.0.1:33525_-n_0000000000) [n:127.0.0.1:33525_     ] o.a.s.c.OverseerTaskProcessor BlockedTasks: []
   [junit4]   2> 1821143 DEBUG (OverseerCollectionConfigSetProcessor-72171988199735300-127.0.0.1:33525_-n_0000000000) [n:127.0.0.1:33525_     ] o.a.s.c.OverseerTaskProcessor CompletedTasks: []
   [junit4]   2> 1821143 INFO  (OverseerCollectionConfigSetProcessor-72171988199735300-127.0.0.1:33525_-n_0000000000) [n:127.0.0.1:33525_     ] o.a.s.c.OverseerTaskProcessor RunningZKTasks: []
   [junit4]   2> 1821144 DEBUG (OverseerAutoScalingTriggerThread-72171988199735300-127.0.0.1:33525_-n_0000000000) [     ] o.a.s.c.c.SolrZkClient makePath: /autoscaling/events/.scheduled_maintenance
   [junit4]   2> 1821144 INFO  (TEST-ShardSplitTest.testSplitShardWithRuleLink-seed#[3E39051B1337B874]) [n:127.0.0.1:33525_     ] o.a.s.c.ZkController non-data nodes now []
   [junit4]   2> 1821146 DEBUG (OverseerAutoScalingTriggerThread-72171988199735300-127.0.0.1:33525_-n_0000000000) [     ] o.a.s.c.c.SolrZkClient makePath: /autoscaling/events/.auto_add_replicas
   [junit4]   2> 1821147 INFO  (TEST-ShardSplitTest.testSplitShardWithRuleLink-seed#[3E39051B1337B874]) [n:127.0.0.1:33525_     ] o.a.s.p.PackageLoader /packages.json updated to version -1
   [junit4]   2> 1821147 WARN  (TEST-ShardSplitTest.testSplitShardWithRuleLink-seed#[3E39051B1337B874]) [n:127.0.0.1:33525_     ] o.a.s.c.CoreContainer Not all security plugins configured!  authentication=disabled authorization=disabled.  Solr is only as secure as you make it. Consider configuring authentication/authorization before exposing Solr to users internal or external.  See https://s.apache.org/solrsecurity for more info
   [junit4]   2> 1821172 INFO  (TEST-ShardSplitTest.testSplitShardWithRuleLink-seed#[3E39051B1337B874]) [n:127.0.0.1:33525_     ] o.a.s.h.a.MetricsHistoryHandler No .system collection, keeping metrics history in memory.
   [junit4]   2> 1821192 INFO  (TEST-ShardSplitTest.testSplitShardWithRuleLink-seed#[3E39051B1337B874]) [n:127.0.0.1:33525_     ] o.a.s.m.r.SolrJmxReporter JMX monitoring for 'solr.node' (registry 'solr.node') enabled at server: com.sun.jmx.mbeanserver.JmxMBeanServer@6db183cf
   [junit4]   2> 1821200 INFO  (TEST-ShardSplitTest.testSplitShardWithRuleLink-seed#[3E39051B1337B874]) [n:127.0.0.1:33525_     ] o.a.s.m.r.SolrJmxReporter JMX monitoring for 'solr.jvm' (registry 'solr.jvm') enabled at server: com.sun.jmx.mbeanserver.JmxMBeanServer@6db183cf
   [junit4]   2> 1821200 INFO  (TEST-ShardSplitTest.testSplitShardWithRuleLink-seed#[3E39051B1337B874]) [n:127.0.0.1:33525_     ] o.a.s.m.r.SolrJmxReporter JMX monitoring for 'solr.jetty' (registry 'solr.jetty') enabled at server: com.sun.jmx.mbeanserver.JmxMBeanServer@6db183cf
   [junit4]   2> 1821201 INFO  (TEST-ShardSplitTest.testSplitShardWithRuleLink-seed#[3E39051B1337B874]) [n:127.0.0.1:33525_     ] o.a.s.c.CorePropertiesLocator Found 0 core definitions underneath /home/jenkins/jenkins-slave/workspace/Lucene/Lucene-Solr-Tests-8.11/solr/build/solr-core/test/J0/temp/solr.cloud.api.collections.ShardSplitTest_3E39051B1337B874-001/control-001/cores
   [junit4]   2> 1821214 DEBUG (TEST-ShardSplitTest.testSplitShardWithRuleLink-seed#[3E39051B1337B874]) [     ] o.a.s.c.c.SolrZkClient Using default ZkCredentialsProvider
   [junit4]   2> 1821215 INFO  (TEST-ShardSplitTest.testSplitShardWithRuleLink-seed#[3E39051B1337B874]) [     ] o.a.s.c.c.ConnectionManager Waiting for client to connect to ZooKeeper
   [junit4]   2> 1821215 DEBUG (TEST-ShardSplitTest.testSplitShardWithRuleLink-seed#[3E39051B1337B874]-EventThread) [     ] o.a.s.c.c.SolrZkClient Submitting job to respond to event WatchedEvent state:SyncConnected type:None path:null
   [junit4]   2> 1821216 DEBUG (zkConnectionManagerCallback-16926-thread-1) [     ] o.a.s.c.c.ConnectionManager Watcher org.apache.solr.common.cloud.ConnectionManager@1a0cc669 name: ZooKeeperConnection Watcher:127.0.0.1:43837/solr got event WatchedEvent state:SyncConnected type:None path:null path: null type: None
   [junit4]   2> 1821216 INFO  (zkConnectionManagerCallback-16926-thread-1) [     ] o.a.s.c.c.ConnectionManager zkClient has connected
   [junit4]   2> 1821216 INFO  (TEST-ShardSplitTest.testSplitShardWithRuleLink-seed#[3E39051B1337B874]) [     ] o.a.s.c.c.ConnectionManager Client is connected to ZooKeeper
   [junit4]   2> 1821216 DEBUG (TEST-ShardSplitTest.testSplitShardWithRuleLink-seed#[3E39051B1337B874]) [     ] o.a.s.c.c.SolrZkClient Using default ZkACLProvider
   [junit4]   2> 1821216 DEBUG (TEST-ShardSplitTest.testSplitShardWithRuleLink-seed#[3E39051B1337B874]) [     ] o.a.s.c.c.ZkStateReader Updating cluster state from ZooKeeper... 
   [junit4]   2> 1821220 DEBUG (TEST-ShardSplitTest.testSplitShardWithRuleLink-seed#[3E39051B1337B874]) [     ] o.a.s.c.c.ZkStateReader Loaded cluster properties: {legacyCloud=true}
   [junit4]   2> 1821220 INFO  (TEST-ShardSplitTest.testSplitShardWithRuleLink-seed#[3E39051B1337B874]) [     ] o.a.s.c.c.ZkStateReader Updated live nodes from ZooKeeper... (0) -> (1)
   [junit4]   2> 1821220 DEBUG (TEST-ShardSplitTest.testSplitShardWithRuleLink-seed#[3E39051B1337B874]) [     ] o.a.s.c.c.ZkStateReader Updated live nodes from ZooKeeper... [] -> [127.0.0.1:33525_]
   [junit4]   2> 1821221 DEBUG (TEST-ShardSplitTest.testSplitShardWithRuleLink-seed#[3E39051B1337B874]) [     ] o.a.s.c.c.ZkStateReader clusterStateSet: legacy [0] interesting [0] watched [0] lazy [2] total [2]
   [junit4]   2> 1821221 DEBUG (TEST-ShardSplitTest.testSplitShardWithRuleLink-seed#[3E39051B1337B874]) [     ] o.a.s.c.c.ZkStateReader$AliasesManager Checking ZK for most up to date Aliases /aliases.json
   [junit4]   2> 1821221 DEBUG (TEST-ShardSplitTest.testSplitShardWithRuleLink-seed#[3E39051B1337B874]) [     ] o.a.s.c.c.ZkStateReader$AliasesManager Aliases: cmp=-1, new definition is: Aliases{collectionAliases={}, collectionAliasProperties={}, zNodeVersion=0}
   [junit4]   2> 1821221 INFO  (TEST-ShardSplitTest.testSplitShardWithRuleLink-seed#[3E39051B1337B874]) [     ] o.a.s.c.s.i.ZkClientClusterStateProvider Cluster at 127.0.0.1:43837/solr ready
   [junit4]   2> 1821222 INFO  (qtp128219985-25812) [n:127.0.0.1:33525_     ] o.a.s.s.HttpSolrCall HttpSolrCall.init(http://127.0.0.1:33525/admin/collections?action=CREATE&name=control_collection&collection.configName=conf1&createNodeSet=127.0.0.1%3A33525_&numShards=1&nrtReplicas=1&wt=javabin&version=2)
   [junit4]   2> 1821223 DEBUG (TEST-ShardSplitTest.testSplitShardWithRuleLink-seed#[3E39051B1337B874]-EventThread) [     ] o.a.s.c.c.SolrZkClient Submitting job to respond to event WatchedEvent state:SyncConnected type:NodeChildrenChanged path:/overseer/collection-queue-work
   [junit4]   2> 1821224 DEBUG (TEST-ShardSplitTest.testSplitShardWithRuleLink-seed#[3E39051B1337B874]-EventThread) [     ] o.a.s.c.c.SolrZkClient Submitting job to respond to event WatchedEvent state:SyncConnected type:NodeChildrenChanged path:/overseer/collection-queue-work
   [junit4]   2> 1821225 DEBUG (OverseerCollectionConfigSetProcessor-72171988199735300-127.0.0.1:33525_-n_0000000000) [n:127.0.0.1:33525_     ] o.a.s.c.OverseerTaskProcessor Got 1 tasks from work-queue : [[org.apache.solr.cloud.OverseerTaskQueue$QueueEvent@2e684ecf]]
   [junit4]   2> 1821225 DEBUG (OverseerCollectionConfigSetProcessor-72171988199735300-127.0.0.1:33525_-n_0000000000) [n:127.0.0.1:33525_     ] o.a.s.c.OverseerTaskProcessor Marked task [/overseer/collection-queue-work/qn-0000000000] as running
   [junit4]   2> 1821225 DEBUG (OverseerCollectionConfigSetProcessor-72171988199735300-127.0.0.1:33525_-n_0000000000) [n:127.0.0.1:33525_     ] o.a.s.c.OverseerTaskProcessor Overseer Collection Message Handler: Get the message id: /overseer/collection-queue-work/qn-0000000000 message: {
   [junit4]   2>   "name":"control_collection",
   [junit4]   2>   "fromApi":"true",
   [junit4]   2>   "collection.configName":"conf1",
   [junit4]   2>   "numShards":"1",
   [junit4]   2>   "createNodeSet":"127.0.0.1:33525_",
   [junit4]   2>   "nrtReplicas":"1",
   [junit4]   2>   "stateFormat":"2",
   [junit4]   2>   "replicationFactor":"1",
   [junit4]   2>   "operation":"create"}
   [junit4]   2> 1821225 DEBUG (OverseerThreadFactory-16916-thread-1-processing-n:127.0.0.1:33525_) [n:127.0.0.1:33525_     ] o.a.s.c.OverseerTaskProcessor Runner processing /overseer/collection-queue-work/qn-0000000000
   [junit4]   2> 1821225 DEBUG (OverseerThreadFactory-16916-thread-1-processing-n:127.0.0.1:33525_) [n:127.0.0.1:33525_     ] o.a.s.c.a.c.OverseerCollectionMessageHandler OverseerCollectionMessageHandler.processMessage : create , {
   [junit4]   2>   "name":"control_collection",
   [junit4]   2>   "fromApi":"true",
   [junit4]   2>   "collection.configName":"conf1",
   [junit4]   2>   "numShards":"1",
   [junit4]   2>   "createNodeSet":"127.0.0.1:33525_",
   [junit4]   2>   "nrtReplicas":"1",
   [junit4]   2>   "stateFormat":"2",
   [junit4]   2>   "replicationFactor":"1",
   [junit4]   2>   "operation":"create"}
   [junit4]   2> 1821225 DEBUG (OverseerCollectionConfigSetProcessor-72171988199735300-127.0.0.1:33525_-n_0000000000) [n:127.0.0.1:33525_     ] o.a.s.c.OverseerTaskProcessor Cleaning up work-queue. #Running tasks: 1 #Completed tasks: 0
   [junit4]   2> 1821225 DEBUG (OverseerCollectionConfigSetProcessor-72171988199735300-127.0.0.1:33525_-n_0000000000) [n:127.0.0.1:33525_     ] o.a.s.c.OverseerTaskProcessor RunningTasks: [/overseer/collection-queue-work/qn-0000000000]
   [junit4]   2> 1821225 DEBUG (OverseerThreadFactory-16916-thread-1-processing-n:127.0.0.1:33525_) [n:127.0.0.1:33525_     ] o.a.s.c.c.ZkStateReader$AliasesManager Checking ZK for most up to date Aliases /aliases.json
   [junit4]   2> 1821225 DEBUG (OverseerCollectionConfigSetProcessor-72171988199735300-127.0.0.1:33525_-n_0000000000) [n:127.0.0.1:33525_     ] o.a.s.c.OverseerTaskProcessor BlockedTasks: []
   [junit4]   2> 1821225 DEBUG (OverseerCollectionConfigSetProcessor-72171988199735300-127.0.0.1:33525_-n_0000000000) [n:127.0.0.1:33525_     ] o.a.s.c.OverseerTaskProcessor CompletedTasks: []
   [junit4]   2> 1821225 INFO  (OverseerCollectionConfigSetProcessor-72171988199735300-127.0.0.1:33525_-n_0000000000) [n:127.0.0.1:33525_     ] o.a.s.c.OverseerTaskProcessor RunningZKTasks: [/overseer/collection-queue-work/qn-0000000000]
   [junit4]   2> 1821226 DEBUG (OverseerThreadFactory-16916-thread-1-processing-n:127.0.0.1:33525_) [n:127.0.0.1:33525_     ] o.a.s.c.c.ZkStateReader$AliasesManager Aliases: cmp=0, not overwriting ZK version.
   [junit4]   2> 1821226 INFO  (OverseerThreadFactory-16916-thread-1-processing-n:127.0.0.1:33525_) [n:127.0.0.1:33525_     ] o.a.s.c.a.c.CreateCollectionCmd Create collection control_collection
   [junit4]   2> 1821227 DEBUG (OverseerThreadFactory-16916-thread-1-processing-n:127.0.0.1:33525_) [n:127.0.0.1:33525_     ] o.a.s.c.a.c.OverseerCollectionMessageHandler creating collections conf node /collections/control_collection 
   [junit4]   2> 1821227 DEBUG (OverseerThreadFactory-16916-thread-1-processing-n:127.0.0.1:33525_) [n:127.0.0.1:33525_     ] o.a.s.c.a.c.CreateCollectionCmd Check for collection zkNode: control_collection
   [junit4]   2> 1821228 DEBUG (OverseerThreadFactory-16916-thread-1-processing-n:127.0.0.1:33525_) [n:127.0.0.1:33525_     ] o.a.s.c.a.c.CreateCollectionCmd Collection zkNode exists
   [junit4]   2> 1821228 DEBUG (TEST-ShardSplitTest.testSplitShardWithRuleLink-seed#[3E39051B1337B874]-EventThread) [     ] o.a.s.c.c.SolrZkClient Submitting job to respond to event WatchedEvent state:SyncConnected type:NodeChildrenChanged path:/overseer/queue
   [junit4]   2> 1821229 DEBUG (OverseerStateUpdate-72171988199735300-127.0.0.1:33525_-n_0000000000) [n:127.0.0.1:33525_     ] o.a.s.c.Overseer processMessage: queueSize: 1, message = {
   [junit4]   2>   "name":"control_collection",
   [junit4]   2>   "fromApi":"true",
   [junit4]   2>   "collection.configName":"conf1",
   [junit4]   2>   "numShards":"1",
   [junit4]   2>   "createNodeSet":"127.0.0.1:33525_",
   [junit4]   2>   "nrtReplicas":"1",
   [junit4]   2>   "stateFormat":"2",
   [junit4]   2>   "replicationFactor":"1",
   [junit4]   2>   "operation":"create"} current state version: 0
   [junit4]   2> 1821229 DEBUG (OverseerStateUpdate-72171988199735300-127.0.0.1:33525_-n_0000000000) [n:127.0.0.1:33525_     ] o.a.s.c.o.ClusterStateMutator building a new cName: control_collection
   [junit4]   2> 1821230 DEBUG (OverseerStateUpdate-72171988199735300-127.0.0.1:33525_-n_0000000000) [n:127.0.0.1:33525_     ] o.a.s.c.o.ZkStateWriter going to create_collection /collections/control_collection/state.json
   [junit4]   2> 1821230 DEBUG (TEST-ShardSplitTest.testSplitShardWithRuleLink-seed#[3E39051B1337B874]-EventThread) [     ] o.a.s.c.c.SolrZkClient Submitting job to respond to event WatchedEvent state:SyncConnected type:NodeChildrenChanged path:/overseer/queue
   [junit4]   2> 1821330 DEBUG (OverseerThreadFactory-16916-thread-1-processing-n:127.0.0.1:33525_) [n:127.0.0.1:33525_     ] o.a.s.c.a.c.CreateCollectionCmd Creating SolrCores for new collection control_collection, shardNames [shard1] , message : {
   [junit4]   2>   "name":"control_collection",
   [junit4]   2>   "fromApi":"true",
   [junit4]   2>   "collection.configName":"conf1",
   [junit4]   2>   "numShards":"1",
   [junit4]   2>   "createNodeSet":"127.0.0.1:33525_",
   [junit4]   2>   "nrtReplicas":"1",
   [junit4]   2>   "stateFormat":"2",
   [junit4]   2>   "replicationFactor":"1",
   [junit4]   2>   "operation":"create"}
   [junit4]   2> 1821332 DEBUG (OverseerThreadFactory-16916-thread-1-processing-n:127.0.0.1:33525_) [n:127.0.0.1:33525_     ] o.a.s.c.a.c.CreateCollectionCmd Creating core control_collection_shard1_replica_n1 as part of shard shard1 of collection control_collection on 127.0.0.1:33525_
   [junit4]   2> 1821333 INFO  (qtp128219985-25814) [n:127.0.0.1:33525_     ] o.a.s.s.HttpSolrCall HttpSolrCall.init(http://127.0.0.1:33525/admin/cores?null)
   [junit4]   2> 1821333 INFO  (qtp128219985-25814) [n:127.0.0.1:33525_    x:control_collection_shard1_replica_n1 ] o.a.s.h.a.CoreAdminOperation core create command qt=/admin/cores&collection.configName=conf1&newCollection=true&name=control_collection_shard1_replica_n1&action=CREATE&numShards=1&collection=control_collection&shard=shard1&wt=javabin&version=2&replicaType=NRT
   [junit4]   2> 1821333 INFO  (qtp128219985-25814) [n:127.0.0.1:33525_    x:control_collection_shard1_replica_n1 ] o.a.s.c.TransientSolrCoreCacheDefault Allocating transient core cache for max 4 cores with initial capacity of 4
   [junit4]   2> 1821335 DEBUG (TEST-ShardSplitTest.testSplitShardWithRuleLink-seed#[3E39051B1337B874]-EventThread) [     ] o.a.s.c.c.SolrZkClient Submitting job to respond to event WatchedEvent state:SyncConnected type:NodeChildrenChanged path:/overseer/queue
   [junit4]   2> 1821336 DEBUG (OverseerStateUpdate-72171988199735300-127.0.0.1:33525_-n_0000000000) [n:127.0.0.1:33525_     ] o.a.s.c.Overseer processMessage: queueSize: 1, message = {
   [junit4]   2>   "core":"control_collection_shard1_replica_n1",
   [junit4]   2>   "roles":null,
   [junit4]   2>   "node_name":"127.0.0.1:33525_",
   [junit4]   2>   "base_url":"http://127.0.0.1:33525",
   [junit4]   2>   "numShards":"1",
   [junit4]   2>   "state":"down",
   [junit4]   2>   "shard":"shard1",
   [junit4]   2>   "collection":"control_collection",
   [junit4]   2>   "type":"NRT",
   [junit4]   2>   "operation":"state"} current state version: 0
   [junit4]   2> 1821336 DEBUG (OverseerStateUpdate-72171988199735300-127.0.0.1:33525_-n_0000000000) [n:127.0.0.1:33525_     ] o.a.s.c.o.ReplicaMutator Update state numShards=1 message={
   [junit4]   2>   "core":"control_collection_shard1_replica_n1",
   [junit4]   2>   "roles":null,
   [junit4]   2>   "node_name":"127.0.0.1:33525_",
   [junit4]   2>   "base_url":"http://127.0.0.1:33525",
   [junit4]   2>   "numShards":"1",
   [junit4]   2>   "state":"down",
   [junit4]   2>   "shard":"shard1",
   [junit4]   2>   "collection":"control_collection",
   [junit4]   2>   "type":"NRT",
   [junit4]   2>   "operation":"state"}
   [junit4]   2> 1821337 DEBUG (OverseerStateUpdate-72171988199735300-127.0.0.1:33525_-n_0000000000) [n:127.0.0.1:33525_     ] o.a.s.c.o.ReplicaMutator Will update state for replica: core_node2:{
   [junit4]   2>   "core":"control_collection_shard1_replica_n1",
   [junit4]   2>   "node_name":"127.0.0.1:33525_",
   [junit4]   2>   "base_url":"http://127.0.0.1:33525",
   [junit4]   2>   "state":"down",
   [junit4]   2>   "type":"NRT"}
   [junit4]   2> 1821337 DEBUG (OverseerStateUpdate-72171988199735300-127.0.0.1:33525_-n_0000000000) [n:127.0.0.1:33525_     ] o.a.s.c.o.ReplicaMutator Collection is now: DocCollection(control_collection//collections/control_collection/state.json/0 )={
   [junit4]   2>   "pullReplicas":"0",
   [junit4]   2>   "replicationFactor":"1",
   [junit4]   2>   "router":{"name":"compositeId"},
   [junit4]   2>   "maxShardsPerNode":"1",
   [junit4]   2>   "autoAddReplicas":"false",
   [junit4]   2>   "nrtReplicas":"1",
   [junit4]   2>   "tlogReplicas":"0",
   [junit4]   2>   "shards":{"shard1":{
   [junit4]   2>       "range":"80000000-7fffffff",
   [junit4]   2>       "state":"active",
   [junit4]   2>       "replicas":{"core_node2":{
   [junit4]   2>           "core":"control_collection_shard1_replica_n1",
   [junit4]   2>           "node_name":"127.0.0.1:33525_",
   [junit4]   2>           "base_url":"http://127.0.0.1:33525",
   [junit4]   2>           "state":"down",
   [junit4]   2>           "type":"NRT"}}}}}
   [junit4]   2> 1821438 DEBUG (OverseerStateUpdate-72171988199735300-127.0.0.1:33525_-n_0000000000) [n:127.0.0.1:33525_     ] o.a.s.c.o.ZkStateWriter going to update_collection /collections/control_collection/state.json version: 0
   [junit4]   2> 1821439 DEBUG (TEST-ShardSplitTest.testSplitShardWithRuleLink-seed#[3E39051B1337B874]-EventThread) [     ] o.a.s.c.c.SolrZkClient Submitting job to respond to event WatchedEvent state:SyncConnected type:NodeChildrenChanged path:/overseer/queue
   [junit4]   2> 1822338 DEBUG (qtp128219985-25814) [n:127.0.0.1:33525_ c:control_collection s:shard1  x:control_collection_shard1_replica_n1 ] o.a.s.c.c.ZkStateReader Loading collection config from: [/collections/control_collection]
   [junit4]   2> 1822345 INFO  (qtp128219985-25814) [n:127.0.0.1:33525_ c:control_collection s:shard1  x:control_collection_shard1_replica_n1 ] o.a.s.c.SolrConfig Using Lucene MatchVersion: 8.11.4
   [junit4]   2> 1822345 WARN  (qtp128219985-25814) [n:127.0.0.1:33525_ c:control_collection s:shard1  x:control_collection_shard1_replica_n1 ] o.a.s.c.SolrConfig solrconfig.xml: <jmx> is no longer supported, use solr.xml:/metrics/reporter section instead
   [junit4]   2> 1822348 INFO  (qtp128219985-25814) [n:127.0.0.1:33525_ c:control_collection s:shard1  x:control_collection_shard1_replica_n1 ] o.a.s.s.IndexSchema Schema name=test
   [junit4]   2> 1822352 INFO  (qtp128219985-25814) [n:127.0.0.1:33525_ c:control_collection s:shard1  x:control_collection_shard1_replica_n1 ] o.a.s.s.IndexSchema Loaded schema test/1.6 with uniqueid field id
   [junit4]   2> 1822368 INFO  (qtp128219985-25814) [n:127.0.0.1:33525_ c:control_collection s:shard1  x:control_collection_shard1_replica_n1 ] o.a.s.c.CoreContainer Creating SolrCore 'control_collection_shard1_replica_n1' using configuration from configset conf1, trusted=true
   [junit4]   2> 1822369 INFO  (qtp128219985-25814) [n:127.0.0.1:33525_ c:control_collection s:shard1  x:control_collection_shard1_replica_n1 ] o.a.s.m.r.SolrJmxReporter JMX monitoring for 'solr.core.control_collection.shard1.replica_n1' (registry 'solr.core.control_collection.shard1.replica_n1') enabled at server: com.sun.jmx.mbeanserver.JmxMBeanServer@6db183cf
   [junit4]   2> 1822369 INFO  (qtp128219985-25814) [n:127.0.0.1:33525_ c:control_collection s:shard1  x:control_collection_shard1_replica_n1 ] o.a.s.c.SolrCore [[control_collection_shard1_replica_n1] ] Opening new SolrCore at [/home/jenkins/jenkins-slave/workspace/Lucene/Lucene-Solr-Tests-8.11/solr/build/solr-core/test/J0/temp/solr.cloud.api.collections.ShardSplitTest_3E39051B1337B874-001/control-001/cores/control_collection_shard1_replica_n1], dataDir=[/home/jenkins/jenkins-slave/workspace/Lucene/Lucene-Solr-Tests-8.11/solr/build/solr-core/test/J0/temp/solr.cloud.api.collections.ShardSplitTest_3E39051B1337B874-001/control-001/cores/control_collection_shard1_replica_n1/data/]
   [junit4]   2> 1822372 INFO  (qtp128219985-25814) [n:127.0.0.1:33525_ c:control_collection s:shard1  x:control_collection_shard1_replica_n1 ] o.a.s.u.RandomMergePolicy RandomMergePolicy wrapping class org.apache.lucene.index.TieredMergePolicy: [TieredMergePolicy: maxMergeAtOnce=38, maxMergeAtOnceExplicit=10, maxMergedSegmentMB=99.064453125, floorSegmentMB=0.7685546875, forceMergeDeletesPctAllowed=7.431668863725866, segmentsPerTier=25.0, maxCFSSegmentSizeMB=8.796093022207999E12, noCFSRatio=0.0, deletesPctAllowed=33.09096461039648
   [junit4]   2> 1822388 WARN  (qtp128219985-25814) [n:127.0.0.1:33525_ c:control_collection s:shard1  x:control_collection_shard1_replica_n1 ] o.a.s.c.RequestHandlers INVALID paramSet a in requestHandler {type = requestHandler,name = /dump,class = DumpRequestHandler,attributes = {initParams=a, name=/dump, class=DumpRequestHandler},args = {defaults={a=A,b=B}}}
   [junit4]   2> 1822430 INFO  (qtp128219985-25814) [n:127.0.0.1:33525_ c:control_collection s:shard1  x:control_collection_shard1_replica_n1 ] o.a.s.u.UpdateHandler Using UpdateLog implementation: org.apache.solr.update.UpdateLog
   [junit4]   2> 1822430 INFO  (qtp128219985-25814) [n:127.0.0.1:33525_ c:control_collection s:shard1  x:control_collection_shard1_replica_n1 ] o.a.s.u.UpdateLog Initializing UpdateLog: dataDir= defaultSyncLevel=FLUSH numRecordsToKeep=100 maxNumLogsToKeep=10 numVersionBuckets=65536
   [junit4]   2> 1822431 INFO  (qtp128219985-25814) [n:127.0.0.1:33525_ c:control_collection s:shard1  x:control_collection_shard1_replica_n1 ] o.a.s.u.CommitTracker Hard AutoCommit: disabled
   [junit4]   2> 1822431 INFO  (qtp128219985-25814) [n:127.0.0.1:33525_ c:control_collection s:shard1  x:control_collection_shard1_replica_n1 ] o.a.s.u.CommitTracker Soft AutoCommit: disabled
   [junit4]   2> 1822432 INFO  (qtp128219985-25814) [n:127.0.0.1:33525_ c:control_collection s:shard1  x:control_collection_shard1_replica_n1 ] o.a.s.u.RandomMergePolicy RandomMergePolicy wrapping class org.apache.lucene.index.LogDocMergePolicy: [LogDocMergePolicy: minMergeSize=1000, mergeFactor=50, maxMergeSize=9223372036854775807, maxMergeSizeForForcedMerge=9223372036854775807, calibrateSizeByDeletes=false, maxMergeDocs=2147483647, maxCFSSegmentSizeMB=8.796093022207999E12, noCFSRatio=0.8198212315115602]
   [junit4]   2> 1822434 DEBUG (qtp128219985-25814) [n:127.0.0.1:33525_ c:control_collection s:shard1  x:control_collection_shard1_replica_n1 ] o.a.s.c.c.ZkStateReader Loading collection config from: [/collections/control_collection]
   [junit4]   2> 1822434 INFO  (qtp128219985-25814) [n:127.0.0.1:33525_ c:control_collection s:shard1  x:control_collection_shard1_replica_n1 ] o.a.s.r.ManagedResourceStorage Configured ZooKeeperStorageIO with znodeBase: /configs/conf1
   [junit4]   2> 1822435 INFO  (qtp128219985-25814) [n:127.0.0.1:33525_ c:control_collection s:shard1  x:control_collection_shard1_replica_n1 ] o.a.s.r.ManagedResourceStorage Loaded null at path _rest_managed.json using ZooKeeperStorageIO:path=/configs/conf1
   [junit4]   2> 1822435 INFO  (qtp128219985-25814) [n:127.0.0.1:33525_ c:control_collection s:shard1  x:control_collection_shard1_replica_n1 ] o.a.s.h.ReplicationHandler Commits will be reserved for 10000 ms
   [junit4]   2> 1822435 INFO  (qtp128219985-25814) [n:127.0.0.1:33525_ c:control_collection s:shard1  x:control_collection_shard1_replica_n1 ] o.a.s.u.UpdateLog Could not find max version in index or recent updates, using new clock 1798159872693370880
   [junit4]   2> 1822437 DEBUG (qtp128219985-25814) [n:127.0.0.1:33525_ c:control_collection s:shard1  x:control_collection_shard1_replica_n1 ] o.a.s.c.c.ZkStateReader Waiting up to 60000ms for state org.apache.solr.cloud.ZkController$$Lambda$685/317846755@60b9f5a1
   [junit4]   2> 1822437 DEBUG (qtp128219985-25814) [n:127.0.0.1:33525_ c:control_collection s:shard1  x:control_collection_shard1_replica_n1 ] o.a.s.c.c.ZkStateReader Found org.apache.solr.cloud.ZkController$$Lambda$685/317846755@60b9f5a1 directly in clusterState
   [junit4]   2> 1822438 DEBUG (qtp128219985-25814) [n:127.0.0.1:33525_ c:control_collection s:shard1  x:control_collection_shard1_replica_n1 ] o.a.s.c.c.SolrZkClient makePath: /collections/control_collection/terms/shard1
   [junit4]   2> 1822438 INFO  (searcherExecutor-16928-thread-1-processing-n:127.0.0.1:33525_ x:control_collection_shard1_replica_n1 c:control_collection s:shard1) [n:127.0.0.1:33525_ c:control_collection s:shard1  x:control_collection_shard1_replica_n1 ] o.a.s.c.SolrCore [control_collection_shard1_replica_n1]  Registered new searcher autowarm time: 0 ms
   [junit4]   2> 1822440 DEBUG (TEST-ShardSplitTest.testSplitShardWithRuleLink-seed#[3E39051B1337B874]-EventThread) [     ] o.a.s.c.c.SolrZkClient Submitting job to respond to event WatchedEvent state:SyncConnected type:NodeDataChanged path:/collections/control_collection/terms/shard1
   [junit4]   2> 1822440 INFO  (qtp128219985-25814) [n:127.0.0.1:33525_ c:control_collection s:shard1  x:control_collection_shard1_replica_n1 ] o.a.s.c.ZkShardTerms Successful update of terms at /collections/control_collection/terms/shard1 to Terms{values={core_node2=0}, version=0}
   [junit4]   2> 1822440 INFO  (qtp128219985-25814) [n:127.0.0.1:33525_ c:control_collection s:shard1  x:control_collection_shard1_replica_n1 ] o.a.s.c.ShardLeaderElectionContextBase make sure parent is created /collections/control_collection/leaders/shard1
   [junit4]   2> 1822440 DEBUG (qtp128219985-25814) [n:127.0.0.1:33525_ c:control_collection s:shard1  x:control_collection_shard1_replica_n1 ] o.a.s.c.c.SolrZkClient makePath: /collections/control_collection/leaders/shard1
   [junit4]   2> 1822441 DEBUG (qtp128219985-25814) [n:127.0.0.1:33525_ c:control_collection s:shard1  x:control_collection_shard1_replica_n1 ] o.a.s.c.c.SolrZkClient makePath: /collections/control_collection/leader_elect/shard1/election
   [junit4]   2> 1822443 INFO  (qtp128219985-25814) [n:127.0.0.1:33525_ c:control_collection s:shard1  x:control_collection_shard1_replica_n1 ] o.a.s.c.ShardLeaderElectionContext Enough replicas found to continue.
   [junit4]   2> 1822443 INFO  (qtp128219985-25814) [n:127.0.0.1:33525_ c:control_collection s:shard1  x:control_collection_shard1_replica_n1 ] o.a.s.c.ShardLeaderElectionContext I may be the new leader - try and sync
   [junit4]   2> 1822443 INFO  (qtp128219985-25814) [n:127.0.0.1:33525_ c:control_collection s:shard1  x:control_collection_shard1_replica_n1 ] o.a.s.c.SyncStrategy Sync replicas to http://127.0.0.1:33525/control_collection_shard1_replica_n1/
   [junit4]   2> 1822444 INFO  (qtp128219985-25814) [n:127.0.0.1:33525_ c:control_collection s:shard1  x:control_collection_shard1_replica_n1 ] o.a.s.c.SyncStrategy Sync Success - now sync replicas to me
   [junit4]   2> 1822444 INFO  (qtp128219985-25814) [n:127.0.0.1:33525_ c:control_collection s:shard1  x:control_collection_shard1_replica_n1 ] o.a.s.c.SyncStrategy http://127.0.0.1:33525/control_collection_shard1_replica_n1/ has no replicas
   [junit4]   2> 1822444 INFO  (qtp128219985-25814) [n:127.0.0.1:33525_ c:control_collection s:shard1  x:control_collection_shard1_replica_n1 ] o.a.s.c.ShardLeaderElectionContextBase Creating leader registration node /collections/control_collection/leaders/shard1/leader after winning as /collections/control_collection/leader_elect/shard1/election/72171988199735300-core_node2-n_0000000000
   [junit4]   2> 1822446 DEBUG (TEST-ShardSplitTest.testSplitShardWithRuleLink-seed#[3E39051B1337B874]-EventThread) [     ] o.a.s.c.c.SolrZkClient Submitting job to respond to event WatchedEvent state:SyncConnected type:NodeChildrenChanged path:/overseer/queue
   [junit4]   2> 1822446 INFO  (qtp128219985-25814) [n:127.0.0.1:33525_ c:control_collection s:shard1  x:control_collection_shard1_replica_n1 ] o.a.s.c.ShardLeaderElectionContext I am the new leader: http://127.0.0.1:33525/control_collection_shard1_replica_n1/ shard1
   [junit4]   2> 1822447 DEBUG (qtp128219985-25814) [n:127.0.0.1:33525_ c:control_collection s:shard1  x:control_collection_shard1_replica_n1 ] o.a.s.c.c.ZkStateReader already watching , added to stateWatchers
   [junit4]   2> 1822447 DEBUG (OverseerStateUpdate-72171988199735300-127.0.0.1:33525_-n_0000000000) [n:127.0.0.1:33525_     ] o.a.s.c.Overseer processMessage: queueSize: 1, message = {
   [junit4]   2>   "operation":"leader",
   [junit4]   2>   "shard":"shard1",
   [junit4]   2>   "collection":"control_collection",
   [junit4]   2>   "node_name":"127.0.0.1:33525_",
   [junit4]   2>   "base_url":"http://127.0.0.1:33525",
   [junit4]   2>   "core":"control_collection_shard1_replica_n1",
   [junit4]   2>   "state":"active"} current state version: 0
   [junit4]   2> 1822447 DEBUG (qtp128219985-25814) [n:127.0.0.1:33525_ c:control_collection s:shard1  x:control_collection_shard1_replica_n1 ] o.a.s.c.c.ZkStateReader Add data for [control_collection] ver [1]
   [junit4]   2> 1822447 DEBUG (qtp128219985-25814) [n:127.0.0.1:33525_ c:control_collection s:shard1  x:control_collection_shard1_replica_n1 ] o.a.s.c.c.ZkStateReader clusterStateSet: legacy [0] interesting [1] watched [1] lazy [2] total [2]
   [junit4]   2> 1822447 DEBUG (qtp128219985-25814) [n:127.0.0.1:33525_ c:control_collection s:shard1  x:control_collection_shard1_replica_n1 ] o.a.s.c.c.ZkStateReader updated per-replica states changed for: control_collection, ver: 0 , new vals: []
   [junit4]   2> 1822447 DEBUG (watches-16910-thread-1-processing-n:127.0.0.1:33525_ x:control_collection_shard1_replica_n1 c:control_collection s:shard1) [n:127.0.0.1:33525_ c:control_collection s:shard1  x:control_collection_shard1_replica_n1 ] o.a.s.c.c.ZkStateReader  CollectionStatePredicate failed for control_collection, cversion : -1
   [junit4]   2> 1822448 DEBUG (qtp128219985-25814) [n:127.0.0.1:33525_ c:control_collection s:shard1  x:control_collection_shard1_replica_n1 ] o.a.s.c.c.ZkStateReader clusterStateSet: legacy [0] interesting [1] watched [1] lazy [2] total [2]
   [junit4]   2> 1822448 DEBUG (qtp128219985-25814) [n:127.0.0.1:33525_ c:control_collection s:shard1  x:control_collection_shard1_replica_n1 ] o.a.s.c.c.ZkStateReader  CollectionStatePredicate failed for control_collection, cversion : -1
   [junit4]   2> 1822448 DEBUG (qtp128219985-25814) [n:127.0.0.1:33525_ c:control_collection s:shard1  x:control_collection_shard1_replica_n1 ] o.a.s.c.c.ZkStateReader  CollectionStatePredicate failed for control_collection, cversion : -1
   [junit4]   2> 1822448 DEBUG (watches-16910-thread-1-processing-n:127.0.0.1:33525_ x:control_collection_shard1_replica_n1 c:control_collection s:shard1) [n:127.0.0.1:33525_ c:control_collection s:shard1  x:control_collection_shard1_replica_n1 ] o.a.s.c.c.ZkStateReader  CollectionStatePredicate failed for control_collection, cversion : -1
   [junit4]   2> 1822448 DEBUG (qtp128219985-25814) [n:127.0.0.1:33525_ c:control_collection s:shard1  x:control_collection_shard1_replica_n1 ] o.a.s.c.c.ZkStateReader  CollectionStatePredicate failed for control_collection, cversion : -1
   [junit4]   2> 1822548 DEBUG (OverseerStateUpdate-72171988199735300-127.0.0.1:33525_-n_0000000000) [n:127.0.0.1:33525_     ] o.a.s.c.o.ZkStateWriter going to update_collection /collections/control_collection/state.json version: 1
   [junit4]   2> 1822548 DEBUG (TEST-ShardSplitTest.testSplitShardWithRuleLink-seed#[3E39051B1337B874]-EventThread) [     ] o.a.s.c.c.SolrZkClient Submitting job to respond to event WatchedEvent state:SyncConnected type:NodeDataChanged path:/collections/control_collection/state.json
   [junit4]   2> 1822548 INFO  (zkCallback-16908-thread-1) [     ] o.a.s.c.c.ZkStateReader A cluster state change: [WatchedEvent state:SyncConnected type:NodeDataChanged path:/collections/control_collection/state.json] for collection [control_collection] has occurred - updating... (live nodes size: [1])
   [junit4]   2> 1822548 DEBUG (TEST-ShardSplitTest.testSplitShardWithRuleLink-seed#[3E39051B1337B874]-EventThread) [     ] o.a.s.c.c.SolrZkClient Submitting job to respond to event WatchedEvent state:SyncConnected type:NodeChildrenChanged path:/overseer/queue
   [junit4]   2> 1822549 DEBUG (zkCallback-16908-thread-1) [     ] o.a.s.c.c.ZkStateReader Updating data for [control_collection] from [1] to [2]
   [junit4]   2> 1822549 DEBUG (zkCallback-16908-thread-1) [     ] o.a.s.c.c.ZkStateReader clusterStateSet: legacy [0] interesting [1] watched [1] lazy [2] total [2]
   [junit4]   2> 1822549 DEBUG (watches-16910-thread-1) [     ] o.a.s.c.c.ZkStateReader leader found for control_collection/shard1 to be core_node2:{
   [junit4]   2>   "core":"control_collection_shard1_replica_n1",
   [junit4]   2>   "node_name":"127.0.0.1:33525_",
   [junit4]   2>   "base_url":"http://127.0.0.1:33525",
   [junit4]   2>   "state":"down",
   [junit4]   2>   "type":"NRT",
   [junit4]   2>   "leader":"true"}
   [junit4]   2> 1822549 DEBUG (watches-16910-thread-1) [     ] o.a.s.c.c.ZkStateReader clusterStateSet: legacy [0] interesting [0] watched [0] lazy [2] total [2]
   [junit4]   2> 1822549 INFO  (qtp128219985-25814) [n:127.0.0.1:33525_ c:control_collection s:shard1  x:control_collection_shard1_replica_n1 ] o.a.s.c.ZkController I am the leader, no recovery necessary
   [junit4]   2> 1822550 DEBUG (TEST-ShardSplitTest.testSplitShardWithRuleLink-seed#[3E39051B1337B874]-EventThread) [     ] o.a.s.c.c.SolrZkClient Submitting job to respond to event WatchedEvent state:SyncConnected type:NodeChildrenChanged path:/overseer/queue
   [junit4]   2> 1822550 DEBUG (qtp128219985-25814) [n:127.0.0.1:33525_ c:control_collection s:shard1  x:control_collection_shard1_replica_n1 ] o.a.s.c.c.ZkStateReader Refreshing lazily-loaded state for collection control_collection
   [junit4]   2> 1822550 DEBUG (qtp128219985-25814) [n:127.0.0.1:33525_ c:control_collection s:shard1  x:control_collection_shard1_replica_n1 ] o.a.s.c.c.ZkStateReader already watching , added to stateWatchers
   [junit4]   2> 1822550 DEBUG (OverseerStateUpdate-72171988199735300-127.0.0.1:33525_-n_0000000000) [n:127.0.0.1:33525_     ] o.a.s.c.Overseer processMessage: queueSize: 1, message = {
   [junit4]   2>   "core":"control_collection_shard1_replica_n1",
   [junit4]   2>   "core_node_name":"core_node2",
   [junit4]   2>   "roles":null,
   [junit4]   2>   "node_name":"127.0.0.1:33525_",
   [junit4]   2>   "base_url":"http://127.0.0.1:33525",
   [junit4]   2>   "numShards":"1",
   [junit4]   2>   "state":"active",
   [junit4]   2>   "shard":"shard1",
   [junit4]   2>   "collection":"control_collection",
   [junit4]   2>   "type":"NRT",
   [junit4]   2>   "operation":"state"} current state version: 0
   [junit4]   2> 1822551 DEBUG (OverseerStateUpdate-72171988199735300-127.0.0.1:33525_-n_0000000000) [n:127.0.0.1:33525_     ] o.a.s.c.o.ReplicaMutator Update state numShards=1 message={
   [junit4]   2>   "core":"control_collection_shard1_replica_n1",
   [junit4]   2>   "core_node_name":"core_node2",
   [junit4]   2>   "roles":null,
   [junit4]   2>   "node_name":"127.0.0.1:33525_",
   [junit4]   2>   "base_url":"http://127.0.0.1:33525",
   [junit4]   2>   "numShards":"1",
   [junit4]   2>   "state":"active",
   [junit4]   2>   "shard":"shard1",
   [junit4]   2>   "collection":"control_collection",
   [junit4]   2>   "type":"NRT",
   [junit4]   2>   "operation":"state"}
   [junit4]   2> 1822551 DEBUG (OverseerStateUpdate-72171988199735300-127.0.0.1:33525_-n_0000000000) [n:127.0.0.1:33525_     ] o.a.s.c.o.ReplicaMutator Will update state for replica: core_node2:{
   [junit4]   2>   "core":"control_collection_shard1_replica_n1",
   [junit4]   2>   "node_name":"127.0.0.1:33525_",
   [junit4]   2>   "base_url":"http://127.0.0.1:33525",
   [junit4]   2>   "state":"active",
   [junit4]   2>   "type":"NRT",
   [junit4]   2>   "leader":"true"}
   [junit4]   2> 1822551 DEBUG (OverseerStateUpdate-72171988199735300-127.0.0.1:33525_-n_0000000000) [n:127.0.0.1:33525_     ] o.a.s.c.o.ReplicaMutator Collection is now: DocCollection(control_collection//collections/control_collection/state.json/2 )={
   [junit4]   2>   "pullReplicas":"0",
   [junit4]   2>   "replicationFactor":"1",
   [junit4]   2>   "router":{"name":"compositeId"},
   [junit4]   2>   "maxShardsPerNode":"1",
   [junit4]   2>   "autoAddReplicas":"false",
   [junit4]   2>   "nrtReplicas":"1",
   [junit4]   2>   "tlogReplicas":"0",
   [junit4]   2>   "shards":{"shard1":{
   [junit4]   2>       "range":"80000000-7fffffff",
   [junit4]   2>       "state":"active",
   [junit4]   2>       "replicas":{"core_node2":{
   [junit4]   2>           "core":"control_collection_shard1_replica_n1",
   [junit4]   2>           "node_name":"127.0.0.1:33525_",
   [junit4]   2>           "base_url":"http://127.0.0.1:33525",
   [junit4]   2>           "state":"active",
   [junit4]   2>           "type":"NRT",
   [junit4]   2>           "leader":"true"}}}}}
   [junit4]   2> 1822551 DEBUG (qtp128219985-25814) [n:127.0.0.1:33525_ c:control_collection s:shard1  x:control_collection_shard1_replica_n1 ] o.a.s.c.c.ZkStateReader Add data for [control_collection] ver [2]
   [junit4]   2> 1822551 DEBUG (qtp128219985-25814) [n:127.0.0.1:33525_ c:control_collection s:shard1  x:control_collection_shard1_replica_n1 ] o.a.s.c.c.ZkStateReader clusterStateSet: legacy [0] interesting [1] watched [1] lazy [2] total [2]
   [junit4]   2> 1822551 DEBUG (qtp128219985-25814) [n:127.0.0.1:33525_ c:control_collection s:shard1  x:control_collection_shard1_replica_n1 ] o.a.s.c.c.ZkStateReader updated per-replica states changed for: control_collection, ver: 0 , new vals: []
   [junit4]   2> 1822551 DEBUG (qtp128219985-25814) [n:127.0.0.1:33525_ c:control_collection s:shard1  x:control_collection_shard1_replica_n1 ] o.a.s.c.c.ZkStateReader clusterStateSet: legacy [0] interesting [1] watched [1] lazy [2] total [2]
   [junit4]   2> 1822553 INFO  (qtp128219985-25814) [n:127.0.0.1:33525_     ] o.a.s.s.HttpSolrCall [admin] webapp=null path=/admin/cores params={qt=/admin/cores&collection.configName=conf1&newCollection=true&name=control_collection_shard1_replica_n1&action=CREATE&numShards=1&collection=control_collection&shard=shard1&wt=javabin&version=2&replicaType=NRT} status=0 QTime=1219
   [junit4]   2> 1822553 DEBUG (OverseerThreadFactory-16916-thread-1-processing-n:127.0.0.1:33525_) [n:127.0.0.1:33525_     ] o.a.s.c.a.c.CreateCollectionCmd Finished create command on all shards for collection: control_collection
   [junit4]   2> 1822553 DEBUG (OverseerThreadFactory-16916-thread-1-processing-n:127.0.0.1:33525_) [n:127.0.0.1:33525_     ] o.a.s.c.OverseerTaskProcessor Completed task:[/overseer/collection-queue-work/qn-0000000000]
   [junit4]   2> 1822554 DEBUG (TEST-ShardSplitTest.testSplitShardWithRuleLink-seed#[3E39051B1337B874]-EventThread) [     ] o.a.s.c.c.SolrZkClient Submitting job to respond to event WatchedEvent state:SyncConnected type:NodeDataChanged path:/overseer/collection-queue-work/qnr-0000000000
   [junit4]   2> 1822554 DEBUG (TEST-ShardSplitTest.testSplitShardWithRuleLink-seed#[3E39051B1337B874]-EventThread) [     ] o.a.s.c.c.SolrZkClient Submitting job to respond to event WatchedEvent state:SyncConnected type:NodeChildrenChanged path:/overseer/collection-queue-work
   [junit4]   2> 1822554 DEBUG (OverseerThreadFactory-16916-thread-1-processing-n:127.0.0.1:33525_) [n:127.0.0.1:33525_     ] o.a.s.c.OverseerTaskProcessor Marked task [/overseer/collection-queue-work/qn-0000000000] as completed.
   [junit4]   2> 1822554 DEBUG (OverseerThreadFactory-16916-thread-1-processing-n:127.0.0.1:33525_) [n:127.0.0.1:33525_     ] o.a.s.c.OverseerTaskProcessor RunningTasks: []
   [junit4]   2> 1822554 DEBUG (OverseerThreadFactory-16916-thread-1-processing-n:127.0.0.1:33525_) [n:127.0.0.1:33525_   

[...truncated too long message...]

d-4-EventThread) [     ] o.a.s.c.c.SolrZkClient Submitting job to respond to event WatchedEvent state:Closed type:None path:null
   [junit4]   2> 2171493 DEBUG (closeThreadPool-18703-thread-4-EventThread) [     ] o.a.s.c.c.SolrZkClient Submitting job to respond to event WatchedEvent state:Closed type:None path:null
   [junit4]   2> 2171494 INFO  (closeThreadPool-18911-thread-9) [     ] o.e.j.s.AbstractConnector Stopped ServerConnector@1848301c{HTTP/1.1, (http/1.1, h2c)}{127.0.0.1:0}
   [junit4]   2> 2171494 INFO  (closeThreadPool-18911-thread-9) [     ] o.e.j.s.h.ContextHandler Stopped o.e.j.s.ServletContextHandler@439fd960{/,null,STOPPED}
   [junit4]   2> 2171494 INFO  (closeThreadPool-18911-thread-9) [     ] o.e.j.s.session node0 Stopped scavenging
   [junit4]   2> 2171496 INFO  (TEST-ShardSplitTest.testSplitStaticIndexReplicationLink-seed#[3E39051B1337B874]) [     ] o.a.s.u.ErrorLogMuter Closing ErrorLogMuter-regex-284 after mutting 0 log messages
   [junit4]   2> 2171496 INFO  (TEST-ShardSplitTest.testSplitStaticIndexReplicationLink-seed#[3E39051B1337B874]) [     ] o.a.s.u.ErrorLogMuter Creating ErrorLogMuter-regex-285 for ERROR logs matching regex: ignore_exception
   [junit4]   2> 2171497 INFO  (TEST-ShardSplitTest.testSplitStaticIndexReplicationLink-seed#[3E39051B1337B874]) [     ] o.a.s.c.ZkTestServer Shutting down ZkTestServer.
   [junit4]   2> 2171598 DEBUG (TEST-ShardSplitTest.testSplitStaticIndexReplicationLink-seed#[3E39051B1337B874]-EventThread) [     ] o.a.s.c.c.SolrZkClient Submitting job to respond to event WatchedEvent state:Closed type:None path:null
   [junit4]   2> 2171599 WARN  (TEST-ShardSplitTest.testSplitStaticIndexReplicationLink-seed#[3E39051B1337B874]-SendThread(127.0.0.1:40303)) [     ] o.a.z.ClientCnxn An exception was thrown while closing send thread for session 0x100680f50400001.
   [junit4]   2>           => EndOfStreamException: Unable to read additional data from server sessionid 0x100680f50400001, likely server has closed socket
   [junit4]   2> 	at org.apache.zookeeper.ClientCnxnSocketNIO.doIO(ClientCnxnSocketNIO.java:77)
   [junit4]   2> org.apache.zookeeper.ClientCnxn$EndOfStreamException: Unable to read additional data from server sessionid 0x100680f50400001, likely server has closed socket
   [junit4]   2> 	at org.apache.zookeeper.ClientCnxnSocketNIO.doIO(ClientCnxnSocketNIO.java:77) ~[zookeeper-3.6.2.jar:3.6.2]
   [junit4]   2> 	at org.apache.zookeeper.ClientCnxnSocketNIO.doTransport(ClientCnxnSocketNIO.java:350) ~[zookeeper-3.6.2.jar:3.6.2]
   [junit4]   2> 	at org.apache.zookeeper.ClientCnxn$SendThread.run(ClientCnxn.java:1275) [zookeeper-3.6.2.jar:3.6.2]
   [junit4]   2> 2171700 DEBUG (TEST-ShardSplitTest.testSplitStaticIndexReplicationLink-seed#[3E39051B1337B874]-EventThread) [     ] o.a.s.c.c.SolrZkClient Submitting job to respond to event WatchedEvent state:Closed type:None path:null
   [junit4]   2> 2171702 WARN  (ZkTestServer Run Thread) [     ] o.a.s.c.ZkTestServer Watch limit violations: 
   [junit4]   2> Maximum concurrent create/delete watches above limit:
   [junit4]   2> 
   [junit4]   2> 	11	/solr/collections/testSplitStaticIndexReplication_link/terms/shard1_0
   [junit4]   2> 	9	/solr/aliases.json
   [junit4]   2> 	6	/solr/packages.json
   [junit4]   2> 	6	/solr/security.json
   [junit4]   2> 	6	/solr/configs/conf1
   [junit4]   2> 	6	/solr/collections/collection1/terms/shard1
   [junit4]   2> 	5	/solr/collections/collection1/collectionprops.json
   [junit4]   2> 	5	/solr/collections/collection1/terms/shard2
   [junit4]   2> 	4	/solr/collections/testSplitStaticIndexReplication_link/terms/shard1
   [junit4]   2> 	4	/solr/collections/testSplitStaticIndexReplication_link/terms/shard1_1
   [junit4]   2> 	3	/solr/collections/testSplitStaticIndexReplication_link/collectionprops.json
   [junit4]   2> 	3	/solr/collections/control_collection/terms/shard1
   [junit4]   2> 
   [junit4]   2> Maximum concurrent data watches above limit:
   [junit4]   2> 
   [junit4]   2> 	70	/solr/collections/collection1/state.json
   [junit4]   2> 	13	/solr/collections/testSplitStaticIndexReplication_link/state.json
   [junit4]   2> 	9	/solr/clusterprops.json
   [junit4]   2> 	9	/solr/clusterstate.json
   [junit4]   2> 	7	/solr/collections/control_collection/state.json
   [junit4]   2> 	3	/solr/overseer_elect/election/72172009018097676-127.0.0.1:34837_-n_0000000001
   [junit4]   2> 	2	/solr/overseer_elect/election/72172009018097680-127.0.0.1:43119_-n_0000000003
   [junit4]   2> 
   [junit4]   2> Maximum concurrent children watches above limit:
   [junit4]   2> 
   [junit4]   2> 	69	/solr/overseer/queue
   [junit4]   2> 	51	/solr/live_nodes
   [junit4]   2> 	31	/solr/collections/testSplitStaticIndexReplication_link/state.json
   [junit4]   2> 	24	/solr/overseer/collection-queue-work
   [junit4]   2> 	15	/solr/collections
   [junit4]   2> 	8	/solr/collections/collection1/state.json
   [junit4]   2> 	2	/solr/collections/control_collection/state.json
   [junit4]   2> 
   [junit4]   2> 2171705 INFO  (TEST-ShardSplitTest.testSplitStaticIndexReplicationLink-seed#[3E39051B1337B874]) [     ] o.a.s.c.ZkTestServer waitForServerDown: 127.0.0.1:40303
   [junit4]   2> 2171705 INFO  (TEST-ShardSplitTest.testSplitStaticIndexReplicationLink-seed#[3E39051B1337B874]) [     ] o.a.s.c.ZkTestServer parse host and port list: 127.0.0.1:40303
   [junit4]   2> 2171705 INFO  (TEST-ShardSplitTest.testSplitStaticIndexReplicationLink-seed#[3E39051B1337B874]) [     ] o.a.s.c.ZkTestServer connecting to 127.0.0.1 40303
   [junit4]   2> 2171707 INFO  (SUITE-ShardSplitTest-seed#[3E39051B1337B874]-worker) [     ] o.a.s.u.ErrorLogMuter Closing ErrorLogMuter-regex-285 after mutting 0 log messages
   [junit4]   2> 2171708 INFO  (SUITE-ShardSplitTest-seed#[3E39051B1337B874]-worker) [     ] o.a.s.u.ErrorLogMuter Creating ErrorLogMuter-regex-286 for ERROR logs matching regex: ignore_exception
   [junit4]   2> NOTE: leaving temporary files on disk at: /home/jenkins/jenkins-slave/workspace/Lucene/Lucene-Solr-Tests-8.11/solr/build/solr-core/test/J0/temp/solr.cloud.api.collections.ShardSplitTest_3E39051B1337B874-001
   [junit4]   2> May 04, 2024 9:47:16 PM com.carrotsearch.randomizedtesting.ThreadLeakControl checkThreadLeaks
   [junit4]   2> WARNING: Will linger awaiting termination of 1 leaked thread(s).
   [junit4]   2> NOTE: test params are: codec=Asserting(Lucene87), sim=Asserting(RandomSimilarity(queryNorm=false): {}), locale=ar-MA, timezone=GMT0
   [junit4]   2> NOTE: Linux 4.15.0-213-generic amd64/Temurin 1.8.0_362 (64-bit)/cpus=4,threads=1,free=151610496,total=502792192
   [junit4]   2> NOTE: All tests run in this JVM: [TestIndexingPerformance, TestStressThreadBackup, OverseerTest, RequiredFieldsTest, TestMinimalConfig, TestFieldSortValues, TestRandomFlRTGCloud, DistributedMLTComponentTest, TestCloudSearcherWarming, JWTAuthPluginTest, TestCopyFieldCollectionResource, TestLuceneMatchVersion, ExecutePlanActionTest, AuthToolTest, TestLuceneIndexBackCompat, TestStressCloudBlindAtomicUpdates, SegmentsInfoRequestHandlerTest, TestCloudJSONFacetSKG, FieldAnalysisRequestHandlerTest, SolrRrdBackendFactoryTest, CacheHeaderTest, WordBreakSolrSpellCheckerTest, FacetPivotSmallTest, PathHierarchyTokenizerFactoryTest, TestExternalRoleRuleBasedAuthorizationPlugin, HighlighterWithoutStoredIdTest, TestDefaultStatsCache, DistributedSpellCheckComponentTest, TestMinHashQParser, TestFieldCache, CoreMergeIndexesAdminHandlerTest, TestOverriddenPrefixQueryForCustomFieldType, ConfigureRecoveryStrategyTest, TestLRUStatsCache, Tagger2Test, HdfsBackupRepositoryIntegrationTest, TestReplicationHandler, TestInPlaceUpdateWithRouteField, HDFSCollectionsAPITest, TestDynamicLoadingUrl, TestInitParams, RAMDirectoryFactoryTest, TestNumericTerms64, TestScoreJoinQPNoScore, MetricsHandlerTest, ConcurrentCreateCollectionTest, CdcrReplicationHandlerTest, IgnoreCommitOptimizeUpdateProcessorFactoryTest, ZkCollectionPropsCachingTest, DocumentBuilderTest, ZkControllerTest, SuggestComponentContextFilterQueryTest, ExitableDirectoryReaderTest, OverriddenZkACLAndCredentialsProvidersTest, InfoHandlerTest, TestPerFieldSimilarity, ExternalFileFieldSortTest, TestDistribPackageStore, SuggesterWFSTTest, TestRangeQuery, AliasIntegrationTest, TestJsonFacets, JSONWriterTest, TestConfigSetImmutable, SpatialRPTFieldTypeTest, TemplateUpdateProcessorTest, TriggerSetPropertiesIntegrationTest, CurrencyRangeFacetCloudTest, NodeMarkersRegistrationTest, BlobRepositoryCloudTest, MultiThreadedOCPTest, TestExclusionRuleCollectionAccess, FastVectorHighlighterTest, CreateCollectionCleanupTest, TestSchemalessBufferedUpdates, TestLMDirichletSimilarityFactory, AnalysisAfterCoreReloadTest, SplitShardTest, BadCopyFieldTest, DocValuesMissingTest, AtomicUpdateProcessorFactoryTest, ScheduledTriggerTest, CloudMLTQParserTest, DistributedFacetSimpleRefinementLongTailTest, IndexSizeTriggerSizeEstimationTest, BasicZkTest, HLLSerializationTest, TestCloudConsistency, TestManagedResource, SearchHandlerTest, ZkSolrClientTest, TestSchemaDesignerAPI, ClassificationUpdateProcessorIntegrationTest, TestOrdValues, HdfsChaosMonkeySafeLeaderTest, TestPhraseSuggestions, SoftAutoCommitTest, TestFileDictionaryLookup, TestNumericRangeQuery64, FullSolrCloudDistribCmdsTest, TestStressLucene, DimensionalRoutedAliasUpdateProcessorTest, BigEndianAscendingWordSerializerTest, TestObjectReleaseTracker, TestXIncludeConfig, TestHighlightDedupGrouping, SimpleCollectionCreateDeleteTest, BasicAuthIntegrationTest, TestHalfAndHalfDocValues, SliceStateTest, TimeZoneUtilsTest, DistributedDebugComponentTest, LongSetTest, AggValueSourceTest, TestPullReplica, TestCustomDocTransformer, TestConfigReload, TestShortCircuitedRequests, TestSolrCloudWithKerberosAlt, TestSolrCloudWithSecureImpersonation, TestTolerantUpdateProcessorRandomCloud, TestWaitForStateWithJettyShutdowns, ZkCLITest, PurgeGraphTest, ShardSplitTest]
   [junit4] Completed [737/959 (1!)] on J0 in 353.69s, 11 tests, 1 error, 3 skipped <<< FAILURES!

[...truncated 55117 lines...]