You are viewing a plain text version of this content. The canonical link for it is here.
Posted to yarn-dev@hadoop.apache.org by Apache Jenkins Server <je...@builds.apache.org> on 2015/09/15 19:59:32 UTC
Failed: YARN-4078 PreCommit Build #9145
Jira: https://issues.apache.org/jira/browse/YARN-4078
Build: https://builds.apache.org/job/PreCommit-YARN-Build/9145/
###################################################################################
########################## LAST 60 LINES OF THE CONSOLE ###########################
[...truncated 300 lines...]
| | | | issues.
| +1 | whitespace | 0m 1s | The patch has no lines that end in
| | | | whitespace.
| +1 | install | 1m 30s | mvn install still works.
| +1 | eclipse:eclipse | 0m 34s | The patch built with
| | | | eclipse:eclipse.
| +1 | findbugs | 1m 28s | The patch does not introduce any
| | | | new Findbugs (version 3.0.0)
| | | | warnings.
| -1 | yarn tests | 58m 53s | Tests failed in
| | | | hadoop-yarn-server-resourcemanager.
| | | 99m 20s |
Reason | Tests
Failed unit tests | hadoop.yarn.server.resourcemanager.scheduler.fair.TestAllocationFileLoaderService
|| Subsystem || Report/Notes ||
============================================================================
| Patch URL | http://issues.apache.org/jira/secure/attachment/12756013/YARN-4078.20150915-2.patch |
| Optional Tests | javadoc javac unit findbugs checkstyle |
| git revision | trunk / 73e3a49 |
| hadoop-yarn-server-resourcemanager test log | /home/jenkins/jenkins-slave/workspace/PreCommit-YARN-Build@2/patchprocess/testrun_hadoop-yarn-server-resourcemanager.txt |
| Test Results | https://builds.apache.org/job/PreCommit-YARN-Build/9145/testReport/ |
| Java | 1.7.0_55 |
| uname | Linux asf905.gq1.ygridcore.net 3.13.0-36-lowlatency #63-Ubuntu SMP PREEMPT Wed Sep 3 21:56:12 UTC 2014 x86_64 x86_64 x86_64 GNU/Linux |
============================================================================
============================================================================
Adding comment to JIRA
============================================================================
============================================================================
Comment added.
3a6fc203d82a02ebcda9df91198018be1c5cc885 logged out
============================================================================
============================================================================
Finished build.
============================================================================
============================================================================
Build step 'Execute shell' marked build as failure
Archiving artifacts
Sending artifact delta relative to PreCommit-YARN-Build #9133
Archived 29 artifacts
Archive block size is 32768
Received 5 blocks and 13501318 bytes
Compression is 1.2%
Took 2.9 sec
[description-setter] Could not determine description.
Recording test results
Email was triggered for: Failure
Sending email for trigger: Failure
###################################################################################
############################## FAILED TESTS (if any) ##############################
1 tests failed.
REGRESSION: org.apache.hadoop.yarn.server.resourcemanager.scheduler.fair.TestAllocationFileLoaderService.testGetAllocationFileFromClasspath
Error Message:
null
Stack Trace:
java.lang.AssertionError: null
at org.junit.Assert.fail(Assert.java:86)
at org.junit.Assert.assertTrue(Assert.java:41)
at org.junit.Assert.assertTrue(Assert.java:52)
at org.apache.hadoop.yarn.server.resourcemanager.scheduler.fair.TestAllocationFileLoaderService.testGetAllocationFileFromClasspath(TestAllocationFileLoaderService.java:54)
Failed: YARN-4044 PreCommit Build #9147
Posted by Apache Jenkins Server <je...@builds.apache.org>.
Jira: https://issues.apache.org/jira/browse/YARN-4044
Build: https://builds.apache.org/job/PreCommit-YARN-Build/9147/
###################################################################################
########################## LAST 60 LINES OF THE CONSOLE ###########################
[...truncated 432 lines...]
| +1 | yarn tests | 0m 25s | Tests passed in
| | | | hadoop-yarn-server-common.
| -1 | yarn tests | 51m 1s | Tests failed in
| | | | hadoop-yarn-server-resourcemanager.
| | | 96m 51s |
Reason | Tests
Failed unit tests | hadoop.yarn.server.timeline.webapp.TestTimelineWebServices
| hadoop.yarn.server.resourcemanager.metrics.TestSystemMetricsPublisher
| hadoop.yarn.server.resourcemanager.scheduler.capacity.TestLeafQueue
| hadoop.yarn.server.resourcemanager.webapp.TestRMWebServicesAppsModification
| hadoop.yarn.server.resourcemanager.scheduler.capacity.TestCapacitySchedulerQueueACLs
Timed out tests | org.apache.hadoop.yarn.server.resourcemanager.scheduler.capacity.TestNodeLabelContainerAllocation
|| Subsystem || Report/Notes ||
============================================================================
| Patch URL | http://issues.apache.org/jira/secure/attachment/12756041/0003-YARN-4044.patch |
| Optional Tests | javadoc javac unit findbugs checkstyle |
| git revision | trunk / ae5308f |
| hadoop-yarn-server-applicationhistoryservice test log | /home/jenkins/jenkins-slave/workspace/PreCommit-YARN-Build/patchprocess/testrun_hadoop-yarn-server-applicationhistoryservice.txt |
| hadoop-yarn-server-common test log | /home/jenkins/jenkins-slave/workspace/PreCommit-YARN-Build/patchprocess/testrun_hadoop-yarn-server-common.txt |
| hadoop-yarn-server-resourcemanager test log | /home/jenkins/jenkins-slave/workspace/PreCommit-YARN-Build/patchprocess/testrun_hadoop-yarn-server-resourcemanager.txt |
| Test Results | https://builds.apache.org/job/PreCommit-YARN-Build/9147/testReport/ |
| Java | 1.7.0_55 |
| uname | Linux asf905.gq1.ygridcore.net 3.13.0-36-lowlatency #63-Ubuntu SMP PREEMPT Wed Sep 3 21:56:12 UTC 2014 x86_64 x86_64 x86_64 GNU/Linux |
============================================================================
============================================================================
Adding comment to JIRA
============================================================================
============================================================================
Comment added.
7c56ad2fb9b8a6d7c1101b105c8e81f1f947b1f4 logged out
============================================================================
============================================================================
Finished build.
============================================================================
============================================================================
Build step 'Execute shell' marked build as failure
Archiving artifacts
Sending artifact delta relative to PreCommit-YARN-Build #9133
Archived 51 artifacts
Archive block size is 32768
Received 31 blocks and 9403230 bytes
Compression is 9.7%
Took 2.3 sec
[description-setter] Could not determine description.
Recording test results
Email was triggered for: Failure
Sending email for trigger: Failure
###################################################################################
############################## FAILED TESTS (if any) ##############################
78 tests failed.
FAILED: org.apache.hadoop.yarn.server.timeline.webapp.TestTimelineWebServices.testGetEntityFields1
Error Message:
java.net.BindException: Address already in use
Stack Trace:
com.sun.jersey.test.framework.spi.container.TestContainerException: java.net.BindException: Address already in use
at sun.nio.ch.Net.bind0(Native Method)
at sun.nio.ch.Net.bind(Net.java:444)
at sun.nio.ch.Net.bind(Net.java:436)
at sun.nio.ch.ServerSocketChannelImpl.bind(ServerSocketChannelImpl.java:214)
at sun.nio.ch.ServerSocketAdaptor.bind(ServerSocketAdaptor.java:74)
at org.glassfish.grizzly.nio.transport.TCPNIOTransport.bind(TCPNIOTransport.java:413)
at org.glassfish.grizzly.nio.transport.TCPNIOTransport.bind(TCPNIOTransport.java:384)
at org.glassfish.grizzly.nio.transport.TCPNIOTransport.bind(TCPNIOTransport.java:375)
at org.glassfish.grizzly.http.server.NetworkListener.start(NetworkListener.java:549)
at org.glassfish.grizzly.http.server.HttpServer.start(HttpServer.java:255)
at com.sun.jersey.api.container.grizzly2.GrizzlyServerFactory.createHttpServer(GrizzlyServerFactory.java:326)
at com.sun.jersey.api.container.grizzly2.GrizzlyServerFactory.createHttpServer(GrizzlyServerFactory.java:343)
at com.sun.jersey.test.framework.spi.container.grizzly2.web.GrizzlyWebTestContainerFactory$GrizzlyWebTestContainer.instantiateGrizzlyWebServer(GrizzlyWebTestContainerFactory.java:219)
at com.sun.jersey.test.framework.spi.container.grizzly2.web.GrizzlyWebTestContainerFactory$GrizzlyWebTestContainer.<init>(GrizzlyWebTestContainerFactory.java:129)
at com.sun.jersey.test.framework.spi.container.grizzly2.web.GrizzlyWebTestContainerFactory$GrizzlyWebTestContainer.<init>(GrizzlyWebTestContainerFactory.java:86)
at com.sun.jersey.test.framework.spi.container.grizzly2.web.GrizzlyWebTestContainerFactory.create(GrizzlyWebTestContainerFactory.java:79)
at com.sun.jersey.test.framework.JerseyTest.getContainer(JerseyTest.java:342)
at com.sun.jersey.test.framework.JerseyTest.<init>(JerseyTest.java:217)
at org.apache.hadoop.yarn.webapp.JerseyTestBase.<init>(JerseyTestBase.java:27)
at org.apache.hadoop.yarn.server.timeline.webapp.TestTimelineWebServices.<init>(TestTimelineWebServices.java:170)
FAILED: org.apache.hadoop.yarn.server.timeline.webapp.TestTimelineWebServices.testGetEntityFields2
Error Message:
java.net.BindException: Address already in use
Stack Trace:
com.sun.jersey.test.framework.spi.container.TestContainerException: java.net.BindException: Address already in use
at sun.nio.ch.Net.bind0(Native Method)
at sun.nio.ch.Net.bind(Net.java:444)
at sun.nio.ch.Net.bind(Net.java:436)
at sun.nio.ch.ServerSocketChannelImpl.bind(ServerSocketChannelImpl.java:214)
at sun.nio.ch.ServerSocketAdaptor.bind(ServerSocketAdaptor.java:74)
at org.glassfish.grizzly.nio.transport.TCPNIOTransport.bind(TCPNIOTransport.java:413)
at org.glassfish.grizzly.nio.transport.TCPNIOTransport.bind(TCPNIOTransport.java:384)
at org.glassfish.grizzly.nio.transport.TCPNIOTransport.bind(TCPNIOTransport.java:375)
at org.glassfish.grizzly.http.server.NetworkListener.start(NetworkListener.java:549)
at org.glassfish.grizzly.http.server.HttpServer.start(HttpServer.java:255)
at com.sun.jersey.api.container.grizzly2.GrizzlyServerFactory.createHttpServer(GrizzlyServerFactory.java:326)
at com.sun.jersey.api.container.grizzly2.GrizzlyServerFactory.createHttpServer(GrizzlyServerFactory.java:343)
at com.sun.jersey.test.framework.spi.container.grizzly2.web.GrizzlyWebTestContainerFactory$GrizzlyWebTestContainer.instantiateGrizzlyWebServer(GrizzlyWebTestContainerFactory.java:219)
at com.sun.jersey.test.framework.spi.container.grizzly2.web.GrizzlyWebTestContainerFactory$GrizzlyWebTestContainer.<init>(GrizzlyWebTestContainerFactory.java:129)
at com.sun.jersey.test.framework.spi.container.grizzly2.web.GrizzlyWebTestContainerFactory$GrizzlyWebTestContainer.<init>(GrizzlyWebTestContainerFactory.java:86)
at com.sun.jersey.test.framework.spi.container.grizzly2.web.GrizzlyWebTestContainerFactory.create(GrizzlyWebTestContainerFactory.java:79)
at com.sun.jersey.test.framework.JerseyTest.getContainer(JerseyTest.java:342)
at com.sun.jersey.test.framework.JerseyTest.<init>(JerseyTest.java:217)
at org.apache.hadoop.yarn.webapp.JerseyTestBase.<init>(JerseyTestBase.java:27)
at org.apache.hadoop.yarn.server.timeline.webapp.TestTimelineWebServices.<init>(TestTimelineWebServices.java:170)
FAILED: org.apache.hadoop.yarn.server.timeline.webapp.TestTimelineWebServices.testPrimaryFilterString
Error Message:
java.net.BindException: Address already in use
Stack Trace:
com.sun.jersey.test.framework.spi.container.TestContainerException: java.net.BindException: Address already in use
at sun.nio.ch.Net.bind0(Native Method)
at sun.nio.ch.Net.bind(Net.java:444)
at sun.nio.ch.Net.bind(Net.java:436)
at sun.nio.ch.ServerSocketChannelImpl.bind(ServerSocketChannelImpl.java:214)
at sun.nio.ch.ServerSocketAdaptor.bind(ServerSocketAdaptor.java:74)
at org.glassfish.grizzly.nio.transport.TCPNIOTransport.bind(TCPNIOTransport.java:413)
at org.glassfish.grizzly.nio.transport.TCPNIOTransport.bind(TCPNIOTransport.java:384)
at org.glassfish.grizzly.nio.transport.TCPNIOTransport.bind(TCPNIOTransport.java:375)
at org.glassfish.grizzly.http.server.NetworkListener.start(NetworkListener.java:549)
at org.glassfish.grizzly.http.server.HttpServer.start(HttpServer.java:255)
at com.sun.jersey.api.container.grizzly2.GrizzlyServerFactory.createHttpServer(GrizzlyServerFactory.java:326)
at com.sun.jersey.api.container.grizzly2.GrizzlyServerFactory.createHttpServer(GrizzlyServerFactory.java:343)
at com.sun.jersey.test.framework.spi.container.grizzly2.web.GrizzlyWebTestContainerFactory$GrizzlyWebTestContainer.instantiateGrizzlyWebServer(GrizzlyWebTestContainerFactory.java:219)
at com.sun.jersey.test.framework.spi.container.grizzly2.web.GrizzlyWebTestContainerFactory$GrizzlyWebTestContainer.<init>(GrizzlyWebTestContainerFactory.java:129)
at com.sun.jersey.test.framework.spi.container.grizzly2.web.GrizzlyWebTestContainerFactory$GrizzlyWebTestContainer.<init>(GrizzlyWebTestContainerFactory.java:86)
at com.sun.jersey.test.framework.spi.container.grizzly2.web.GrizzlyWebTestContainerFactory.create(GrizzlyWebTestContainerFactory.java:79)
at com.sun.jersey.test.framework.JerseyTest.getContainer(JerseyTest.java:342)
at com.sun.jersey.test.framework.JerseyTest.<init>(JerseyTest.java:217)
at org.apache.hadoop.yarn.webapp.JerseyTestBase.<init>(JerseyTestBase.java:27)
at org.apache.hadoop.yarn.server.timeline.webapp.TestTimelineWebServices.<init>(TestTimelineWebServices.java:170)
FAILED: org.apache.hadoop.yarn.server.timeline.webapp.TestTimelineWebServices.testGetDomainsYarnACLsEnabled
Error Message:
java.net.BindException: Address already in use
Stack Trace:
com.sun.jersey.test.framework.spi.container.TestContainerException: java.net.BindException: Address already in use
at sun.nio.ch.Net.bind0(Native Method)
at sun.nio.ch.Net.bind(Net.java:444)
at sun.nio.ch.Net.bind(Net.java:436)
at sun.nio.ch.ServerSocketChannelImpl.bind(ServerSocketChannelImpl.java:214)
at sun.nio.ch.ServerSocketAdaptor.bind(ServerSocketAdaptor.java:74)
at org.glassfish.grizzly.nio.transport.TCPNIOTransport.bind(TCPNIOTransport.java:413)
at org.glassfish.grizzly.nio.transport.TCPNIOTransport.bind(TCPNIOTransport.java:384)
at org.glassfish.grizzly.nio.transport.TCPNIOTransport.bind(TCPNIOTransport.java:375)
at org.glassfish.grizzly.http.server.NetworkListener.start(NetworkListener.java:549)
at org.glassfish.grizzly.http.server.HttpServer.start(HttpServer.java:255)
at com.sun.jersey.api.container.grizzly2.GrizzlyServerFactory.createHttpServer(GrizzlyServerFactory.java:326)
at com.sun.jersey.api.container.grizzly2.GrizzlyServerFactory.createHttpServer(GrizzlyServerFactory.java:343)
at com.sun.jersey.test.framework.spi.container.grizzly2.web.GrizzlyWebTestContainerFactory$GrizzlyWebTestContainer.instantiateGrizzlyWebServer(GrizzlyWebTestContainerFactory.java:219)
at com.sun.jersey.test.framework.spi.container.grizzly2.web.GrizzlyWebTestContainerFactory$GrizzlyWebTestContainer.<init>(GrizzlyWebTestContainerFactory.java:129)
at com.sun.jersey.test.framework.spi.container.grizzly2.web.GrizzlyWebTestContainerFactory$GrizzlyWebTestContainer.<init>(GrizzlyWebTestContainerFactory.java:86)
at com.sun.jersey.test.framework.spi.container.grizzly2.web.GrizzlyWebTestContainerFactory.create(GrizzlyWebTestContainerFactory.java:79)
at com.sun.jersey.test.framework.JerseyTest.getContainer(JerseyTest.java:342)
at com.sun.jersey.test.framework.JerseyTest.<init>(JerseyTest.java:217)
at org.apache.hadoop.yarn.webapp.JerseyTestBase.<init>(JerseyTestBase.java:27)
at org.apache.hadoop.yarn.server.timeline.webapp.TestTimelineWebServices.<init>(TestTimelineWebServices.java:170)
FAILED: org.apache.hadoop.yarn.server.timeline.webapp.TestTimelineWebServices.testGetDomainYarnACLsEnabled
Error Message:
java.net.BindException: Address already in use
Stack Trace:
com.sun.jersey.test.framework.spi.container.TestContainerException: java.net.BindException: Address already in use
at sun.nio.ch.Net.bind0(Native Method)
at sun.nio.ch.Net.bind(Net.java:444)
at sun.nio.ch.Net.bind(Net.java:436)
at sun.nio.ch.ServerSocketChannelImpl.bind(ServerSocketChannelImpl.java:214)
at sun.nio.ch.ServerSocketAdaptor.bind(ServerSocketAdaptor.java:74)
at org.glassfish.grizzly.nio.transport.TCPNIOTransport.bind(TCPNIOTransport.java:413)
at org.glassfish.grizzly.nio.transport.TCPNIOTransport.bind(TCPNIOTransport.java:384)
at org.glassfish.grizzly.nio.transport.TCPNIOTransport.bind(TCPNIOTransport.java:375)
at org.glassfish.grizzly.http.server.NetworkListener.start(NetworkListener.java:549)
at org.glassfish.grizzly.http.server.HttpServer.start(HttpServer.java:255)
at com.sun.jersey.api.container.grizzly2.GrizzlyServerFactory.createHttpServer(GrizzlyServerFactory.java:326)
at com.sun.jersey.api.container.grizzly2.GrizzlyServerFactory.createHttpServer(GrizzlyServerFactory.java:343)
at com.sun.jersey.test.framework.spi.container.grizzly2.web.GrizzlyWebTestContainerFactory$GrizzlyWebTestContainer.instantiateGrizzlyWebServer(GrizzlyWebTestContainerFactory.java:219)
at com.sun.jersey.test.framework.spi.container.grizzly2.web.GrizzlyWebTestContainerFactory$GrizzlyWebTestContainer.<init>(GrizzlyWebTestContainerFactory.java:129)
at com.sun.jersey.test.framework.spi.container.grizzly2.web.GrizzlyWebTestContainerFactory$GrizzlyWebTestContainer.<init>(GrizzlyWebTestContainerFactory.java:86)
at com.sun.jersey.test.framework.spi.container.grizzly2.web.GrizzlyWebTestContainerFactory.create(GrizzlyWebTestContainerFactory.java:79)
at com.sun.jersey.test.framework.JerseyTest.getContainer(JerseyTest.java:342)
at com.sun.jersey.test.framework.JerseyTest.<init>(JerseyTest.java:217)
at org.apache.hadoop.yarn.webapp.JerseyTestBase.<init>(JerseyTestBase.java:27)
at org.apache.hadoop.yarn.server.timeline.webapp.TestTimelineWebServices.<init>(TestTimelineWebServices.java:170)
FAILED: org.apache.hadoop.yarn.server.timeline.webapp.TestTimelineWebServices.testGetDomain
Error Message:
java.net.BindException: Address already in use
Stack Trace:
com.sun.jersey.test.framework.spi.container.TestContainerException: java.net.BindException: Address already in use
at sun.nio.ch.Net.bind0(Native Method)
at sun.nio.ch.Net.bind(Net.java:444)
at sun.nio.ch.Net.bind(Net.java:436)
at sun.nio.ch.ServerSocketChannelImpl.bind(ServerSocketChannelImpl.java:214)
at sun.nio.ch.ServerSocketAdaptor.bind(ServerSocketAdaptor.java:74)
at org.glassfish.grizzly.nio.transport.TCPNIOTransport.bind(TCPNIOTransport.java:413)
at org.glassfish.grizzly.nio.transport.TCPNIOTransport.bind(TCPNIOTransport.java:384)
at org.glassfish.grizzly.nio.transport.TCPNIOTransport.bind(TCPNIOTransport.java:375)
at org.glassfish.grizzly.http.server.NetworkListener.start(NetworkListener.java:549)
at org.glassfish.grizzly.http.server.HttpServer.start(HttpServer.java:255)
at com.sun.jersey.api.container.grizzly2.GrizzlyServerFactory.createHttpServer(GrizzlyServerFactory.java:326)
at com.sun.jersey.api.container.grizzly2.GrizzlyServerFactory.createHttpServer(GrizzlyServerFactory.java:343)
at com.sun.jersey.test.framework.spi.container.grizzly2.web.GrizzlyWebTestContainerFactory$GrizzlyWebTestContainer.instantiateGrizzlyWebServer(GrizzlyWebTestContainerFactory.java:219)
at com.sun.jersey.test.framework.spi.container.grizzly2.web.GrizzlyWebTestContainerFactory$GrizzlyWebTestContainer.<init>(GrizzlyWebTestContainerFactory.java:129)
at com.sun.jersey.test.framework.spi.container.grizzly2.web.GrizzlyWebTestContainerFactory$GrizzlyWebTestContainer.<init>(GrizzlyWebTestContainerFactory.java:86)
at com.sun.jersey.test.framework.spi.container.grizzly2.web.GrizzlyWebTestContainerFactory.create(GrizzlyWebTestContainerFactory.java:79)
at com.sun.jersey.test.framework.JerseyTest.getContainer(JerseyTest.java:342)
at com.sun.jersey.test.framework.JerseyTest.<init>(JerseyTest.java:217)
at org.apache.hadoop.yarn.webapp.JerseyTestBase.<init>(JerseyTestBase.java:27)
at org.apache.hadoop.yarn.server.timeline.webapp.TestTimelineWebServices.<init>(TestTimelineWebServices.java:170)
FAILED: org.apache.hadoop.yarn.server.timeline.webapp.TestTimelineWebServices.testGetEntity
Error Message:
java.net.BindException: Address already in use
Stack Trace:
com.sun.jersey.test.framework.spi.container.TestContainerException: java.net.BindException: Address already in use
at sun.nio.ch.Net.bind0(Native Method)
at sun.nio.ch.Net.bind(Net.java:444)
at sun.nio.ch.Net.bind(Net.java:436)
at sun.nio.ch.ServerSocketChannelImpl.bind(ServerSocketChannelImpl.java:214)
at sun.nio.ch.ServerSocketAdaptor.bind(ServerSocketAdaptor.java:74)
at org.glassfish.grizzly.nio.transport.TCPNIOTransport.bind(TCPNIOTransport.java:413)
at org.glassfish.grizzly.nio.transport.TCPNIOTransport.bind(TCPNIOTransport.java:384)
at org.glassfish.grizzly.nio.transport.TCPNIOTransport.bind(TCPNIOTransport.java:375)
at org.glassfish.grizzly.http.server.NetworkListener.start(NetworkListener.java:549)
at org.glassfish.grizzly.http.server.HttpServer.start(HttpServer.java:255)
at com.sun.jersey.api.container.grizzly2.GrizzlyServerFactory.createHttpServer(GrizzlyServerFactory.java:326)
at com.sun.jersey.api.container.grizzly2.GrizzlyServerFactory.createHttpServer(GrizzlyServerFactory.java:343)
at com.sun.jersey.test.framework.spi.container.grizzly2.web.GrizzlyWebTestContainerFactory$GrizzlyWebTestContainer.instantiateGrizzlyWebServer(GrizzlyWebTestContainerFactory.java:219)
at com.sun.jersey.test.framework.spi.container.grizzly2.web.GrizzlyWebTestContainerFactory$GrizzlyWebTestContainer.<init>(GrizzlyWebTestContainerFactory.java:129)
at com.sun.jersey.test.framework.spi.container.grizzly2.web.GrizzlyWebTestContainerFactory$GrizzlyWebTestContainer.<init>(GrizzlyWebTestContainerFactory.java:86)
at com.sun.jersey.test.framework.spi.container.grizzly2.web.GrizzlyWebTestContainerFactory.create(GrizzlyWebTestContainerFactory.java:79)
at com.sun.jersey.test.framework.JerseyTest.getContainer(JerseyTest.java:342)
at com.sun.jersey.test.framework.JerseyTest.<init>(JerseyTest.java:217)
at org.apache.hadoop.yarn.webapp.JerseyTestBase.<init>(JerseyTestBase.java:27)
at org.apache.hadoop.yarn.server.timeline.webapp.TestTimelineWebServices.<init>(TestTimelineWebServices.java:170)
FAILED: org.apache.hadoop.yarn.server.timeline.webapp.TestTimelineWebServices.testGetEvents
Error Message:
java.net.BindException: Address already in use
Stack Trace:
com.sun.jersey.test.framework.spi.container.TestContainerException: java.net.BindException: Address already in use
at sun.nio.ch.Net.bind0(Native Method)
at sun.nio.ch.Net.bind(Net.java:444)
at sun.nio.ch.Net.bind(Net.java:436)
at sun.nio.ch.ServerSocketChannelImpl.bind(ServerSocketChannelImpl.java:214)
at sun.nio.ch.ServerSocketAdaptor.bind(ServerSocketAdaptor.java:74)
at org.glassfish.grizzly.nio.transport.TCPNIOTransport.bind(TCPNIOTransport.java:413)
at org.glassfish.grizzly.nio.transport.TCPNIOTransport.bind(TCPNIOTransport.java:384)
at org.glassfish.grizzly.nio.transport.TCPNIOTransport.bind(TCPNIOTransport.java:375)
at org.glassfish.grizzly.http.server.NetworkListener.start(NetworkListener.java:549)
at org.glassfish.grizzly.http.server.HttpServer.start(HttpServer.java:255)
at com.sun.jersey.api.container.grizzly2.GrizzlyServerFactory.createHttpServer(GrizzlyServerFactory.java:326)
at com.sun.jersey.api.container.grizzly2.GrizzlyServerFactory.createHttpServer(GrizzlyServerFactory.java:343)
at com.sun.jersey.test.framework.spi.container.grizzly2.web.GrizzlyWebTestContainerFactory$GrizzlyWebTestContainer.instantiateGrizzlyWebServer(GrizzlyWebTestContainerFactory.java:219)
at com.sun.jersey.test.framework.spi.container.grizzly2.web.GrizzlyWebTestContainerFactory$GrizzlyWebTestContainer.<init>(GrizzlyWebTestContainerFactory.java:129)
at com.sun.jersey.test.framework.spi.container.grizzly2.web.GrizzlyWebTestContainerFactory$GrizzlyWebTestContainer.<init>(GrizzlyWebTestContainerFactory.java:86)
at com.sun.jersey.test.framework.spi.container.grizzly2.web.GrizzlyWebTestContainerFactory.create(GrizzlyWebTestContainerFactory.java:79)
at com.sun.jersey.test.framework.JerseyTest.getContainer(JerseyTest.java:342)
at com.sun.jersey.test.framework.JerseyTest.<init>(JerseyTest.java:217)
at org.apache.hadoop.yarn.webapp.JerseyTestBase.<init>(JerseyTestBase.java:27)
at org.apache.hadoop.yarn.server.timeline.webapp.TestTimelineWebServices.<init>(TestTimelineWebServices.java:170)
FAILED: org.apache.hadoop.yarn.server.timeline.webapp.TestTimelineWebServices.testPrimaryFilterInteger
Error Message:
java.net.BindException: Address already in use
Stack Trace:
com.sun.jersey.test.framework.spi.container.TestContainerException: java.net.BindException: Address already in use
at sun.nio.ch.Net.bind0(Native Method)
at sun.nio.ch.Net.bind(Net.java:444)
at sun.nio.ch.Net.bind(Net.java:436)
at sun.nio.ch.ServerSocketChannelImpl.bind(ServerSocketChannelImpl.java:214)
at sun.nio.ch.ServerSocketAdaptor.bind(ServerSocketAdaptor.java:74)
at org.glassfish.grizzly.nio.transport.TCPNIOTransport.bind(TCPNIOTransport.java:413)
at org.glassfish.grizzly.nio.transport.TCPNIOTransport.bind(TCPNIOTransport.java:384)
at org.glassfish.grizzly.nio.transport.TCPNIOTransport.bind(TCPNIOTransport.java:375)
at org.glassfish.grizzly.http.server.NetworkListener.start(NetworkListener.java:549)
at org.glassfish.grizzly.http.server.HttpServer.start(HttpServer.java:255)
at com.sun.jersey.api.container.grizzly2.GrizzlyServerFactory.createHttpServer(GrizzlyServerFactory.java:326)
at com.sun.jersey.api.container.grizzly2.GrizzlyServerFactory.createHttpServer(GrizzlyServerFactory.java:343)
at com.sun.jersey.test.framework.spi.container.grizzly2.web.GrizzlyWebTestContainerFactory$GrizzlyWebTestContainer.instantiateGrizzlyWebServer(GrizzlyWebTestContainerFactory.java:219)
at com.sun.jersey.test.framework.spi.container.grizzly2.web.GrizzlyWebTestContainerFactory$GrizzlyWebTestContainer.<init>(GrizzlyWebTestContainerFactory.java:129)
at com.sun.jersey.test.framework.spi.container.grizzly2.web.GrizzlyWebTestContainerFactory$GrizzlyWebTestContainer.<init>(GrizzlyWebTestContainerFactory.java:86)
at com.sun.jersey.test.framework.spi.container.grizzly2.web.GrizzlyWebTestContainerFactory.create(GrizzlyWebTestContainerFactory.java:79)
at com.sun.jersey.test.framework.JerseyTest.getContainer(JerseyTest.java:342)
at com.sun.jersey.test.framework.JerseyTest.<init>(JerseyTest.java:217)
at org.apache.hadoop.yarn.webapp.JerseyTestBase.<init>(JerseyTestBase.java:27)
at org.apache.hadoop.yarn.server.timeline.webapp.TestTimelineWebServices.<init>(TestTimelineWebServices.java:170)
FAILED: org.apache.hadoop.yarn.server.timeline.webapp.TestTimelineWebServices.testPostEntitiesWithYarnACLsEnabled
Error Message:
java.net.BindException: Address already in use
Stack Trace:
com.sun.jersey.test.framework.spi.container.TestContainerException: java.net.BindException: Address already in use
at sun.nio.ch.Net.bind0(Native Method)
at sun.nio.ch.Net.bind(Net.java:444)
at sun.nio.ch.Net.bind(Net.java:436)
at sun.nio.ch.ServerSocketChannelImpl.bind(ServerSocketChannelImpl.java:214)
at sun.nio.ch.ServerSocketAdaptor.bind(ServerSocketAdaptor.java:74)
at org.glassfish.grizzly.nio.transport.TCPNIOTransport.bind(TCPNIOTransport.java:413)
at org.glassfish.grizzly.nio.transport.TCPNIOTransport.bind(TCPNIOTransport.java:384)
at org.glassfish.grizzly.nio.transport.TCPNIOTransport.bind(TCPNIOTransport.java:375)
at org.glassfish.grizzly.http.server.NetworkListener.start(NetworkListener.java:549)
at org.glassfish.grizzly.http.server.HttpServer.start(HttpServer.java:255)
at com.sun.jersey.api.container.grizzly2.GrizzlyServerFactory.createHttpServer(GrizzlyServerFactory.java:326)
at com.sun.jersey.api.container.grizzly2.GrizzlyServerFactory.createHttpServer(GrizzlyServerFactory.java:343)
at com.sun.jersey.test.framework.spi.container.grizzly2.web.GrizzlyWebTestContainerFactory$GrizzlyWebTestContainer.instantiateGrizzlyWebServer(GrizzlyWebTestContainerFactory.java:219)
at com.sun.jersey.test.framework.spi.container.grizzly2.web.GrizzlyWebTestContainerFactory$GrizzlyWebTestContainer.<init>(GrizzlyWebTestContainerFactory.java:129)
at com.sun.jersey.test.framework.spi.container.grizzly2.web.GrizzlyWebTestContainerFactory$GrizzlyWebTestContainer.<init>(GrizzlyWebTestContainerFactory.java:86)
at com.sun.jersey.test.framework.spi.container.grizzly2.web.GrizzlyWebTestContainerFactory.create(GrizzlyWebTestContainerFactory.java:79)
at com.sun.jersey.test.framework.JerseyTest.getContainer(JerseyTest.java:342)
at com.sun.jersey.test.framework.JerseyTest.<init>(JerseyTest.java:217)
at org.apache.hadoop.yarn.webapp.JerseyTestBase.<init>(JerseyTestBase.java:27)
at org.apache.hadoop.yarn.server.timeline.webapp.TestTimelineWebServices.<init>(TestTimelineWebServices.java:170)
FAILED: org.apache.hadoop.yarn.server.timeline.webapp.TestTimelineWebServices.testFromId
Error Message:
java.net.BindException: Address already in use
Stack Trace:
com.sun.jersey.test.framework.spi.container.TestContainerException: java.net.BindException: Address already in use
at sun.nio.ch.Net.bind0(Native Method)
at sun.nio.ch.Net.bind(Net.java:444)
at sun.nio.ch.Net.bind(Net.java:436)
at sun.nio.ch.ServerSocketChannelImpl.bind(ServerSocketChannelImpl.java:214)
at sun.nio.ch.ServerSocketAdaptor.bind(ServerSocketAdaptor.java:74)
at org.glassfish.grizzly.nio.transport.TCPNIOTransport.bind(TCPNIOTransport.java:413)
at org.glassfish.grizzly.nio.transport.TCPNIOTransport.bind(TCPNIOTransport.java:384)
at org.glassfish.grizzly.nio.transport.TCPNIOTransport.bind(TCPNIOTransport.java:375)
at org.glassfish.grizzly.http.server.NetworkListener.start(NetworkListener.java:549)
at org.glassfish.grizzly.http.server.HttpServer.start(HttpServer.java:255)
at com.sun.jersey.api.container.grizzly2.GrizzlyServerFactory.createHttpServer(GrizzlyServerFactory.java:326)
at com.sun.jersey.api.container.grizzly2.GrizzlyServerFactory.createHttpServer(GrizzlyServerFactory.java:343)
at com.sun.jersey.test.framework.spi.container.grizzly2.web.GrizzlyWebTestContainerFactory$GrizzlyWebTestContainer.instantiateGrizzlyWebServer(GrizzlyWebTestContainerFactory.java:219)
at com.sun.jersey.test.framework.spi.container.grizzly2.web.GrizzlyWebTestContainerFactory$GrizzlyWebTestContainer.<init>(GrizzlyWebTestContainerFactory.java:129)
at com.sun.jersey.test.framework.spi.container.grizzly2.web.GrizzlyWebTestContainerFactory$GrizzlyWebTestContainer.<init>(GrizzlyWebTestContainerFactory.java:86)
at com.sun.jersey.test.framework.spi.container.grizzly2.web.GrizzlyWebTestContainerFactory.create(GrizzlyWebTestContainerFactory.java:79)
at com.sun.jersey.test.framework.JerseyTest.getContainer(JerseyTest.java:342)
at com.sun.jersey.test.framework.JerseyTest.<init>(JerseyTest.java:217)
at org.apache.hadoop.yarn.webapp.JerseyTestBase.<init>(JerseyTestBase.java:27)
at org.apache.hadoop.yarn.server.timeline.webapp.TestTimelineWebServices.<init>(TestTimelineWebServices.java:170)
FAILED: org.apache.hadoop.yarn.server.timeline.webapp.TestTimelineWebServices.testFromTs
Error Message:
java.net.BindException: Address already in use
Stack Trace:
com.sun.jersey.test.framework.spi.container.TestContainerException: java.net.BindException: Address already in use
at sun.nio.ch.Net.bind0(Native Method)
at sun.nio.ch.Net.bind(Net.java:444)
at sun.nio.ch.Net.bind(Net.java:436)
at sun.nio.ch.ServerSocketChannelImpl.bind(ServerSocketChannelImpl.java:214)
at sun.nio.ch.ServerSocketAdaptor.bind(ServerSocketAdaptor.java:74)
at org.glassfish.grizzly.nio.transport.TCPNIOTransport.bind(TCPNIOTransport.java:413)
at org.glassfish.grizzly.nio.transport.TCPNIOTransport.bind(TCPNIOTransport.java:384)
at org.glassfish.grizzly.nio.transport.TCPNIOTransport.bind(TCPNIOTransport.java:375)
at org.glassfish.grizzly.http.server.NetworkListener.start(NetworkListener.java:549)
at org.glassfish.grizzly.http.server.HttpServer.start(HttpServer.java:255)
at com.sun.jersey.api.container.grizzly2.GrizzlyServerFactory.createHttpServer(GrizzlyServerFactory.java:326)
at com.sun.jersey.api.container.grizzly2.GrizzlyServerFactory.createHttpServer(GrizzlyServerFactory.java:343)
at com.sun.jersey.test.framework.spi.container.grizzly2.web.GrizzlyWebTestContainerFactory$GrizzlyWebTestContainer.instantiateGrizzlyWebServer(GrizzlyWebTestContainerFactory.java:219)
at com.sun.jersey.test.framework.spi.container.grizzly2.web.GrizzlyWebTestContainerFactory$GrizzlyWebTestContainer.<init>(GrizzlyWebTestContainerFactory.java:129)
at com.sun.jersey.test.framework.spi.container.grizzly2.web.GrizzlyWebTestContainerFactory$GrizzlyWebTestContainer.<init>(GrizzlyWebTestContainerFactory.java:86)
at com.sun.jersey.test.framework.spi.container.grizzly2.web.GrizzlyWebTestContainerFactory.create(GrizzlyWebTestContainerFactory.java:79)
at com.sun.jersey.test.framework.JerseyTest.getContainer(JerseyTest.java:342)
at com.sun.jersey.test.framework.JerseyTest.<init>(JerseyTest.java:217)
at org.apache.hadoop.yarn.webapp.JerseyTestBase.<init>(JerseyTestBase.java:27)
at org.apache.hadoop.yarn.server.timeline.webapp.TestTimelineWebServices.<init>(TestTimelineWebServices.java:170)
FAILED: org.apache.hadoop.yarn.server.timeline.webapp.TestTimelineWebServices.testGetEventsWithYarnACLsEnabled
Error Message:
java.net.BindException: Address already in use
Stack Trace:
com.sun.jersey.test.framework.spi.container.TestContainerException: java.net.BindException: Address already in use
at sun.nio.ch.Net.bind0(Native Method)
at sun.nio.ch.Net.bind(Net.java:444)
at sun.nio.ch.Net.bind(Net.java:436)
at sun.nio.ch.ServerSocketChannelImpl.bind(ServerSocketChannelImpl.java:214)
at sun.nio.ch.ServerSocketAdaptor.bind(ServerSocketAdaptor.java:74)
at org.glassfish.grizzly.nio.transport.TCPNIOTransport.bind(TCPNIOTransport.java:413)
at org.glassfish.grizzly.nio.transport.TCPNIOTransport.bind(TCPNIOTransport.java:384)
at org.glassfish.grizzly.nio.transport.TCPNIOTransport.bind(TCPNIOTransport.java:375)
at org.glassfish.grizzly.http.server.NetworkListener.start(NetworkListener.java:549)
at org.glassfish.grizzly.http.server.HttpServer.start(HttpServer.java:255)
at com.sun.jersey.api.container.grizzly2.GrizzlyServerFactory.createHttpServer(GrizzlyServerFactory.java:326)
at com.sun.jersey.api.container.grizzly2.GrizzlyServerFactory.createHttpServer(GrizzlyServerFactory.java:343)
at com.sun.jersey.test.framework.spi.container.grizzly2.web.GrizzlyWebTestContainerFactory$GrizzlyWebTestContainer.instantiateGrizzlyWebServer(GrizzlyWebTestContainerFactory.java:219)
at com.sun.jersey.test.framework.spi.container.grizzly2.web.GrizzlyWebTestContainerFactory$GrizzlyWebTestContainer.<init>(GrizzlyWebTestContainerFactory.java:129)
at com.sun.jersey.test.framework.spi.container.grizzly2.web.GrizzlyWebTestContainerFactory$GrizzlyWebTestContainer.<init>(GrizzlyWebTestContainerFactory.java:86)
at com.sun.jersey.test.framework.spi.container.grizzly2.web.GrizzlyWebTestContainerFactory.create(GrizzlyWebTestContainerFactory.java:79)
at com.sun.jersey.test.framework.JerseyTest.getContainer(JerseyTest.java:342)
at com.sun.jersey.test.framework.JerseyTest.<init>(JerseyTest.java:217)
at org.apache.hadoop.yarn.webapp.JerseyTestBase.<init>(JerseyTestBase.java:27)
at org.apache.hadoop.yarn.server.timeline.webapp.TestTimelineWebServices.<init>(TestTimelineWebServices.java:170)
FAILED: org.apache.hadoop.yarn.server.timeline.webapp.TestTimelineWebServices.testGetEntitiesWithYarnACLsEnabled
Error Message:
java.net.BindException: Address already in use
Stack Trace:
com.sun.jersey.test.framework.spi.container.TestContainerException: java.net.BindException: Address already in use
at sun.nio.ch.Net.bind0(Native Method)
at sun.nio.ch.Net.bind(Net.java:444)
at sun.nio.ch.Net.bind(Net.java:436)
at sun.nio.ch.ServerSocketChannelImpl.bind(ServerSocketChannelImpl.java:214)
at sun.nio.ch.ServerSocketAdaptor.bind(ServerSocketAdaptor.java:74)
at org.glassfish.grizzly.nio.transport.TCPNIOTransport.bind(TCPNIOTransport.java:413)
at org.glassfish.grizzly.nio.transport.TCPNIOTransport.bind(TCPNIOTransport.java:384)
at org.glassfish.grizzly.nio.transport.TCPNIOTransport.bind(TCPNIOTransport.java:375)
at org.glassfish.grizzly.http.server.NetworkListener.start(NetworkListener.java:549)
at org.glassfish.grizzly.http.server.HttpServer.start(HttpServer.java:255)
at com.sun.jersey.api.container.grizzly2.GrizzlyServerFactory.createHttpServer(GrizzlyServerFactory.java:326)
at com.sun.jersey.api.container.grizzly2.GrizzlyServerFactory.createHttpServer(GrizzlyServerFactory.java:343)
at com.sun.jersey.test.framework.spi.container.grizzly2.web.GrizzlyWebTestContainerFactory$GrizzlyWebTestContainer.instantiateGrizzlyWebServer(GrizzlyWebTestContainerFactory.java:219)
at com.sun.jersey.test.framework.spi.container.grizzly2.web.GrizzlyWebTestContainerFactory$GrizzlyWebTestContainer.<init>(GrizzlyWebTestContainerFactory.java:129)
at com.sun.jersey.test.framework.spi.container.grizzly2.web.GrizzlyWebTestContainerFactory$GrizzlyWebTestContainer.<init>(GrizzlyWebTestContainerFactory.java:86)
at com.sun.jersey.test.framework.spi.container.grizzly2.web.GrizzlyWebTestContainerFactory.create(GrizzlyWebTestContainerFactory.java:79)
at com.sun.jersey.test.framework.JerseyTest.getContainer(JerseyTest.java:342)
at com.sun.jersey.test.framework.JerseyTest.<init>(JerseyTest.java:217)
at org.apache.hadoop.yarn.webapp.JerseyTestBase.<init>(JerseyTestBase.java:27)
at org.apache.hadoop.yarn.server.timeline.webapp.TestTimelineWebServices.<init>(TestTimelineWebServices.java:170)
REGRESSION: org.apache.hadoop.yarn.server.resourcemanager.metrics.TestSystemMetricsPublisher.testPublishApplicationMetrics
Error Message:
expected:<null> but was:<high-cpu>
Stack Trace:
java.lang.AssertionError: expected:<null> but was:<high-cpu>
at org.junit.Assert.fail(Assert.java:88)
at org.junit.Assert.failNotEquals(Assert.java:743)
at org.junit.Assert.assertEquals(Assert.java:118)
at org.junit.Assert.assertEquals(Assert.java:144)
at org.apache.hadoop.yarn.server.resourcemanager.metrics.TestSystemMetricsPublisher.testPublishApplicationMetrics(TestSystemMetricsPublisher.java:169)
REGRESSION: org.apache.hadoop.yarn.server.resourcemanager.scheduler.capacity.TestCapacitySchedulerQueueACLs.testApplicationACLs
Error Message:
org/apache/hadoop/yarn/server/applicationhistoryservice/ApplicationHistoryWriter
Stack Trace:
java.lang.NoClassDefFoundError: org/apache/hadoop/yarn/server/applicationhistoryservice/ApplicationHistoryWriter
at org.apache.hadoop.yarn.server.resourcemanager.ResourceManager.createRMApplicationHistoryWriter(ResourceManager.java:364)
at org.apache.hadoop.yarn.server.resourcemanager.ResourceManager.serviceInit(ResourceManager.java:262)
at org.apache.hadoop.service.AbstractService.init(AbstractService.java:163)
at org.apache.hadoop.yarn.server.resourcemanager.MockRM.<init>(MockRM.java:120)
at org.apache.hadoop.yarn.server.resourcemanager.MockRM.<init>(MockRM.java:113)
at org.apache.hadoop.yarn.server.resourcemanager.MockRM.<init>(MockRM.java:109)
at org.apache.hadoop.yarn.server.resourcemanager.QueueACLsTestBase$1.<init>(QueueACLsTestBase.java:85)
at org.apache.hadoop.yarn.server.resourcemanager.QueueACLsTestBase.setup(QueueACLsTestBase.java:85)
at sun.reflect.NativeMethodAccessorImpl.invoke0(Native Method)
at sun.reflect.NativeMethodAccessorImpl.invoke(NativeMethodAccessorImpl.java:57)
at sun.reflect.DelegatingMethodAccessorImpl.invoke(DelegatingMethodAccessorImpl.java:43)
at java.lang.reflect.Method.invoke(Method.java:606)
at org.junit.runners.model.FrameworkMethod$1.runReflectiveCall(FrameworkMethod.java:47)
at org.junit.internal.runners.model.ReflectiveCallable.run(ReflectiveCallable.java:12)
at org.junit.runners.model.FrameworkMethod.invokeExplosively(FrameworkMethod.java:44)
at org.junit.internal.runners.statements.RunBefores.evaluate(RunBefores.java:24)
at org.junit.internal.runners.statements.RunAfters.evaluate(RunAfters.java:27)
at org.junit.runners.ParentRunner.runLeaf(ParentRunner.java:271)
at org.junit.runners.BlockJUnit4ClassRunner.runChild(BlockJUnit4ClassRunner.java:70)
at org.junit.runners.BlockJUnit4ClassRunner.runChild(BlockJUnit4ClassRunner.java:50)
at org.junit.runners.ParentRunner$3.run(ParentRunner.java:238)
at org.junit.runners.ParentRunner$1.schedule(ParentRunner.java:63)
at org.junit.runners.ParentRunner.runChildren(ParentRunner.java:236)
at org.junit.runners.ParentRunner.access$000(ParentRunner.java:53)
at org.junit.runners.ParentRunner$2.evaluate(ParentRunner.java:229)
at org.junit.runners.ParentRunner.run(ParentRunner.java:309)
at org.apache.maven.surefire.junit4.JUnit4Provider.execute(JUnit4Provider.java:264)
at org.apache.maven.surefire.junit4.JUnit4Provider.executeTestSet(JUnit4Provider.java:153)
at org.apache.maven.surefire.junit4.JUnit4Provider.invoke(JUnit4Provider.java:124)
at org.apache.maven.surefire.booter.ForkedBooter.invokeProviderInSameClassLoader(ForkedBooter.java:200)
at org.apache.maven.surefire.booter.ForkedBooter.runSuitesInProcess(ForkedBooter.java:153)
at org.apache.maven.surefire.booter.ForkedBooter.main(ForkedBooter.java:103)
Caused by: java.lang.ClassNotFoundException: org.apache.hadoop.yarn.server.applicationhistoryservice.ApplicationHistoryWriter
at java.net.URLClassLoader$1.run(URLClassLoader.java:366)
at java.net.URLClassLoader$1.run(URLClassLoader.java:355)
at java.security.AccessController.doPrivileged(Native Method)
at java.net.URLClassLoader.findClass(URLClassLoader.java:354)
at java.lang.ClassLoader.loadClass(ClassLoader.java:425)
at sun.misc.Launcher$AppClassLoader.loadClass(Launcher.java:308)
at java.lang.ClassLoader.loadClass(ClassLoader.java:358)
at org.apache.hadoop.yarn.server.resourcemanager.ResourceManager.createRMApplicationHistoryWriter(ResourceManager.java:364)
at org.apache.hadoop.yarn.server.resourcemanager.ResourceManager.serviceInit(ResourceManager.java:262)
at org.apache.hadoop.service.AbstractService.init(AbstractService.java:163)
at org.apache.hadoop.yarn.server.resourcemanager.MockRM.<init>(MockRM.java:120)
at org.apache.hadoop.yarn.server.resourcemanager.MockRM.<init>(MockRM.java:113)
at org.apache.hadoop.yarn.server.resourcemanager.MockRM.<init>(MockRM.java:109)
at org.apache.hadoop.yarn.server.resourcemanager.QueueACLsTestBase$1.<init>(QueueACLsTestBase.java:85)
at org.apache.hadoop.yarn.server.resourcemanager.QueueACLsTestBase.setup(QueueACLsTestBase.java:85)
at sun.reflect.NativeMethodAccessorImpl.invoke0(Native Method)
at sun.reflect.NativeMethodAccessorImpl.invoke(NativeMethodAccessorImpl.java:57)
at sun.reflect.DelegatingMethodAccessorImpl.invoke(DelegatingMethodAccessorImpl.java:43)
at java.lang.reflect.Method.invoke(Method.java:606)
at org.junit.runners.model.FrameworkMethod$1.runReflectiveCall(FrameworkMethod.java:47)
at org.junit.internal.runners.model.ReflectiveCallable.run(ReflectiveCallable.java:12)
at org.junit.runners.model.FrameworkMethod.invokeExplosively(FrameworkMethod.java:44)
at org.junit.internal.runners.statements.RunBefores.evaluate(RunBefores.java:24)
at org.junit.internal.runners.statements.RunAfters.evaluate(RunAfters.java:27)
at org.junit.runners.ParentRunner.runLeaf(ParentRunner.java:271)
at org.junit.runners.BlockJUnit4ClassRunner.runChild(BlockJUnit4ClassRunner.java:70)
at org.junit.runners.BlockJUnit4ClassRunner.runChild(BlockJUnit4ClassRunner.java:50)
at org.junit.runners.ParentRunner$3.run(ParentRunner.java:238)
at org.junit.runners.ParentRunner$1.schedule(ParentRunner.java:63)
at org.junit.runners.ParentRunner.runChildren(ParentRunner.java:236)
at org.junit.runners.ParentRunner.access$000(ParentRunner.java:53)
at org.junit.runners.ParentRunner$2.evaluate(ParentRunner.java:229)
at org.junit.runners.ParentRunner.run(ParentRunner.java:309)
at org.apache.maven.surefire.junit4.JUnit4Provider.execute(JUnit4Provider.java:264)
at org.apache.maven.surefire.junit4.JUnit4Provider.executeTestSet(JUnit4Provider.java:153)
at org.apache.maven.surefire.junit4.JUnit4Provider.invoke(JUnit4Provider.java:124)
at org.apache.maven.surefire.booter.ForkedBooter.invokeProviderInSameClassLoader(ForkedBooter.java:200)
at org.apache.maven.surefire.booter.ForkedBooter.runSuitesInProcess(ForkedBooter.java:153)
at org.apache.maven.surefire.booter.ForkedBooter.main(ForkedBooter.java:103)
REGRESSION: org.apache.hadoop.yarn.server.resourcemanager.scheduler.capacity.TestLeafQueue.testHeadroomWithMaxCap
Error Message:
org/apache/hadoop/yarn/server/utils/BuilderUtils
Stack Trace:
java.lang.NoClassDefFoundError: org/apache/hadoop/yarn/server/utils/BuilderUtils
at java.net.URLClassLoader$1.run(URLClassLoader.java:366)
at java.net.URLClassLoader$1.run(URLClassLoader.java:355)
at java.security.AccessController.doPrivileged(Native Method)
at java.net.URLClassLoader.findClass(URLClassLoader.java:354)
at java.lang.ClassLoader.loadClass(ClassLoader.java:425)
at sun.misc.Launcher$AppClassLoader.loadClass(Launcher.java:308)
at java.lang.ClassLoader.loadClass(ClassLoader.java:358)
at org.apache.hadoop.yarn.server.resourcemanager.scheduler.capacity.TestUtils.getMockApplicationAttemptId(TestUtils.java:181)
at org.apache.hadoop.yarn.server.resourcemanager.scheduler.capacity.TestLeafQueue.testHeadroomWithMaxCap(TestLeafQueue.java:940)
REGRESSION: org.apache.hadoop.yarn.server.resourcemanager.scheduler.capacity.TestLeafQueue.testLocalityConstraints
Error Message:
org/apache/hadoop/yarn/server/utils/BuilderUtils
Stack Trace:
java.lang.NoClassDefFoundError: org/apache/hadoop/yarn/server/utils/BuilderUtils
at org.apache.hadoop.yarn.server.resourcemanager.scheduler.capacity.TestUtils.getMockApplicationAttemptId(TestUtils.java:181)
at org.apache.hadoop.yarn.server.resourcemanager.scheduler.capacity.TestLeafQueue.testLocalityConstraints(TestLeafQueue.java:2040)
REGRESSION: org.apache.hadoop.yarn.server.resourcemanager.scheduler.capacity.TestLeafQueue.testActivateApplicationByUpdatingClusterResource
Error Message:
org/apache/hadoop/yarn/server/utils/BuilderUtils
Stack Trace:
java.lang.NoClassDefFoundError: org/apache/hadoop/yarn/server/utils/BuilderUtils
at org.apache.hadoop.yarn.server.resourcemanager.scheduler.capacity.TestUtils.getMockApplicationAttemptId(TestUtils.java:181)
at org.apache.hadoop.yarn.server.resourcemanager.scheduler.capacity.TestLeafQueue.testActivateApplicationByUpdatingClusterResource(TestLeafQueue.java:1961)
REGRESSION: org.apache.hadoop.yarn.server.resourcemanager.scheduler.capacity.TestLeafQueue.testComputeUserLimitAndSetHeadroom
Error Message:
org/apache/hadoop/yarn/server/api/protocolrecords/NodeHeartbeatResponse
Stack Trace:
java.lang.NoClassDefFoundError: org/apache/hadoop/yarn/server/api/protocolrecords/NodeHeartbeatResponse
at java.net.URLClassLoader$1.run(URLClassLoader.java:366)
at java.net.URLClassLoader$1.run(URLClassLoader.java:355)
at java.security.AccessController.doPrivileged(Native Method)
at java.net.URLClassLoader.findClass(URLClassLoader.java:354)
at java.lang.ClassLoader.loadClass(ClassLoader.java:425)
at sun.misc.Launcher$AppClassLoader.loadClass(Launcher.java:308)
at java.lang.ClassLoader.loadClass(ClassLoader.java:358)
at java.lang.Class.getDeclaredMethods0(Native Method)
at java.lang.Class.privateGetDeclaredMethods(Class.java:2531)
at java.lang.Class.getDeclaredMethods(Class.java:1855)
at org.mockito.cglib.core.ReflectUtils.addAllMethods(ReflectUtils.java:349)
at org.mockito.cglib.proxy.Enhancer.getMethods(Enhancer.java:427)
at org.mockito.cglib.proxy.Enhancer.generateClass(Enhancer.java:457)
at org.mockito.cglib.core.DefaultGeneratorStrategy.generate(DefaultGeneratorStrategy.java:25)
at org.mockito.cglib.core.AbstractClassGenerator.create(AbstractClassGenerator.java:217)
at org.mockito.cglib.proxy.Enhancer.createHelper(Enhancer.java:378)
at org.mockito.cglib.proxy.Enhancer.createClass(Enhancer.java:318)
at org.mockito.internal.creation.jmock.ClassImposterizer.createProxyClass(ClassImposterizer.java:93)
at org.mockito.internal.creation.jmock.ClassImposterizer.imposterise(ClassImposterizer.java:50)
at org.mockito.internal.util.MockUtil.createMock(MockUtil.java:54)
at org.mockito.internal.MockitoCore.mock(MockitoCore.java:45)
at org.mockito.Mockito.mock(Mockito.java:921)
at org.mockito.Mockito.mock(Mockito.java:816)
at org.apache.hadoop.yarn.server.resourcemanager.scheduler.capacity.TestUtils.getMockNode(TestUtils.java:188)
at org.apache.hadoop.yarn.server.resourcemanager.scheduler.capacity.TestLeafQueue.testComputeUserLimitAndSetHeadroom(TestLeafQueue.java:702)
REGRESSION: org.apache.hadoop.yarn.server.resourcemanager.scheduler.capacity.TestLeafQueue.testAllocateContainerOnNodeWithoutOffSwitchSpecified
Error Message:
org/apache/hadoop/yarn/server/utils/BuilderUtils
Stack Trace:
java.lang.NoClassDefFoundError: org/apache/hadoop/yarn/server/utils/BuilderUtils
at org.apache.hadoop.yarn.server.resourcemanager.scheduler.capacity.TestUtils.getMockApplicationAttemptId(TestUtils.java:181)
at org.apache.hadoop.yarn.server.resourcemanager.scheduler.capacity.TestLeafQueue.testAllocateContainerOnNodeWithoutOffSwitchSpecified(TestLeafQueue.java:2298)
REGRESSION: org.apache.hadoop.yarn.server.resourcemanager.scheduler.capacity.TestLeafQueue.testUserQueueAcl
Error Message:
org/apache/hadoop/yarn/server/utils/BuilderUtils
Stack Trace:
java.lang.NoClassDefFoundError: org/apache/hadoop/yarn/server/utils/BuilderUtils
at org.apache.hadoop.yarn.server.resourcemanager.scheduler.capacity.TestUtils.getMockApplicationAttemptId(TestUtils.java:181)
at org.apache.hadoop.yarn.server.resourcemanager.scheduler.capacity.TestLeafQueue.testUserQueueAcl(TestLeafQueue.java:339)
REGRESSION: org.apache.hadoop.yarn.server.resourcemanager.scheduler.capacity.TestLeafQueue.testSingleQueueWithMultipleUsers
Error Message:
org/apache/hadoop/yarn/server/utils/BuilderUtils
Stack Trace:
java.lang.NoClassDefFoundError: org/apache/hadoop/yarn/server/utils/BuilderUtils
at org.apache.hadoop.yarn.server.resourcemanager.scheduler.capacity.TestUtils.getMockApplicationAttemptId(TestUtils.java:181)
at org.apache.hadoop.yarn.server.resourcemanager.scheduler.capacity.TestLeafQueue.testSingleQueueWithMultipleUsers(TestLeafQueue.java:1057)
REGRESSION: org.apache.hadoop.yarn.server.resourcemanager.scheduler.capacity.TestLeafQueue.testFifoAssignment
Error Message:
org/apache/hadoop/yarn/server/api/protocolrecords/NodeHeartbeatResponse
Stack Trace:
java.lang.NoClassDefFoundError: org/apache/hadoop/yarn/server/api/protocolrecords/NodeHeartbeatResponse
at java.net.URLClassLoader$1.run(URLClassLoader.java:366)
at java.net.URLClassLoader$1.run(URLClassLoader.java:355)
at java.security.AccessController.doPrivileged(Native Method)
at java.net.URLClassLoader.findClass(URLClassLoader.java:354)
at java.lang.ClassLoader.loadClass(ClassLoader.java:425)
at sun.misc.Launcher$AppClassLoader.loadClass(Launcher.java:308)
at java.lang.ClassLoader.loadClass(ClassLoader.java:358)
at java.lang.Class.getDeclaredMethods0(Native Method)
at java.lang.Class.privateGetDeclaredMethods(Class.java:2531)
at java.lang.Class.getDeclaredMethods(Class.java:1855)
at org.mockito.cglib.core.ReflectUtils.addAllMethods(ReflectUtils.java:349)
at org.mockito.cglib.proxy.Enhancer.getMethods(Enhancer.java:427)
at org.mockito.cglib.proxy.Enhancer.generateClass(Enhancer.java:457)
at org.mockito.cglib.core.DefaultGeneratorStrategy.generate(DefaultGeneratorStrategy.java:25)
at org.mockito.cglib.core.AbstractClassGenerator.create(AbstractClassGenerator.java:217)
at org.mockito.cglib.proxy.Enhancer.createHelper(Enhancer.java:378)
at org.mockito.cglib.proxy.Enhancer.createClass(Enhancer.java:318)
at org.mockito.internal.creation.jmock.ClassImposterizer.createProxyClass(ClassImposterizer.java:93)
at org.mockito.internal.creation.jmock.ClassImposterizer.imposterise(ClassImposterizer.java:50)
at org.mockito.internal.util.MockUtil.createMock(MockUtil.java:54)
at org.mockito.internal.MockitoCore.mock(MockitoCore.java:45)
at org.mockito.Mockito.mock(Mockito.java:921)
at org.mockito.Mockito.mock(Mockito.java:816)
at org.apache.hadoop.yarn.server.resourcemanager.scheduler.capacity.TestUtils.getMockNode(TestUtils.java:188)
at org.apache.hadoop.yarn.server.resourcemanager.scheduler.capacity.TestLeafQueue.testFifoAssignment(TestLeafQueue.java:2348)
REGRESSION: org.apache.hadoop.yarn.server.resourcemanager.scheduler.capacity.TestLeafQueue.testLocalityScheduling
Error Message:
org/apache/hadoop/yarn/server/utils/BuilderUtils
Stack Trace:
java.lang.NoClassDefFoundError: org/apache/hadoop/yarn/server/utils/BuilderUtils
at org.apache.hadoop.yarn.server.resourcemanager.scheduler.capacity.TestUtils.getMockApplicationAttemptId(TestUtils.java:181)
at org.apache.hadoop.yarn.server.resourcemanager.scheduler.capacity.TestLeafQueue.testLocalityScheduling(TestLeafQueue.java:1516)
REGRESSION: org.apache.hadoop.yarn.server.resourcemanager.scheduler.capacity.TestLeafQueue.testSchedulingConstraints
Error Message:
org/apache/hadoop/yarn/server/utils/BuilderUtils
Stack Trace:
java.lang.NoClassDefFoundError: org/apache/hadoop/yarn/server/utils/BuilderUtils
at org.apache.hadoop.yarn.server.resourcemanager.scheduler.capacity.TestUtils.getMockApplicationAttemptId(TestUtils.java:181)
at org.apache.hadoop.yarn.server.resourcemanager.scheduler.capacity.TestLeafQueue.testSchedulingConstraints(TestLeafQueue.java:1775)
REGRESSION: org.apache.hadoop.yarn.server.resourcemanager.scheduler.capacity.TestLeafQueue.testActivateApplicationAfterQueueRefresh
Error Message:
org/apache/hadoop/yarn/server/utils/BuilderUtils
Stack Trace:
java.lang.NoClassDefFoundError: org/apache/hadoop/yarn/server/utils/BuilderUtils
at org.apache.hadoop.yarn.server.resourcemanager.scheduler.capacity.TestUtils.getMockApplicationAttemptId(TestUtils.java:181)
at org.apache.hadoop.yarn.server.resourcemanager.scheduler.capacity.TestLeafQueue.testActivateApplicationAfterQueueRefresh(TestLeafQueue.java:1880)
REGRESSION: org.apache.hadoop.yarn.server.resourcemanager.scheduler.capacity.TestLeafQueue.testReservationExchange
Error Message:
org/apache/hadoop/yarn/server/utils/BuilderUtils
Stack Trace:
java.lang.NoClassDefFoundError: org/apache/hadoop/yarn/server/utils/BuilderUtils
at org.apache.hadoop.yarn.server.resourcemanager.scheduler.capacity.TestUtils.getMockApplicationAttemptId(TestUtils.java:181)
at org.apache.hadoop.yarn.server.resourcemanager.scheduler.capacity.TestLeafQueue.testReservationExchange(TestLeafQueue.java:1365)
REGRESSION: org.apache.hadoop.yarn.server.resourcemanager.scheduler.capacity.TestLeafQueue.testUserLimits
Error Message:
org/apache/hadoop/yarn/server/utils/BuilderUtils
Stack Trace:
java.lang.NoClassDefFoundError: org/apache/hadoop/yarn/server/utils/BuilderUtils
at org.apache.hadoop.yarn.server.resourcemanager.scheduler.capacity.TestUtils.getMockApplicationAttemptId(TestUtils.java:181)
at org.apache.hadoop.yarn.server.resourcemanager.scheduler.capacity.TestLeafQueue.testUserLimits(TestLeafQueue.java:615)
REGRESSION: org.apache.hadoop.yarn.server.resourcemanager.scheduler.capacity.TestLeafQueue.testUserHeadroomMultiApp
Error Message:
org/apache/hadoop/yarn/server/utils/BuilderUtils
Stack Trace:
java.lang.NoClassDefFoundError: org/apache/hadoop/yarn/server/utils/BuilderUtils
at org.apache.hadoop.yarn.server.resourcemanager.scheduler.capacity.TestUtils.getMockApplicationAttemptId(TestUtils.java:181)
at org.apache.hadoop.yarn.server.resourcemanager.scheduler.capacity.TestLeafQueue.testUserHeadroomMultiApp(TestLeafQueue.java:850)
REGRESSION: org.apache.hadoop.yarn.server.resourcemanager.scheduler.capacity.TestLeafQueue.testFairAssignment
Error Message:
org/apache/hadoop/yarn/server/api/protocolrecords/NodeHeartbeatResponse
Stack Trace:
java.lang.NoClassDefFoundError: org/apache/hadoop/yarn/server/api/protocolrecords/NodeHeartbeatResponse
at java.net.URLClassLoader$1.run(URLClassLoader.java:366)
at java.net.URLClassLoader$1.run(URLClassLoader.java:355)
at java.security.AccessController.doPrivileged(Native Method)
at java.net.URLClassLoader.findClass(URLClassLoader.java:354)
at java.lang.ClassLoader.loadClass(ClassLoader.java:425)
at sun.misc.Launcher$AppClassLoader.loadClass(Launcher.java:308)
at java.lang.ClassLoader.loadClass(ClassLoader.java:358)
at java.lang.Class.getDeclaredMethods0(Native Method)
at java.lang.Class.privateGetDeclaredMethods(Class.java:2531)
at java.lang.Class.getDeclaredMethods(Class.java:1855)
at org.mockito.cglib.core.ReflectUtils.addAllMethods(ReflectUtils.java:349)
at org.mockito.cglib.proxy.Enhancer.getMethods(Enhancer.java:427)
at org.mockito.cglib.proxy.Enhancer.generateClass(Enhancer.java:457)
at org.mockito.cglib.core.DefaultGeneratorStrategy.generate(DefaultGeneratorStrategy.java:25)
at org.mockito.cglib.core.AbstractClassGenerator.create(AbstractClassGenerator.java:217)
at org.mockito.cglib.proxy.Enhancer.createHelper(Enhancer.java:378)
at org.mockito.cglib.proxy.Enhancer.createClass(Enhancer.java:318)
at org.mockito.internal.creation.jmock.ClassImposterizer.createProxyClass(ClassImposterizer.java:93)
at org.mockito.internal.creation.jmock.ClassImposterizer.imposterise(ClassImposterizer.java:50)
at org.mockito.internal.util.MockUtil.createMock(MockUtil.java:54)
at org.mockito.internal.MockitoCore.mock(MockitoCore.java:45)
at org.mockito.Mockito.mock(Mockito.java:921)
at org.mockito.Mockito.mock(Mockito.java:816)
at org.apache.hadoop.yarn.server.resourcemanager.scheduler.capacity.TestUtils.getMockNode(TestUtils.java:188)
at org.apache.hadoop.yarn.server.resourcemanager.scheduler.capacity.TestLeafQueue.testFairAssignment(TestLeafQueue.java:2496)
REGRESSION: org.apache.hadoop.yarn.server.resourcemanager.scheduler.capacity.TestLeafQueue.testAppAttemptMetrics
Error Message:
org/apache/hadoop/yarn/server/utils/BuilderUtils
Stack Trace:
java.lang.NoClassDefFoundError: org/apache/hadoop/yarn/server/utils/BuilderUtils
at org.apache.hadoop.yarn.server.resourcemanager.scheduler.capacity.TestUtils.getMockApplicationAttemptId(TestUtils.java:181)
at org.apache.hadoop.yarn.server.resourcemanager.scheduler.capacity.TestLeafQueue.testAppAttemptMetrics(TestLeafQueue.java:378)
REGRESSION: org.apache.hadoop.yarn.server.resourcemanager.scheduler.capacity.TestLeafQueue.testApplicationPriorityScheduling
Error Message:
org/apache/hadoop/yarn/server/utils/BuilderUtils
Stack Trace:
java.lang.NoClassDefFoundError: org/apache/hadoop/yarn/server/utils/BuilderUtils
at org.apache.hadoop.yarn.server.resourcemanager.scheduler.capacity.TestUtils.getMockApplicationAttemptId(TestUtils.java:181)
at org.apache.hadoop.yarn.server.resourcemanager.scheduler.capacity.TestLeafQueue.testApplicationPriorityScheduling(TestLeafQueue.java:1654)
REGRESSION: org.apache.hadoop.yarn.server.resourcemanager.scheduler.capacity.TestLeafQueue.testSingleQueueOneUserMetrics
Error Message:
org/apache/hadoop/yarn/server/utils/BuilderUtils
Stack Trace:
java.lang.NoClassDefFoundError: org/apache/hadoop/yarn/server/utils/BuilderUtils
at org.apache.hadoop.yarn.server.resourcemanager.scheduler.capacity.TestUtils.getMockApplicationAttemptId(TestUtils.java:181)
at org.apache.hadoop.yarn.server.resourcemanager.scheduler.capacity.TestLeafQueue.testSingleQueueOneUserMetrics(TestLeafQueue.java:288)
REGRESSION: org.apache.hadoop.yarn.server.resourcemanager.scheduler.capacity.TestLeafQueue.testLocalityDelaySkipsApplication
Error Message:
org/apache/hadoop/yarn/server/utils/BuilderUtils
Stack Trace:
java.lang.NoClassDefFoundError: org/apache/hadoop/yarn/server/utils/BuilderUtils
at org.apache.hadoop.yarn.server.resourcemanager.scheduler.capacity.TestUtils.getMockApplicationAttemptId(TestUtils.java:181)
at org.apache.hadoop.yarn.server.resourcemanager.scheduler.capacity.TestLeafQueue.testLocalityDelaySkipsApplication(TestLeafQueue.java:2575)
REGRESSION: org.apache.hadoop.yarn.server.resourcemanager.scheduler.capacity.TestLeafQueue.testConcurrentAccess
Error Message:
org/apache/hadoop/yarn/server/utils/BuilderUtils
Stack Trace:
java.lang.NoClassDefFoundError: org/apache/hadoop/yarn/server/utils/BuilderUtils
at java.net.URLClassLoader$1.run(URLClassLoader.java:366)
at java.net.URLClassLoader$1.run(URLClassLoader.java:355)
at java.security.AccessController.doPrivileged(Native Method)
at java.net.URLClassLoader.findClass(URLClassLoader.java:354)
at java.lang.ClassLoader.loadClass(ClassLoader.java:425)
at sun.misc.Launcher$AppClassLoader.loadClass(Launcher.java:308)
at java.lang.ClassLoader.loadClass(ClassLoader.java:358)
at org.apache.hadoop.yarn.server.resourcemanager.RMServerUtils.<clinit>(RMServerUtils.java:262)
at org.apache.hadoop.yarn.server.resourcemanager.ResourceManager.serviceInit(ResourceManager.java:215)
at org.apache.hadoop.service.AbstractService.init(AbstractService.java:163)
at org.apache.hadoop.yarn.server.resourcemanager.MockRM.<init>(MockRM.java:120)
at org.apache.hadoop.yarn.server.resourcemanager.MockRM.<init>(MockRM.java:113)
at org.apache.hadoop.yarn.server.resourcemanager.MockRM.<init>(MockRM.java:109)
at org.apache.hadoop.yarn.server.resourcemanager.MockRM.<init>(MockRM.java:105)
at org.apache.hadoop.yarn.server.resourcemanager.scheduler.capacity.TestLeafQueue.testConcurrentAccess(TestLeafQueue.java:2417)
REGRESSION: org.apache.hadoop.yarn.server.resourcemanager.scheduler.capacity.TestLeafQueue.testSingleQueueWithOneUser
Error Message:
org/apache/hadoop/yarn/server/utils/BuilderUtils
Stack Trace:
java.lang.NoClassDefFoundError: org/apache/hadoop/yarn/server/utils/BuilderUtils
at org.apache.hadoop.yarn.server.resourcemanager.scheduler.capacity.TestUtils.getMockApplicationAttemptId(TestUtils.java:181)
at org.apache.hadoop.yarn.server.resourcemanager.scheduler.capacity.TestLeafQueue.testSingleQueueWithOneUser(TestLeafQueue.java:475)
REGRESSION: org.apache.hadoop.yarn.server.resourcemanager.scheduler.capacity.TestLeafQueue.testReservation
Error Message:
org/apache/hadoop/yarn/server/utils/BuilderUtils
Stack Trace:
java.lang.NoClassDefFoundError: org/apache/hadoop/yarn/server/utils/BuilderUtils
at org.apache.hadoop.yarn.server.resourcemanager.scheduler.capacity.TestUtils.getMockApplicationAttemptId(TestUtils.java:181)
at org.apache.hadoop.yarn.server.resourcemanager.scheduler.capacity.TestLeafQueue.testReservation(TestLeafQueue.java:1250)
REGRESSION: org.apache.hadoop.yarn.server.resourcemanager.webapp.TestRMWebServicesAppsModification.testSingleAppKillUnauthorized[0]
Error Message:
A message body reader for Java class org.apache.hadoop.yarn.server.resourcemanager.webapp.dao.AppState, and Java type class org.apache.hadoop.yarn.server.resourcemanager.webapp.dao.AppState, and MIME media type text/html; charset=ISO-8859-1 was not found
Stack Trace:
com.sun.jersey.api.client.ClientHandlerException: A message body reader for Java class org.apache.hadoop.yarn.server.resourcemanager.webapp.dao.AppState, and Java type class org.apache.hadoop.yarn.server.resourcemanager.webapp.dao.AppState, and MIME media type text/html; charset=ISO-8859-1 was not found
at com.sun.jersey.api.client.ClientResponse.getEntity(ClientResponse.java:549)
at com.sun.jersey.api.client.ClientResponse.getEntity(ClientResponse.java:506)
at org.apache.hadoop.yarn.server.resourcemanager.webapp.TestRMWebServicesAppsModification.testSingleAppKillUnauthorized(TestRMWebServicesAppsModification.java:551)
REGRESSION: org.apache.hadoop.yarn.server.resourcemanager.webapp.TestRMWebServicesAppsModification.testGetNewApplication[0]
Error Message:
Guice creation errors:
1) An exception was caught and reported. Message: java.util.zip.ZipException: invalid block type
at com.google.inject.internal.InjectorShell$Builder.build(InjectorShell.java:133)
1 error
Stack Trace:
com.google.inject.CreationException: Guice creation errors:
1) An exception was caught and reported. Message: java.util.zip.ZipException: invalid block type
at com.google.inject.internal.InjectorShell$Builder.build(InjectorShell.java:133)
1 error
at java.util.zip.InflaterInputStream.read(InflaterInputStream.java:164)
at java.util.zip.InflaterInputStream.read(InflaterInputStream.java:122)
at java.io.FilterInputStream.read(FilterInputStream.java:83)
at org.apache.xerces.impl.XMLEntityManager$RewindableInputStream.read(Unknown Source)
at org.apache.xerces.impl.XMLEntityManager.setupCurrentEntity(Unknown Source)
at org.apache.xerces.impl.XMLVersionDetector.determineDocVersion(Unknown Source)
at org.apache.xerces.parsers.XML11Configuration.parse(Unknown Source)
at org.apache.xerces.parsers.XML11Configuration.parse(Unknown Source)
at org.apache.xerces.parsers.XMLParser.parse(Unknown Source)
at org.apache.xerces.parsers.DOMParser.parse(Unknown Source)
at org.apache.xerces.jaxp.DocumentBuilderImpl.parse(Unknown Source)
at javax.xml.parsers.DocumentBuilder.parse(DocumentBuilder.java:150)
at org.apache.hadoop.conf.Configuration.parse(Configuration.java:2546)
at org.apache.hadoop.conf.Configuration.parse(Configuration.java:2534)
at org.apache.hadoop.conf.Configuration.loadResource(Configuration.java:2605)
at org.apache.hadoop.conf.Configuration.loadResources(Configuration.java:2558)
at org.apache.hadoop.conf.Configuration.getProps(Configuration.java:2469)
at org.apache.hadoop.conf.Configuration.set(Configuration.java:1205)
at org.apache.hadoop.conf.Configuration.set(Configuration.java:1177)
at org.apache.hadoop.yarn.server.resourcemanager.webapp.TestRMWebServicesAppsModification$CapTestServletModule.configureScheduler(TestRMWebServicesAppsModification.java:186)
at org.apache.hadoop.yarn.server.resourcemanager.webapp.TestRMWebServicesAppsModification$TestServletModule.configureServlets(TestRMWebServicesAppsModification.java:168)
at org.apache.hadoop.yarn.server.resourcemanager.webapp.TestRMWebServicesAppsModification$1.configureServlets(TestRMWebServicesAppsModification.java:222)
at com.google.inject.servlet.ServletModule.configure(ServletModule.java:53)
at com.google.inject.AbstractModule.configure(AbstractModule.java:59)
at com.google.inject.spi.Elements$RecordingBinder.install(Elements.java:223)
at com.google.inject.spi.Elements.getElements(Elements.java:101)
at com.google.inject.internal.InjectorShell$Builder.build(InjectorShell.java:133)
at com.google.inject.internal.InternalInjectorCreator.build(InternalInjectorCreator.java:103)
at com.google.inject.Guice.createInjector(Guice.java:95)
at com.google.inject.Guice.createInjector(Guice.java:72)
at com.google.inject.Guice.createInjector(Guice.java:62)
at org.apache.hadoop.yarn.server.resourcemanager.webapp.TestRMWebServicesAppsModification.getNoAuthInjectorCap(TestRMWebServicesAppsModification.java:218)
at org.apache.hadoop.yarn.server.resourcemanager.webapp.TestRMWebServicesAppsModification.<init>(TestRMWebServicesAppsModification.java:287)
REGRESSION: org.apache.hadoop.yarn.server.resourcemanager.webapp.TestRMWebServicesAppsModification.testSingleAppKillInvalidId[0]
Error Message:
java.net.BindException: Address already in use
Stack Trace:
com.sun.jersey.test.framework.spi.container.TestContainerException: java.net.BindException: Address already in use
at sun.nio.ch.Net.bind0(Native Method)
at sun.nio.ch.Net.bind(Net.java:444)
at sun.nio.ch.Net.bind(Net.java:436)
at sun.nio.ch.ServerSocketChannelImpl.bind(ServerSocketChannelImpl.java:214)
at sun.nio.ch.ServerSocketAdaptor.bind(ServerSocketAdaptor.java:74)
at org.glassfish.grizzly.nio.transport.TCPNIOTransport.bind(TCPNIOTransport.java:413)
at org.glassfish.grizzly.nio.transport.TCPNIOTransport.bind(TCPNIOTransport.java:384)
at org.glassfish.grizzly.nio.transport.TCPNIOTransport.bind(TCPNIOTransport.java:375)
at org.glassfish.grizzly.http.server.NetworkListener.start(NetworkListener.java:549)
at org.glassfish.grizzly.http.server.HttpServer.start(HttpServer.java:255)
at com.sun.jersey.api.container.grizzly2.GrizzlyServerFactory.createHttpServer(GrizzlyServerFactory.java:326)
at com.sun.jersey.api.container.grizzly2.GrizzlyServerFactory.createHttpServer(GrizzlyServerFactory.java:343)
at com.sun.jersey.test.framework.spi.container.grizzly2.web.GrizzlyWebTestContainerFactory$GrizzlyWebTestContainer.instantiateGrizzlyWebServer(GrizzlyWebTestContainerFactory.java:219)
at com.sun.jersey.test.framework.spi.container.grizzly2.web.GrizzlyWebTestContainerFactory$GrizzlyWebTestContainer.<init>(GrizzlyWebTestContainerFactory.java:129)
at com.sun.jersey.test.framework.spi.container.grizzly2.web.GrizzlyWebTestContainerFactory$GrizzlyWebTestContainer.<init>(GrizzlyWebTestContainerFactory.java:86)
at com.sun.jersey.test.framework.spi.container.grizzly2.web.GrizzlyWebTestContainerFactory.create(GrizzlyWebTestContainerFactory.java:79)
at com.sun.jersey.test.framework.JerseyTest.getContainer(JerseyTest.java:342)
at com.sun.jersey.test.framework.JerseyTest.<init>(JerseyTest.java:217)
at org.apache.hadoop.yarn.webapp.JerseyTestBase.<init>(JerseyTestBase.java:27)
at org.apache.hadoop.yarn.server.resourcemanager.webapp.TestRMWebServicesAppsModification.<init>(TestRMWebServicesAppsModification.java:277)
REGRESSION: org.apache.hadoop.yarn.server.resourcemanager.webapp.TestRMWebServicesAppsModification.testSingleAppState[0]
Error Message:
java.net.BindException: Address already in use
Stack Trace:
com.sun.jersey.test.framework.spi.container.TestContainerException: java.net.BindException: Address already in use
at sun.nio.ch.Net.bind0(Native Method)
at sun.nio.ch.Net.bind(Net.java:444)
at sun.nio.ch.Net.bind(Net.java:436)
at sun.nio.ch.ServerSocketChannelImpl.bind(ServerSocketChannelImpl.java:214)
at sun.nio.ch.ServerSocketAdaptor.bind(ServerSocketAdaptor.java:74)
at org.glassfish.grizzly.nio.transport.TCPNIOTransport.bind(TCPNIOTransport.java:413)
at org.glassfish.grizzly.nio.transport.TCPNIOTransport.bind(TCPNIOTransport.java:384)
at org.glassfish.grizzly.nio.transport.TCPNIOTransport.bind(TCPNIOTransport.java:375)
at org.glassfish.grizzly.http.server.NetworkListener.start(NetworkListener.java:549)
at org.glassfish.grizzly.http.server.HttpServer.start(HttpServer.java:255)
at com.sun.jersey.api.container.grizzly2.GrizzlyServerFactory.createHttpServer(GrizzlyServerFactory.java:326)
at com.sun.jersey.api.container.grizzly2.GrizzlyServerFactory.createHttpServer(GrizzlyServerFactory.java:343)
at com.sun.jersey.test.framework.spi.container.grizzly2.web.GrizzlyWebTestContainerFactory$GrizzlyWebTestContainer.instantiateGrizzlyWebServer(GrizzlyWebTestContainerFactory.java:219)
at com.sun.jersey.test.framework.spi.container.grizzly2.web.GrizzlyWebTestContainerFactory$GrizzlyWebTestContainer.<init>(GrizzlyWebTestContainerFactory.java:129)
at com.sun.jersey.test.framework.spi.container.grizzly2.web.GrizzlyWebTestContainerFactory$GrizzlyWebTestContainer.<init>(GrizzlyWebTestContainerFactory.java:86)
at com.sun.jersey.test.framework.spi.container.grizzly2.web.GrizzlyWebTestContainerFactory.create(GrizzlyWebTestContainerFactory.java:79)
at com.sun.jersey.test.framework.JerseyTest.getContainer(JerseyTest.java:342)
at com.sun.jersey.test.framework.JerseyTest.<init>(JerseyTest.java:217)
at org.apache.hadoop.yarn.webapp.JerseyTestBase.<init>(JerseyTestBase.java:27)
at org.apache.hadoop.yarn.server.resourcemanager.webapp.TestRMWebServicesAppsModification.<init>(TestRMWebServicesAppsModification.java:277)
REGRESSION: org.apache.hadoop.yarn.server.resourcemanager.webapp.TestRMWebServicesAppsModification.testGetNewApplicationAndSubmit[0]
Error Message:
java.net.BindException: Address already in use
Stack Trace:
com.sun.jersey.test.framework.spi.container.TestContainerException: java.net.BindException: Address already in use
at sun.nio.ch.Net.bind0(Native Method)
at sun.nio.ch.Net.bind(Net.java:444)
at sun.nio.ch.Net.bind(Net.java:436)
at sun.nio.ch.ServerSocketChannelImpl.bind(ServerSocketChannelImpl.java:214)
at sun.nio.ch.ServerSocketAdaptor.bind(ServerSocketAdaptor.java:74)
at org.glassfish.grizzly.nio.transport.TCPNIOTransport.bind(TCPNIOTransport.java:413)
at org.glassfish.grizzly.nio.transport.TCPNIOTransport.bind(TCPNIOTransport.java:384)
at org.glassfish.grizzly.nio.transport.TCPNIOTransport.bind(TCPNIOTransport.java:375)
at org.glassfish.grizzly.http.server.NetworkListener.start(NetworkListener.java:549)
at org.glassfish.grizzly.http.server.HttpServer.start(HttpServer.java:255)
at com.sun.jersey.api.container.grizzly2.GrizzlyServerFactory.createHttpServer(GrizzlyServerFactory.java:326)
at com.sun.jersey.api.container.grizzly2.GrizzlyServerFactory.createHttpServer(GrizzlyServerFactory.java:343)
at com.sun.jersey.test.framework.spi.container.grizzly2.web.GrizzlyWebTestContainerFactory$GrizzlyWebTestContainer.instantiateGrizzlyWebServer(GrizzlyWebTestContainerFactory.java:219)
at com.sun.jersey.test.framework.spi.container.grizzly2.web.GrizzlyWebTestContainerFactory$GrizzlyWebTestContainer.<init>(GrizzlyWebTestContainerFactory.java:129)
at com.sun.jersey.test.framework.spi.container.grizzly2.web.GrizzlyWebTestContainerFactory$GrizzlyWebTestContainer.<init>(GrizzlyWebTestContainerFactory.java:86)
at com.sun.jersey.test.framework.spi.container.grizzly2.web.GrizzlyWebTestContainerFactory.create(GrizzlyWebTestContainerFactory.java:79)
at com.sun.jersey.test.framework.JerseyTest.getContainer(JerseyTest.java:342)
at com.sun.jersey.test.framework.JerseyTest.<init>(JerseyTest.java:217)
at org.apache.hadoop.yarn.webapp.JerseyTestBase.<init>(JerseyTestBase.java:27)
at org.apache.hadoop.yarn.server.resourcemanager.webapp.TestRMWebServicesAppsModification.<init>(TestRMWebServicesAppsModification.java:277)
REGRESSION: org.apache.hadoop.yarn.server.resourcemanager.webapp.TestRMWebServicesAppsModification.testUpdateAppPriority[0]
Error Message:
java.net.BindException: Address already in use
Stack Trace:
com.sun.jersey.test.framework.spi.container.TestContainerException: java.net.BindException: Address already in use
at sun.nio.ch.Net.bind0(Native Method)
at sun.nio.ch.Net.bind(Net.java:444)
at sun.nio.ch.Net.bind(Net.java:436)
at sun.nio.ch.ServerSocketChannelImpl.bind(ServerSocketChannelImpl.java:214)
at sun.nio.ch.ServerSocketAdaptor.bind(ServerSocketAdaptor.java:74)
at org.glassfish.grizzly.nio.transport.TCPNIOTransport.bind(TCPNIOTransport.java:413)
at org.glassfish.grizzly.nio.transport.TCPNIOTransport.bind(TCPNIOTransport.java:384)
at org.glassfish.grizzly.nio.transport.TCPNIOTransport.bind(TCPNIOTransport.java:375)
at org.glassfish.grizzly.http.server.NetworkListener.start(NetworkListener.java:549)
at org.glassfish.grizzly.http.server.HttpServer.start(HttpServer.java:255)
at com.sun.jersey.api.container.grizzly2.GrizzlyServerFactory.createHttpServer(GrizzlyServerFactory.java:326)
at com.sun.jersey.api.container.grizzly2.GrizzlyServerFactory.createHttpServer(GrizzlyServerFactory.java:343)
at com.sun.jersey.test.framework.spi.container.grizzly2.web.GrizzlyWebTestContainerFactory$GrizzlyWebTestContainer.instantiateGrizzlyWebServer(GrizzlyWebTestContainerFactory.java:219)
at com.sun.jersey.test.framework.spi.container.grizzly2.web.GrizzlyWebTestContainerFactory$GrizzlyWebTestContainer.<init>(GrizzlyWebTestContainerFactory.java:129)
at com.sun.jersey.test.framework.spi.container.grizzly2.web.GrizzlyWebTestContainerFactory$GrizzlyWebTestContainer.<init>(GrizzlyWebTestContainerFactory.java:86)
at com.sun.jersey.test.framework.spi.container.grizzly2.web.GrizzlyWebTestContainerFactory.create(GrizzlyWebTestContainerFactory.java:79)
at com.sun.jersey.test.framework.JerseyTest.getContainer(JerseyTest.java:342)
at com.sun.jersey.test.framework.JerseyTest.<init>(JerseyTest.java:217)
at org.apache.hadoop.yarn.webapp.JerseyTestBase.<init>(JerseyTestBase.java:27)
at org.apache.hadoop.yarn.server.resourcemanager.webapp.TestRMWebServicesAppsModification.<init>(TestRMWebServicesAppsModification.java:277)
REGRESSION: org.apache.hadoop.yarn.server.resourcemanager.webapp.TestRMWebServicesAppsModification.testAppSubmitBadJsonAndXML[0]
Error Message:
java.net.BindException: Address already in use
Stack Trace:
com.sun.jersey.test.framework.spi.container.TestContainerException: java.net.BindException: Address already in use
at sun.nio.ch.Net.bind0(Native Method)
at sun.nio.ch.Net.bind(Net.java:444)
at sun.nio.ch.Net.bind(Net.java:436)
at sun.nio.ch.ServerSocketChannelImpl.bind(ServerSocketChannelImpl.java:214)
at sun.nio.ch.ServerSocketAdaptor.bind(ServerSocketAdaptor.java:74)
at org.glassfish.grizzly.nio.transport.TCPNIOTransport.bind(TCPNIOTransport.java:413)
at org.glassfish.grizzly.nio.transport.TCPNIOTransport.bind(TCPNIOTransport.java:384)
at org.glassfish.grizzly.nio.transport.TCPNIOTransport.bind(TCPNIOTransport.java:375)
at org.glassfish.grizzly.http.server.NetworkListener.start(NetworkListener.java:549)
at org.glassfish.grizzly.http.server.HttpServer.start(HttpServer.java:255)
at com.sun.jersey.api.container.grizzly2.GrizzlyServerFactory.createHttpServer(GrizzlyServerFactory.java:326)
at com.sun.jersey.api.container.grizzly2.GrizzlyServerFactory.createHttpServer(GrizzlyServerFactory.java:343)
at com.sun.jersey.test.framework.spi.container.grizzly2.web.GrizzlyWebTestContainerFactory$GrizzlyWebTestContainer.instantiateGrizzlyWebServer(GrizzlyWebTestContainerFactory.java:219)
at com.sun.jersey.test.framework.spi.container.grizzly2.web.GrizzlyWebTestContainerFactory$GrizzlyWebTestContainer.<init>(GrizzlyWebTestContainerFactory.java:129)
at com.sun.jersey.test.framework.spi.container.grizzly2.web.GrizzlyWebTestContainerFactory$GrizzlyWebTestContainer.<init>(GrizzlyWebTestContainerFactory.java:86)
at com.sun.jersey.test.framework.spi.container.grizzly2.web.GrizzlyWebTestContainerFactory.create(GrizzlyWebTestContainerFactory.java:79)
at com.sun.jersey.test.framework.JerseyTest.getContainer(JerseyTest.java:342)
at com.sun.jersey.test.framework.JerseyTest.<init>(JerseyTest.java:217)
at org.apache.hadoop.yarn.webapp.JerseyTestBase.<init>(JerseyTestBase.java:27)
at org.apache.hadoop.yarn.server.resourcemanager.webapp.TestRMWebServicesAppsModification.<init>(TestRMWebServicesAppsModification.java:277)
REGRESSION: org.apache.hadoop.yarn.server.resourcemanager.webapp.TestRMWebServicesAppsModification.testGetAppQueue[1]
Error Message:
java.net.BindException: Address already in use
Stack Trace:
com.sun.jersey.test.framework.spi.container.TestContainerException: java.net.BindException: Address already in use
at sun.nio.ch.Net.bind0(Native Method)
at sun.nio.ch.Net.bind(Net.java:444)
at sun.nio.ch.Net.bind(Net.java:436)
at sun.nio.ch.ServerSocketChannelImpl.bind(ServerSocketChannelImpl.java:214)
at sun.nio.ch.ServerSocketAdaptor.bind(ServerSocketAdaptor.java:74)
at org.glassfish.grizzly.nio.transport.TCPNIOTransport.bind(TCPNIOTransport.java:413)
at org.glassfish.grizzly.nio.transport.TCPNIOTransport.bind(TCPNIOTransport.java:384)
at org.glassfish.grizzly.nio.transport.TCPNIOTransport.bind(TCPNIOTransport.java:375)
at org.glassfish.grizzly.http.server.NetworkListener.start(NetworkListener.java:549)
at org.glassfish.grizzly.http.server.HttpServer.start(HttpServer.java:255)
at com.sun.jersey.api.container.grizzly2.GrizzlyServerFactory.createHttpServer(GrizzlyServerFactory.java:326)
at com.sun.jersey.api.container.grizzly2.GrizzlyServerFactory.createHttpServer(GrizzlyServerFactory.java:343)
at com.sun.jersey.test.framework.spi.container.grizzly2.web.GrizzlyWebTestContainerFactory$GrizzlyWebTestContainer.instantiateGrizzlyWebServer(GrizzlyWebTestContainerFactory.java:219)
at com.sun.jersey.test.framework.spi.container.grizzly2.web.GrizzlyWebTestContainerFactory$GrizzlyWebTestContainer.<init>(GrizzlyWebTestContainerFactory.java:129)
at com.sun.jersey.test.framework.spi.container.grizzly2.web.GrizzlyWebTestContainerFactory$GrizzlyWebTestContainer.<init>(GrizzlyWebTestContainerFactory.java:86)
at com.sun.jersey.test.framework.spi.container.grizzly2.web.GrizzlyWebTestContainerFactory.create(GrizzlyWebTestContainerFactory.java:79)
at com.sun.jersey.test.framework.JerseyTest.getContainer(JerseyTest.java:342)
at com.sun.jersey.test.framework.JerseyTest.<init>(JerseyTest.java:217)
at org.apache.hadoop.yarn.webapp.JerseyTestBase.<init>(JerseyTestBase.java:27)
at org.apache.hadoop.yarn.server.resourcemanager.webapp.TestRMWebServicesAppsModification.<init>(TestRMWebServicesAppsModification.java:277)
REGRESSION: org.apache.hadoop.yarn.server.resourcemanager.webapp.TestRMWebServicesAppsModification.testAppMove[1]
Error Message:
java.net.BindException: Address already in use
Stack Trace:
com.sun.jersey.test.framework.spi.container.TestContainerException: java.net.BindException: Address already in use
at sun.nio.ch.Net.bind0(Native Method)
at sun.nio.ch.Net.bind(Net.java:444)
at sun.nio.ch.Net.bind(Net.java:436)
at sun.nio.ch.ServerSocketChannelImpl.bind(ServerSocketChannelImpl.java:214)
at sun.nio.ch.ServerSocketAdaptor.bind(ServerSocketAdaptor.java:74)
at org.glassfish.grizzly.nio.transport.TCPNIOTransport.bind(TCPNIOTransport.java:413)
at org.glassfish.grizzly.nio.transport.TCPNIOTransport.bind(TCPNIOTransport.java:384)
at org.glassfish.grizzly.nio.transport.TCPNIOTransport.bind(TCPNIOTransport.java:375)
at org.glassfish.grizzly.http.server.NetworkListener.start(NetworkListener.java:549)
at org.glassfish.grizzly.http.server.HttpServer.start(HttpServer.java:255)
at com.sun.jersey.api.container.grizzly2.GrizzlyServerFactory.createHttpServer(GrizzlyServerFactory.java:326)
at com.sun.jersey.api.container.grizzly2.GrizzlyServerFactory.createHttpServer(GrizzlyServerFactory.java:343)
at com.sun.jersey.test.framework.spi.container.grizzly2.web.GrizzlyWebTestContainerFactory$GrizzlyWebTestContainer.instantiateGrizzlyWebServer(GrizzlyWebTestContainerFactory.java:219)
at com.sun.jersey.test.framework.spi.container.grizzly2.web.GrizzlyWebTestContainerFactory$GrizzlyWebTestContainer.<init>(GrizzlyWebTestContainerFactory.java:129)
at com.sun.jersey.test.framework.spi.container.grizzly2.web.GrizzlyWebTestContainerFactory$GrizzlyWebTestContainer.<init>(GrizzlyWebTestContainerFactory.java:86)
at com.sun.jersey.test.framework.spi.container.grizzly2.web.GrizzlyWebTestContainerFactory.create(GrizzlyWebTestContainerFactory.java:79)
at com.sun.jersey.test.framework.JerseyTest.getContainer(JerseyTest.java:342)
at com.sun.jersey.test.framework.JerseyTest.<init>(JerseyTest.java:217)
at org.apache.hadoop.yarn.webapp.JerseyTestBase.<init>(JerseyTestBase.java:27)
at org.apache.hadoop.yarn.server.resourcemanager.webapp.TestRMWebServicesAppsModification.<init>(TestRMWebServicesAppsModification.java:277)
REGRESSION: org.apache.hadoop.yarn.server.resourcemanager.webapp.TestRMWebServicesAppsModification.testSingleAppKill[1]
Error Message:
java.net.BindException: Address already in use
Stack Trace:
com.sun.jersey.test.framework.spi.container.TestContainerException: java.net.BindException: Address already in use
at sun.nio.ch.Net.bind0(Native Method)
at sun.nio.ch.Net.bind(Net.java:444)
at sun.nio.ch.Net.bind(Net.java:436)
at sun.nio.ch.ServerSocketChannelImpl.bind(ServerSocketChannelImpl.java:214)
at sun.nio.ch.ServerSocketAdaptor.bind(ServerSocketAdaptor.java:74)
at org.glassfish.grizzly.nio.transport.TCPNIOTransport.bind(TCPNIOTransport.java:413)
at org.glassfish.grizzly.nio.transport.TCPNIOTransport.bind(TCPNIOTransport.java:384)
at org.glassfish.grizzly.nio.transport.TCPNIOTransport.bind(TCPNIOTransport.java:375)
at org.glassfish.grizzly.http.server.NetworkListener.start(NetworkListener.java:549)
at org.glassfish.grizzly.http.server.HttpServer.start(HttpServer.java:255)
at com.sun.jersey.api.container.grizzly2.GrizzlyServerFactory.createHttpServer(GrizzlyServerFactory.java:326)
at com.sun.jersey.api.container.grizzly2.GrizzlyServerFactory.createHttpServer(GrizzlyServerFactory.java:343)
at com.sun.jersey.test.framework.spi.container.grizzly2.web.GrizzlyWebTestContainerFactory$GrizzlyWebTestContainer.instantiateGrizzlyWebServer(GrizzlyWebTestContainerFactory.java:219)
at com.sun.jersey.test.framework.spi.container.grizzly2.web.GrizzlyWebTestContainerFactory$GrizzlyWebTestContainer.<init>(GrizzlyWebTestContainerFactory.java:129)
at com.sun.jersey.test.framework.spi.container.grizzly2.web.GrizzlyWebTestContainerFactory$GrizzlyWebTestContainer.<init>(GrizzlyWebTestContainerFactory.java:86)
at com.sun.jersey.test.framework.spi.container.grizzly2.web.GrizzlyWebTestContainerFactory.create(GrizzlyWebTestContainerFactory.java:79)
at com.sun.jersey.test.framework.JerseyTest.getContainer(JerseyTest.java:342)
at com.sun.jersey.test.framework.JerseyTest.<init>(JerseyTest.java:217)
at org.apache.hadoop.yarn.webapp.JerseyTestBase.<init>(JerseyTestBase.java:27)
at org.apache.hadoop.yarn.server.resourcemanager.webapp.TestRMWebServicesAppsModification.<init>(TestRMWebServicesAppsModification.java:277)
REGRESSION: org.apache.hadoop.yarn.server.resourcemanager.webapp.TestRMWebServicesAppsModification.testSingleAppKillInvalidState[1]
Error Message:
java.net.BindException: Address already in use
Stack Trace:
com.sun.jersey.test.framework.spi.container.TestContainerException: java.net.BindException: Address already in use
at sun.nio.ch.Net.bind0(Native Method)
at sun.nio.ch.Net.bind(Net.java:444)
at sun.nio.ch.Net.bind(Net.java:436)
at sun.nio.ch.ServerSocketChannelImpl.bind(ServerSocketChannelImpl.java:214)
at sun.nio.ch.ServerSocketAdaptor.bind(ServerSocketAdaptor.java:74)
at org.glassfish.grizzly.nio.transport.TCPNIOTransport.bind(TCPNIOTransport.java:413)
at org.glassfish.grizzly.nio.transport.TCPNIOTransport.bind(TCPNIOTransport.java:384)
at org.glassfish.grizzly.nio.transport.TCPNIOTransport.bind(TCPNIOTransport.java:375)
at org.glassfish.grizzly.http.server.NetworkListener.start(NetworkListener.java:549)
at org.glassfish.grizzly.http.server.HttpServer.start(HttpServer.java:255)
at com.sun.jersey.api.container.grizzly2.GrizzlyServerFactory.createHttpServer(GrizzlyServerFactory.java:326)
at com.sun.jersey.api.container.grizzly2.GrizzlyServerFactory.createHttpServer(GrizzlyServerFactory.java:343)
at com.sun.jersey.test.framework.spi.container.grizzly2.web.GrizzlyWebTestContainerFactory$GrizzlyWebTestContainer.instantiateGrizzlyWebServer(GrizzlyWebTestContainerFactory.java:219)
at com.sun.jersey.test.framework.spi.container.grizzly2.web.GrizzlyWebTestContainerFactory$GrizzlyWebTestContainer.<init>(GrizzlyWebTestContainerFactory.java:129)
at com.sun.jersey.test.framework.spi.container.grizzly2.web.GrizzlyWebTestContainerFactory$GrizzlyWebTestContainer.<init>(GrizzlyWebTestContainerFactory.java:86)
at com.sun.jersey.test.framework.spi.container.grizzly2.web.GrizzlyWebTestContainerFactory.create(GrizzlyWebTestContainerFactory.java:79)
at com.sun.jersey.test.framework.JerseyTest.getContainer(JerseyTest.java:342)
at com.sun.jersey.test.framework.JerseyTest.<init>(JerseyTest.java:217)
at org.apache.hadoop.yarn.webapp.JerseyTestBase.<init>(JerseyTestBase.java:27)
at org.apache.hadoop.yarn.server.resourcemanager.webapp.TestRMWebServicesAppsModification.<init>(TestRMWebServicesAppsModification.java:277)
REGRESSION: org.apache.hadoop.yarn.server.resourcemanager.webapp.TestRMWebServicesAppsModification.testSingleAppKillUnauthorized[1]
Error Message:
java.net.BindException: Address already in use
Stack Trace:
com.sun.jersey.test.framework.spi.container.TestContainerException: java.net.BindException: Address already in use
at sun.nio.ch.Net.bind0(Native Method)
at sun.nio.ch.Net.bind(Net.java:444)
at sun.nio.ch.Net.bind(Net.java:436)
at sun.nio.ch.ServerSocketChannelImpl.bind(ServerSocketChannelImpl.java:214)
at sun.nio.ch.ServerSocketAdaptor.bind(ServerSocketAdaptor.java:74)
at org.glassfish.grizzly.nio.transport.TCPNIOTransport.bind(TCPNIOTransport.java:413)
at org.glassfish.grizzly.nio.transport.TCPNIOTransport.bind(TCPNIOTransport.java:384)
at org.glassfish.grizzly.nio.transport.TCPNIOTransport.bind(TCPNIOTransport.java:375)
at org.glassfish.grizzly.http.server.NetworkListener.start(NetworkListener.java:549)
at org.glassfish.grizzly.http.server.HttpServer.start(HttpServer.java:255)
at com.sun.jersey.api.container.grizzly2.GrizzlyServerFactory.createHttpServer(GrizzlyServerFactory.java:326)
at com.sun.jersey.api.container.grizzly2.GrizzlyServerFactory.createHttpServer(GrizzlyServerFactory.java:343)
at com.sun.jersey.test.framework.spi.container.grizzly2.web.GrizzlyWebTestContainerFactory$GrizzlyWebTestContainer.instantiateGrizzlyWebServer(GrizzlyWebTestContainerFactory.java:219)
at com.sun.jersey.test.framework.spi.container.grizzly2.web.GrizzlyWebTestContainerFactory$GrizzlyWebTestContainer.<init>(GrizzlyWebTestContainerFactory.java:129)
at com.sun.jersey.test.framework.spi.container.grizzly2.web.GrizzlyWebTestContainerFactory$GrizzlyWebTestContainer.<init>(GrizzlyWebTestContainerFactory.java:86)
at com.sun.jersey.test.framework.spi.container.grizzly2.web.GrizzlyWebTestContainerFactory.create(GrizzlyWebTestContainerFactory.java:79)
at com.sun.jersey.test.framework.JerseyTest.getContainer(JerseyTest.java:342)
at com.sun.jersey.test.framework.JerseyTest.<init>(JerseyTest.java:217)
at org.apache.hadoop.yarn.webapp.JerseyTestBase.<init>(JerseyTestBase.java:27)
at org.apache.hadoop.yarn.server.resourcemanager.webapp.TestRMWebServicesAppsModification.<init>(TestRMWebServicesAppsModification.java:277)
REGRESSION: org.apache.hadoop.yarn.server.resourcemanager.webapp.TestRMWebServicesAppsModification.testGetNewApplication[1]
Error Message:
java.net.BindException: Address already in use
Stack Trace:
com.sun.jersey.test.framework.spi.container.TestContainerException: java.net.BindException: Address already in use
at sun.nio.ch.Net.bind0(Native Method)
at sun.nio.ch.Net.bind(Net.java:444)
at sun.nio.ch.Net.bind(Net.java:436)
at sun.nio.ch.ServerSocketChannelImpl.bind(ServerSocketChannelImpl.java:214)
at sun.nio.ch.ServerSocketAdaptor.bind(ServerSocketAdaptor.java:74)
at org.glassfish.grizzly.nio.transport.TCPNIOTransport.bind(TCPNIOTransport.java:413)
at org.glassfish.grizzly.nio.transport.TCPNIOTransport.bind(TCPNIOTransport.java:384)
at org.glassfish.grizzly.nio.transport.TCPNIOTransport.bind(TCPNIOTransport.java:375)
at org.glassfish.grizzly.http.server.NetworkListener.start(NetworkListener.java:549)
at org.glassfish.grizzly.http.server.HttpServer.start(HttpServer.java:255)
at com.sun.jersey.api.container.grizzly2.GrizzlyServerFactory.createHttpServer(GrizzlyServerFactory.java:326)
at com.sun.jersey.api.container.grizzly2.GrizzlyServerFactory.createHttpServer(GrizzlyServerFactory.java:343)
at com.sun.jersey.test.framework.spi.container.grizzly2.web.GrizzlyWebTestContainerFactory$GrizzlyWebTestContainer.instantiateGrizzlyWebServer(GrizzlyWebTestContainerFactory.java:219)
at com.sun.jersey.test.framework.spi.container.grizzly2.web.GrizzlyWebTestContainerFactory$GrizzlyWebTestContainer.<init>(GrizzlyWebTestContainerFactory.java:129)
at com.sun.jersey.test.framework.spi.container.grizzly2.web.GrizzlyWebTestContainerFactory$GrizzlyWebTestContainer.<init>(GrizzlyWebTestContainerFactory.java:86)
at com.sun.jersey.test.framework.spi.container.grizzly2.web.GrizzlyWebTestContainerFactory.create(GrizzlyWebTestContainerFactory.java:79)
at com.sun.jersey.test.framework.JerseyTest.getContainer(JerseyTest.java:342)
at com.sun.jersey.test.framework.JerseyTest.<init>(JerseyTest.java:217)
at org.apache.hadoop.yarn.webapp.JerseyTestBase.<init>(JerseyTestBase.java:27)
at org.apache.hadoop.yarn.server.resourcemanager.webapp.TestRMWebServicesAppsModification.<init>(TestRMWebServicesAppsModification.java:277)
REGRESSION: org.apache.hadoop.yarn.server.resourcemanager.webapp.TestRMWebServicesAppsModification.testSingleAppKillInvalidId[1]
Error Message:
java.net.BindException: Address already in use
Stack Trace:
com.sun.jersey.test.framework.spi.container.TestContainerException: java.net.BindException: Address already in use
at sun.nio.ch.Net.bind0(Native Method)
at sun.nio.ch.Net.bind(Net.java:444)
at sun.nio.ch.Net.bind(Net.java:436)
at sun.nio.ch.ServerSocketChannelImpl.bind(ServerSocketChannelImpl.java:214)
at sun.nio.ch.ServerSocketAdaptor.bind(ServerSocketAdaptor.java:74)
at org.glassfish.grizzly.nio.transport.TCPNIOTransport.bind(TCPNIOTransport.java:413)
at org.glassfish.grizzly.nio.transport.TCPNIOTransport.bind(TCPNIOTransport.java:384)
at org.glassfish.grizzly.nio.transport.TCPNIOTransport.bind(TCPNIOTransport.java:375)
at org.glassfish.grizzly.http.server.NetworkListener.start(NetworkListener.java:549)
at org.glassfish.grizzly.http.server.HttpServer.start(HttpServer.java:255)
at com.sun.jersey.api.container.grizzly2.GrizzlyServerFactory.createHttpServer(GrizzlyServerFactory.java:326)
at com.sun.jersey.api.container.grizzly2.GrizzlyServerFactory.createHttpServer(GrizzlyServerFactory.java:343)
at com.sun.jersey.test.framework.spi.container.grizzly2.web.GrizzlyWebTestContainerFactory$GrizzlyWebTestContainer.instantiateGrizzlyWebServer(GrizzlyWebTestContainerFactory.java:219)
at com.sun.jersey.test.framework.spi.container.grizzly2.web.GrizzlyWebTestContainerFactory$GrizzlyWebTestContainer.<init>(GrizzlyWebTestContainerFactory.java:129)
at com.sun.jersey.test.framework.spi.container.grizzly2.web.GrizzlyWebTestContainerFactory$GrizzlyWebTestContainer.<init>(GrizzlyWebTestContainerFactory.java:86)
at com.sun.jersey.test.framework.spi.container.grizzly2.web.GrizzlyWebTestContainerFactory.create(GrizzlyWebTestContainerFactory.java:79)
at com.sun.jersey.test.framework.JerseyTest.getContainer(JerseyTest.java:342)
at com.sun.jersey.test.framework.JerseyTest.<init>(JerseyTest.java:217)
at org.apache.hadoop.yarn.webapp.JerseyTestBase.<init>(JerseyTestBase.java:27)
at org.apache.hadoop.yarn.server.resourcemanager.webapp.TestRMWebServicesAppsModification.<init>(TestRMWebServicesAppsModification.java:277)
REGRESSION: org.apache.hadoop.yarn.server.resourcemanager.webapp.TestRMWebServicesAppsModification.testSingleAppState[1]
Error Message:
java.net.BindException: Address already in use
Stack Trace:
com.sun.jersey.test.framework.spi.container.TestContainerException: java.net.BindException: Address already in use
at sun.nio.ch.Net.bind0(Native Method)
at sun.nio.ch.Net.bind(Net.java:444)
at sun.nio.ch.Net.bind(Net.java:436)
at sun.nio.ch.ServerSocketChannelImpl.bind(ServerSocketChannelImpl.java:214)
at sun.nio.ch.ServerSocketAdaptor.bind(ServerSocketAdaptor.java:74)
at org.glassfish.grizzly.nio.transport.TCPNIOTransport.bind(TCPNIOTransport.java:413)
at org.glassfish.grizzly.nio.transport.TCPNIOTransport.bind(TCPNIOTransport.java:384)
at org.glassfish.grizzly.nio.transport.TCPNIOTransport.bind(TCPNIOTransport.java:375)
at org.glassfish.grizzly.http.server.NetworkListener.start(NetworkListener.java:549)
at org.glassfish.grizzly.http.server.HttpServer.start(HttpServer.java:255)
at com.sun.jersey.api.container.grizzly2.GrizzlyServerFactory.createHttpServer(GrizzlyServerFactory.java:326)
at com.sun.jersey.api.container.grizzly2.GrizzlyServerFactory.createHttpServer(GrizzlyServerFactory.java:343)
at com.sun.jersey.test.framework.spi.container.grizzly2.web.GrizzlyWebTestContainerFactory$GrizzlyWebTestContainer.instantiateGrizzlyWebServer(GrizzlyWebTestContainerFactory.java:219)
at com.sun.jersey.test.framework.spi.container.grizzly2.web.GrizzlyWebTestContainerFactory$GrizzlyWebTestContainer.<init>(GrizzlyWebTestContainerFactory.java:129)
at com.sun.jersey.test.framework.spi.container.grizzly2.web.GrizzlyWebTestContainerFactory$GrizzlyWebTestContainer.<init>(GrizzlyWebTestContainerFactory.java:86)
at com.sun.jersey.test.framework.spi.container.grizzly2.web.GrizzlyWebTestContainerFactory.create(GrizzlyWebTestContainerFactory.java:79)
at com.sun.jersey.test.framework.JerseyTest.getContainer(JerseyTest.java:342)
at com.sun.jersey.test.framework.JerseyTest.<init>(JerseyTest.java:217)
at org.apache.hadoop.yarn.webapp.JerseyTestBase.<init>(JerseyTestBase.java:27)
at org.apache.hadoop.yarn.server.resourcemanager.webapp.TestRMWebServicesAppsModification.<init>(TestRMWebServicesAppsModification.java:277)
REGRESSION: org.apache.hadoop.yarn.server.resourcemanager.webapp.TestRMWebServicesAppsModification.testGetNewApplicationAndSubmit[1]
Error Message:
java.net.BindException: Address already in use
Stack Trace:
com.sun.jersey.test.framework.spi.container.TestContainerException: java.net.BindException: Address already in use
at sun.nio.ch.Net.bind0(Native Method)
at sun.nio.ch.Net.bind(Net.java:444)
at sun.nio.ch.Net.bind(Net.java:436)
at sun.nio.ch.ServerSocketChannelImpl.bind(ServerSocketChannelImpl.java:214)
at sun.nio.ch.ServerSocketAdaptor.bind(ServerSocketAdaptor.java:74)
at org.glassfish.grizzly.nio.transport.TCPNIOTransport.bind(TCPNIOTransport.java:413)
at org.glassfish.grizzly.nio.transport.TCPNIOTransport.bind(TCPNIOTransport.java:384)
at org.glassfish.grizzly.nio.transport.TCPNIOTransport.bind(TCPNIOTransport.java:375)
at org.glassfish.grizzly.http.server.NetworkListener.start(NetworkListener.java:549)
at org.glassfish.grizzly.http.server.HttpServer.start(HttpServer.java:255)
at com.sun.jersey.api.container.grizzly2.GrizzlyServerFactory.createHttpServer(GrizzlyServerFactory.java:326)
at com.sun.jersey.api.container.grizzly2.GrizzlyServerFactory.createHttpServer(GrizzlyServerFactory.java:343)
at com.sun.jersey.test.framework.spi.container.grizzly2.web.GrizzlyWebTestContainerFactory$GrizzlyWebTestContainer.instantiateGrizzlyWebServer(GrizzlyWebTestContainerFactory.java:219)
at com.sun.jersey.test.framework.spi.container.grizzly2.web.GrizzlyWebTestContainerFactory$GrizzlyWebTestContainer.<init>(GrizzlyWebTestContainerFactory.java:129)
at com.sun.jersey.test.framework.spi.container.grizzly2.web.GrizzlyWebTestContainerFactory$GrizzlyWebTestContainer.<init>(GrizzlyWebTestContainerFactory.java:86)
at com.sun.jersey.test.framework.spi.container.grizzly2.web.GrizzlyWebTestContainerFactory.create(GrizzlyWebTestContainerFactory.java:79)
at com.sun.jersey.test.framework.JerseyTest.getContainer(JerseyTest.java:342)
at com.sun.jersey.test.framework.JerseyTest.<init>(JerseyTest.java:217)
at org.apache.hadoop.yarn.webapp.JerseyTestBase.<init>(JerseyTestBase.java:27)
at org.apache.hadoop.yarn.server.resourcemanager.webapp.TestRMWebServicesAppsModification.<init>(TestRMWebServicesAppsModification.java:277)
REGRESSION: org.apache.hadoop.yarn.server.resourcemanager.webapp.TestRMWebServicesAppsModification.testUpdateAppPriority[1]
Error Message:
java.net.BindException: Address already in use
Stack Trace:
com.sun.jersey.test.framework.spi.container.TestContainerException: java.net.BindException: Address already in use
at sun.nio.ch.Net.bind0(Native Method)
at sun.nio.ch.Net.bind(Net.java:444)
at sun.nio.ch.Net.bind(Net.java:436)
at sun.nio.ch.ServerSocketChannelImpl.bind(ServerSocketChannelImpl.java:214)
at sun.nio.ch.ServerSocketAdaptor.bind(ServerSocketAdaptor.java:74)
at org.glassfish.grizzly.nio.transport.TCPNIOTransport.bind(TCPNIOTransport.java:413)
at org.glassfish.grizzly.nio.transport.TCPNIOTransport.bind(TCPNIOTransport.java:384)
at org.glassfish.grizzly.nio.transport.TCPNIOTransport.bind(TCPNIOTransport.java:375)
at org.glassfish.grizzly.http.server.NetworkListener.start(NetworkListener.java:549)
at org.glassfish.grizzly.http.server.HttpServer.start(HttpServer.java:255)
at com.sun.jersey.api.container.grizzly2.GrizzlyServerFactory.createHttpServer(GrizzlyServerFactory.java:326)
at com.sun.jersey.api.container.grizzly2.GrizzlyServerFactory.createHttpServer(GrizzlyServerFactory.java:343)
at com.sun.jersey.test.framework.spi.container.grizzly2.web.GrizzlyWebTestContainerFactory$GrizzlyWebTestContainer.instantiateGrizzlyWebServer(GrizzlyWebTestContainerFactory.java:219)
at com.sun.jersey.test.framework.spi.container.grizzly2.web.GrizzlyWebTestContainerFactory$GrizzlyWebTestContainer.<init>(GrizzlyWebTestContainerFactory.java:129)
at com.sun.jersey.test.framework.spi.container.grizzly2.web.GrizzlyWebTestContainerFactory$GrizzlyWebTestContainer.<init>(GrizzlyWebTestContainerFactory.java:86)
at com.sun.jersey.test.framework.spi.container.grizzly2.web.GrizzlyWebTestContainerFactory.create(GrizzlyWebTestContainerFactory.java:79)
at com.sun.jersey.test.framework.JerseyTest.getContainer(JerseyTest.java:342)
at com.sun.jersey.test.framework.JerseyTest.<init>(JerseyTest.java:217)
at org.apache.hadoop.yarn.webapp.JerseyTestBase.<init>(JerseyTestBase.java:27)
at org.apache.hadoop.yarn.server.resourcemanager.webapp.TestRMWebServicesAppsModification.<init>(TestRMWebServicesAppsModification.java:277)
REGRESSION: org.apache.hadoop.yarn.server.resourcemanager.webapp.TestRMWebServicesAppsModification.testAppSubmitBadJsonAndXML[1]
Error Message:
java.net.BindException: Address already in use
Stack Trace:
com.sun.jersey.test.framework.spi.container.TestContainerException: java.net.BindException: Address already in use
at sun.nio.ch.Net.bind0(Native Method)
at sun.nio.ch.Net.bind(Net.java:444)
at sun.nio.ch.Net.bind(Net.java:436)
at sun.nio.ch.ServerSocketChannelImpl.bind(ServerSocketChannelImpl.java:214)
at sun.nio.ch.ServerSocketAdaptor.bind(ServerSocketAdaptor.java:74)
at org.glassfish.grizzly.nio.transport.TCPNIOTransport.bind(TCPNIOTransport.java:413)
at org.glassfish.grizzly.nio.transport.TCPNIOTransport.bind(TCPNIOTransport.java:384)
at org.glassfish.grizzly.nio.transport.TCPNIOTransport.bind(TCPNIOTransport.java:375)
at org.glassfish.grizzly.http.server.NetworkListener.start(NetworkListener.java:549)
at org.glassfish.grizzly.http.server.HttpServer.start(HttpServer.java:255)
at com.sun.jersey.api.container.grizzly2.GrizzlyServerFactory.createHttpServer(GrizzlyServerFactory.java:326)
at com.sun.jersey.api.container.grizzly2.GrizzlyServerFactory.createHttpServer(GrizzlyServerFactory.java:343)
at com.sun.jersey.test.framework.spi.container.grizzly2.web.GrizzlyWebTestContainerFactory$GrizzlyWebTestContainer.instantiateGrizzlyWebServer(GrizzlyWebTestContainerFactory.java:219)
at com.sun.jersey.test.framework.spi.container.grizzly2.web.GrizzlyWebTestContainerFactory$GrizzlyWebTestContainer.<init>(GrizzlyWebTestContainerFactory.java:129)
at com.sun.jersey.test.framework.spi.container.grizzly2.web.GrizzlyWebTestContainerFactory$GrizzlyWebTestContainer.<init>(GrizzlyWebTestContainerFactory.java:86)
at com.sun.jersey.test.framework.spi.container.grizzly2.web.GrizzlyWebTestContainerFactory.create(GrizzlyWebTestContainerFactory.java:79)
at com.sun.jersey.test.framework.JerseyTest.getContainer(JerseyTest.java:342)
at com.sun.jersey.test.framework.JerseyTest.<init>(JerseyTest.java:217)
at org.apache.hadoop.yarn.webapp.JerseyTestBase.<init>(JerseyTestBase.java:27)
at org.apache.hadoop.yarn.server.resourcemanager.webapp.TestRMWebServicesAppsModification.<init>(TestRMWebServicesAppsModification.java:277)
REGRESSION: org.apache.hadoop.yarn.server.resourcemanager.webapp.TestRMWebServicesAppsModification.testGetAppQueue[2]
Error Message:
java.net.BindException: Address already in use
Stack Trace:
com.sun.jersey.test.framework.spi.container.TestContainerException: java.net.BindException: Address already in use
at sun.nio.ch.Net.bind0(Native Method)
at sun.nio.ch.Net.bind(Net.java:444)
at sun.nio.ch.Net.bind(Net.java:436)
at sun.nio.ch.ServerSocketChannelImpl.bind(ServerSocketChannelImpl.java:214)
at sun.nio.ch.ServerSocketAdaptor.bind(ServerSocketAdaptor.java:74)
at org.glassfish.grizzly.nio.transport.TCPNIOTransport.bind(TCPNIOTransport.java:413)
at org.glassfish.grizzly.nio.transport.TCPNIOTransport.bind(TCPNIOTransport.java:384)
at org.glassfish.grizzly.nio.transport.TCPNIOTransport.bind(TCPNIOTransport.java:375)
at org.glassfish.grizzly.http.server.NetworkListener.start(NetworkListener.java:549)
at org.glassfish.grizzly.http.server.HttpServer.start(HttpServer.java:255)
at com.sun.jersey.api.container.grizzly2.GrizzlyServerFactory.createHttpServer(GrizzlyServerFactory.java:326)
at com.sun.jersey.api.container.grizzly2.GrizzlyServerFactory.createHttpServer(GrizzlyServerFactory.java:343)
at com.sun.jersey.test.framework.spi.container.grizzly2.web.GrizzlyWebTestContainerFactory$GrizzlyWebTestContainer.instantiateGrizzlyWebServer(GrizzlyWebTestContainerFactory.java:219)
at com.sun.jersey.test.framework.spi.container.grizzly2.web.GrizzlyWebTestContainerFactory$GrizzlyWebTestContainer.<init>(GrizzlyWebTestContainerFactory.java:129)
at com.sun.jersey.test.framework.spi.container.grizzly2.web.GrizzlyWebTestContainerFactory$GrizzlyWebTestContainer.<init>(GrizzlyWebTestContainerFactory.java:86)
at com.sun.jersey.test.framework.spi.container.grizzly2.web.GrizzlyWebTestContainerFactory.create(GrizzlyWebTestContainerFactory.java:79)
at com.sun.jersey.test.framework.JerseyTest.getContainer(JerseyTest.java:342)
at com.sun.jersey.test.framework.JerseyTest.<init>(JerseyTest.java:217)
at org.apache.hadoop.yarn.webapp.JerseyTestBase.<init>(JerseyTestBase.java:27)
at org.apache.hadoop.yarn.server.resourcemanager.webapp.TestRMWebServicesAppsModification.<init>(TestRMWebServicesAppsModification.java:277)
REGRESSION: org.apache.hadoop.yarn.server.resourcemanager.webapp.TestRMWebServicesAppsModification.testAppMove[2]
Error Message:
java.net.BindException: Address already in use
Stack Trace:
com.sun.jersey.test.framework.spi.container.TestContainerException: java.net.BindException: Address already in use
at sun.nio.ch.Net.bind0(Native Method)
at sun.nio.ch.Net.bind(Net.java:444)
at sun.nio.ch.Net.bind(Net.java:436)
at sun.nio.ch.ServerSocketChannelImpl.bind(ServerSocketChannelImpl.java:214)
at sun.nio.ch.ServerSocketAdaptor.bind(ServerSocketAdaptor.java:74)
at org.glassfish.grizzly.nio.transport.TCPNIOTransport.bind(TCPNIOTransport.java:413)
at org.glassfish.grizzly.nio.transport.TCPNIOTransport.bind(TCPNIOTransport.java:384)
at org.glassfish.grizzly.nio.transport.TCPNIOTransport.bind(TCPNIOTransport.java:375)
at org.glassfish.grizzly.http.server.NetworkListener.start(NetworkListener.java:549)
at org.glassfish.grizzly.http.server.HttpServer.start(HttpServer.java:255)
at com.sun.jersey.api.container.grizzly2.GrizzlyServerFactory.createHttpServer(GrizzlyServerFactory.java:326)
at com.sun.jersey.api.container.grizzly2.GrizzlyServerFactory.createHttpServer(GrizzlyServerFactory.java:343)
at com.sun.jersey.test.framework.spi.container.grizzly2.web.GrizzlyWebTestContainerFactory$GrizzlyWebTestContainer.instantiateGrizzlyWebServer(GrizzlyWebTestContainerFactory.java:219)
at com.sun.jersey.test.framework.spi.container.grizzly2.web.GrizzlyWebTestContainerFactory$GrizzlyWebTestContainer.<init>(GrizzlyWebTestContainerFactory.java:129)
at com.sun.jersey.test.framework.spi.container.grizzly2.web.GrizzlyWebTestContainerFactory$GrizzlyWebTestContainer.<init>(GrizzlyWebTestContainerFactory.java:86)
at com.sun.jersey.test.framework.spi.container.grizzly2.web.GrizzlyWebTestContainerFactory.create(GrizzlyWebTestContainerFactory.java:79)
at com.sun.jersey.test.framework.JerseyTest.getContainer(JerseyTest.java:342)
at com.sun.jersey.test.framework.JerseyTest.<init>(JerseyTest.java:217)
at org.apache.hadoop.yarn.webapp.JerseyTestBase.<init>(JerseyTestBase.java:27)
at org.apache.hadoop.yarn.server.resourcemanager.webapp.TestRMWebServicesAppsModification.<init>(TestRMWebServicesAppsModification.java:277)
REGRESSION: org.apache.hadoop.yarn.server.resourcemanager.webapp.TestRMWebServicesAppsModification.testSingleAppKill[2]
Error Message:
java.net.BindException: Address already in use
Stack Trace:
com.sun.jersey.test.framework.spi.container.TestContainerException: java.net.BindException: Address already in use
at sun.nio.ch.Net.bind0(Native Method)
at sun.nio.ch.Net.bind(Net.java:444)
at sun.nio.ch.Net.bind(Net.java:436)
at sun.nio.ch.ServerSocketChannelImpl.bind(ServerSocketChannelImpl.java:214)
at sun.nio.ch.ServerSocketAdaptor.bind(ServerSocketAdaptor.java:74)
at org.glassfish.grizzly.nio.transport.TCPNIOTransport.bind(TCPNIOTransport.java:413)
at org.glassfish.grizzly.nio.transport.TCPNIOTransport.bind(TCPNIOTransport.java:384)
at org.glassfish.grizzly.nio.transport.TCPNIOTransport.bind(TCPNIOTransport.java:375)
at org.glassfish.grizzly.http.server.NetworkListener.start(NetworkListener.java:549)
at org.glassfish.grizzly.http.server.HttpServer.start(HttpServer.java:255)
at com.sun.jersey.api.container.grizzly2.GrizzlyServerFactory.createHttpServer(GrizzlyServerFactory.java:326)
at com.sun.jersey.api.container.grizzly2.GrizzlyServerFactory.createHttpServer(GrizzlyServerFactory.java:343)
at com.sun.jersey.test.framework.spi.container.grizzly2.web.GrizzlyWebTestContainerFactory$GrizzlyWebTestContainer.instantiateGrizzlyWebServer(GrizzlyWebTestContainerFactory.java:219)
at com.sun.jersey.test.framework.spi.container.grizzly2.web.GrizzlyWebTestContainerFactory$GrizzlyWebTestContainer.<init>(GrizzlyWebTestContainerFactory.java:129)
at com.sun.jersey.test.framework.spi.container.grizzly2.web.GrizzlyWebTestContainerFactory$GrizzlyWebTestContainer.<init>(GrizzlyWebTestContainerFactory.java:86)
at com.sun.jersey.test.framework.spi.container.grizzly2.web.GrizzlyWebTestContainerFactory.create(GrizzlyWebTestContainerFactory.java:79)
at com.sun.jersey.test.framework.JerseyTest.getContainer(JerseyTest.java:342)
at com.sun.jersey.test.framework.JerseyTest.<init>(JerseyTest.java:217)
at org.apache.hadoop.yarn.webapp.JerseyTestBase.<init>(JerseyTestBase.java:27)
at org.apache.hadoop.yarn.server.resourcemanager.webapp.TestRMWebServicesAppsModification.<init>(TestRMWebServicesAppsModification.java:277)
REGRESSION: org.apache.hadoop.yarn.server.resourcemanager.webapp.TestRMWebServicesAppsModification.testSingleAppKillInvalidState[2]
Error Message:
java.net.BindException: Address already in use
Stack Trace:
com.sun.jersey.test.framework.spi.container.TestContainerException: java.net.BindException: Address already in use
at sun.nio.ch.Net.bind0(Native Method)
at sun.nio.ch.Net.bind(Net.java:444)
at sun.nio.ch.Net.bind(Net.java:436)
at sun.nio.ch.ServerSocketChannelImpl.bind(ServerSocketChannelImpl.java:214)
at sun.nio.ch.ServerSocketAdaptor.bind(ServerSocketAdaptor.java:74)
at org.glassfish.grizzly.nio.transport.TCPNIOTransport.bind(TCPNIOTransport.java:413)
at org.glassfish.grizzly.nio.transport.TCPNIOTransport.bind(TCPNIOTransport.java:384)
at org.glassfish.grizzly.nio.transport.TCPNIOTransport.bind(TCPNIOTransport.java:375)
at org.glassfish.grizzly.http.server.NetworkListener.start(NetworkListener.java:549)
at org.glassfish.grizzly.http.server.HttpServer.start(HttpServer.java:255)
at com.sun.jersey.api.container.grizzly2.GrizzlyServerFactory.createHttpServer(GrizzlyServerFactory.java:326)
at com.sun.jersey.api.container.grizzly2.GrizzlyServerFactory.createHttpServer(GrizzlyServerFactory.java:343)
at com.sun.jersey.test.framework.spi.container.grizzly2.web.GrizzlyWebTestContainerFactory$GrizzlyWebTestContainer.instantiateGrizzlyWebServer(GrizzlyWebTestContainerFactory.java:219)
at com.sun.jersey.test.framework.spi.container.grizzly2.web.GrizzlyWebTestContainerFactory$GrizzlyWebTestContainer.<init>(GrizzlyWebTestContainerFactory.java:129)
at com.sun.jersey.test.framework.spi.container.grizzly2.web.GrizzlyWebTestContainerFactory$GrizzlyWebTestContainer.<init>(GrizzlyWebTestContainerFactory.java:86)
at com.sun.jersey.test.framework.spi.container.grizzly2.web.GrizzlyWebTestContainerFactory.create(GrizzlyWebTestContainerFactory.java:79)
at com.sun.jersey.test.framework.JerseyTest.getContainer(JerseyTest.java:342)
at com.sun.jersey.test.framework.JerseyTest.<init>(JerseyTest.java:217)
at org.apache.hadoop.yarn.webapp.JerseyTestBase.<init>(JerseyTestBase.java:27)
at org.apache.hadoop.yarn.server.resourcemanager.webapp.TestRMWebServicesAppsModification.<init>(TestRMWebServicesAppsModification.java:277)
REGRESSION: org.apache.hadoop.yarn.server.resourcemanager.webapp.TestRMWebServicesAppsModification.testSingleAppKillUnauthorized[2]
Error Message:
java.net.BindException: Address already in use
Stack Trace:
com.sun.jersey.test.framework.spi.container.TestContainerException: java.net.BindException: Address already in use
at sun.nio.ch.Net.bind0(Native Method)
at sun.nio.ch.Net.bind(Net.java:444)
at sun.nio.ch.Net.bind(Net.java:436)
at sun.nio.ch.ServerSocketChannelImpl.bind(ServerSocketChannelImpl.java:214)
at sun.nio.ch.ServerSocketAdaptor.bind(ServerSocketAdaptor.java:74)
at org.glassfish.grizzly.nio.transport.TCPNIOTransport.bind(TCPNIOTransport.java:413)
at org.glassfish.grizzly.nio.transport.TCPNIOTransport.bind(TCPNIOTransport.java:384)
at org.glassfish.grizzly.nio.transport.TCPNIOTransport.bind(TCPNIOTransport.java:375)
at org.glassfish.grizzly.http.server.NetworkListener.start(NetworkListener.java:549)
at org.glassfish.grizzly.http.server.HttpServer.start(HttpServer.java:255)
at com.sun.jersey.api.container.grizzly2.GrizzlyServerFactory.createHttpServer(GrizzlyServerFactory.java:326)
at com.sun.jersey.api.container.grizzly2.GrizzlyServerFactory.createHttpServer(GrizzlyServerFactory.java:343)
at com.sun.jersey.test.framework.spi.container.grizzly2.web.GrizzlyWebTestContainerFactory$GrizzlyWebTestContainer.instantiateGrizzlyWebServer(GrizzlyWebTestContainerFactory.java:219)
at com.sun.jersey.test.framework.spi.container.grizzly2.web.GrizzlyWebTestContainerFactory$GrizzlyWebTestContainer.<init>(GrizzlyWebTestContainerFactory.java:129)
at com.sun.jersey.test.framework.spi.container.grizzly2.web.GrizzlyWebTestContainerFactory$GrizzlyWebTestContainer.<init>(GrizzlyWebTestContainerFactory.java:86)
at com.sun.jersey.test.framework.spi.container.grizzly2.web.GrizzlyWebTestContainerFactory.create(GrizzlyWebTestContainerFactory.java:79)
at com.sun.jersey.test.framework.JerseyTest.getContainer(JerseyTest.java:342)
at com.sun.jersey.test.framework.JerseyTest.<init>(JerseyTest.java:217)
at org.apache.hadoop.yarn.webapp.JerseyTestBase.<init>(JerseyTestBase.java:27)
at org.apache.hadoop.yarn.server.resourcemanager.webapp.TestRMWebServicesAppsModification.<init>(TestRMWebServicesAppsModification.java:277)
REGRESSION: org.apache.hadoop.yarn.server.resourcemanager.webapp.TestRMWebServicesAppsModification.testGetNewApplication[2]
Error Message:
java.net.BindException: Address already in use
Stack Trace:
com.sun.jersey.test.framework.spi.container.TestContainerException: java.net.BindException: Address already in use
at sun.nio.ch.Net.bind0(Native Method)
at sun.nio.ch.Net.bind(Net.java:444)
at sun.nio.ch.Net.bind(Net.java:436)
at sun.nio.ch.ServerSocketChannelImpl.bind(ServerSocketChannelImpl.java:214)
at sun.nio.ch.ServerSocketAdaptor.bind(ServerSocketAdaptor.java:74)
at org.glassfish.grizzly.nio.transport.TCPNIOTransport.bind(TCPNIOTransport.java:413)
at org.glassfish.grizzly.nio.transport.TCPNIOTransport.bind(TCPNIOTransport.java:384)
at org.glassfish.grizzly.nio.transport.TCPNIOTransport.bind(TCPNIOTransport.java:375)
at org.glassfish.grizzly.http.server.NetworkListener.start(NetworkListener.java:549)
at org.glassfish.grizzly.http.server.HttpServer.start(HttpServer.java:255)
at com.sun.jersey.api.container.grizzly2.GrizzlyServerFactory.createHttpServer(GrizzlyServerFactory.java:326)
at com.sun.jersey.api.container.grizzly2.GrizzlyServerFactory.createHttpServer(GrizzlyServerFactory.java:343)
at com.sun.jersey.test.framework.spi.container.grizzly2.web.GrizzlyWebTestContainerFactory$GrizzlyWebTestContainer.instantiateGrizzlyWebServer(GrizzlyWebTestContainerFactory.java:219)
at com.sun.jersey.test.framework.spi.container.grizzly2.web.GrizzlyWebTestContainerFactory$GrizzlyWebTestContainer.<init>(GrizzlyWebTestContainerFactory.java:129)
at com.sun.jersey.test.framework.spi.container.grizzly2.web.GrizzlyWebTestContainerFactory$GrizzlyWebTestContainer.<init>(GrizzlyWebTestContainerFactory.java:86)
at com.sun.jersey.test.framework.spi.container.grizzly2.web.GrizzlyWebTestContainerFactory.create(GrizzlyWebTestContainerFactory.java:79)
at com.sun.jersey.test.framework.JerseyTest.getContainer(JerseyTest.java:342)
at com.sun.jersey.test.framework.JerseyTest.<init>(JerseyTest.java:217)
at org.apache.hadoop.yarn.webapp.JerseyTestBase.<init>(JerseyTestBase.java:27)
at org.apache.hadoop.yarn.server.resourcemanager.webapp.TestRMWebServicesAppsModification.<init>(TestRMWebServicesAppsModification.java:277)
REGRESSION: org.apache.hadoop.yarn.server.resourcemanager.webapp.TestRMWebServicesAppsModification.testSingleAppKillInvalidId[2]
Error Message:
java.net.BindException: Address already in use
Stack Trace:
com.sun.jersey.test.framework.spi.container.TestContainerException: java.net.BindException: Address already in use
at sun.nio.ch.Net.bind0(Native Method)
at sun.nio.ch.Net.bind(Net.java:444)
at sun.nio.ch.Net.bind(Net.java:436)
at sun.nio.ch.ServerSocketChannelImpl.bind(ServerSocketChannelImpl.java:214)
at sun.nio.ch.ServerSocketAdaptor.bind(ServerSocketAdaptor.java:74)
at org.glassfish.grizzly.nio.transport.TCPNIOTransport.bind(TCPNIOTransport.java:413)
at org.glassfish.grizzly.nio.transport.TCPNIOTransport.bind(TCPNIOTransport.java:384)
at org.glassfish.grizzly.nio.transport.TCPNIOTransport.bind(TCPNIOTransport.java:375)
at org.glassfish.grizzly.http.server.NetworkListener.start(NetworkListener.java:549)
at org.glassfish.grizzly.http.server.HttpServer.start(HttpServer.java:255)
at com.sun.jersey.api.container.grizzly2.GrizzlyServerFactory.createHttpServer(GrizzlyServerFactory.java:326)
at com.sun.jersey.api.container.grizzly2.GrizzlyServerFactory.createHttpServer(GrizzlyServerFactory.java:343)
at com.sun.jersey.test.framework.spi.container.grizzly2.web.GrizzlyWebTestContainerFactory$GrizzlyWebTestContainer.instantiateGrizzlyWebServer(GrizzlyWebTestContainerFactory.java:219)
at com.sun.jersey.test.framework.spi.container.grizzly2.web.GrizzlyWebTestContainerFactory$GrizzlyWebTestContainer.<init>(GrizzlyWebTestContainerFactory.java:129)
at com.sun.jersey.test.framework.spi.container.grizzly2.web.GrizzlyWebTestContainerFactory$GrizzlyWebTestContainer.<init>(GrizzlyWebTestContainerFactory.java:86)
at com.sun.jersey.test.framework.spi.container.grizzly2.web.GrizzlyWebTestContainerFactory.create(GrizzlyWebTestContainerFactory.java:79)
at com.sun.jersey.test.framework.JerseyTest.getContainer(JerseyTest.java:342)
at com.sun.jersey.test.framework.JerseyTest.<init>(JerseyTest.java:217)
at org.apache.hadoop.yarn.webapp.JerseyTestBase.<init>(JerseyTestBase.java:27)
at org.apache.hadoop.yarn.server.resourcemanager.webapp.TestRMWebServicesAppsModification.<init>(TestRMWebServicesAppsModification.java:277)
REGRESSION: org.apache.hadoop.yarn.server.resourcemanager.webapp.TestRMWebServicesAppsModification.testSingleAppState[2]
Error Message:
java.net.BindException: Address already in use
Stack Trace:
com.sun.jersey.test.framework.spi.container.TestContainerException: java.net.BindException: Address already in use
at sun.nio.ch.Net.bind0(Native Method)
at sun.nio.ch.Net.bind(Net.java:444)
at sun.nio.ch.Net.bind(Net.java:436)
at sun.nio.ch.ServerSocketChannelImpl.bind(ServerSocketChannelImpl.java:214)
at sun.nio.ch.ServerSocketAdaptor.bind(ServerSocketAdaptor.java:74)
at org.glassfish.grizzly.nio.transport.TCPNIOTransport.bind(TCPNIOTransport.java:413)
at org.glassfish.grizzly.nio.transport.TCPNIOTransport.bind(TCPNIOTransport.java:384)
at org.glassfish.grizzly.nio.transport.TCPNIOTransport.bind(TCPNIOTransport.java:375)
at org.glassfish.grizzly.http.server.NetworkListener.start(NetworkListener.java:549)
at org.glassfish.grizzly.http.server.HttpServer.start(HttpServer.java:255)
at com.sun.jersey.api.container.grizzly2.GrizzlyServerFactory.createHttpServer(GrizzlyServerFactory.java:326)
at com.sun.jersey.api.container.grizzly2.GrizzlyServerFactory.createHttpServer(GrizzlyServerFactory.java:343)
at com.sun.jersey.test.framework.spi.container.grizzly2.web.GrizzlyWebTestContainerFactory$GrizzlyWebTestContainer.instantiateGrizzlyWebServer(GrizzlyWebTestContainerFactory.java:219)
at com.sun.jersey.test.framework.spi.container.grizzly2.web.GrizzlyWebTestContainerFactory$GrizzlyWebTestContainer.<init>(GrizzlyWebTestContainerFactory.java:129)
at com.sun.jersey.test.framework.spi.container.grizzly2.web.GrizzlyWebTestContainerFactory$GrizzlyWebTestContainer.<init>(GrizzlyWebTestContainerFactory.java:86)
at com.sun.jersey.test.framework.spi.container.grizzly2.web.GrizzlyWebTestContainerFactory.create(GrizzlyWebTestContainerFactory.java:79)
at com.sun.jersey.test.framework.JerseyTest.getContainer(JerseyTest.java:342)
at com.sun.jersey.test.framework.JerseyTest.<init>(JerseyTest.java:217)
at org.apache.hadoop.yarn.webapp.JerseyTestBase.<init>(JerseyTestBase.java:27)
at org.apache.hadoop.yarn.server.resourcemanager.webapp.TestRMWebServicesAppsModification.<init>(TestRMWebServicesAppsModification.java:277)
REGRESSION: org.apache.hadoop.yarn.server.resourcemanager.webapp.TestRMWebServicesAppsModification.testGetNewApplicationAndSubmit[2]
Error Message:
java.net.BindException: Address already in use
Stack Trace:
com.sun.jersey.test.framework.spi.container.TestContainerException: java.net.BindException: Address already in use
at sun.nio.ch.Net.bind0(Native Method)
at sun.nio.ch.Net.bind(Net.java:444)
at sun.nio.ch.Net.bind(Net.java:436)
at sun.nio.ch.ServerSocketChannelImpl.bind(ServerSocketChannelImpl.java:214)
at sun.nio.ch.ServerSocketAdaptor.bind(ServerSocketAdaptor.java:74)
at org.glassfish.grizzly.nio.transport.TCPNIOTransport.bind(TCPNIOTransport.java:413)
at org.glassfish.grizzly.nio.transport.TCPNIOTransport.bind(TCPNIOTransport.java:384)
at org.glassfish.grizzly.nio.transport.TCPNIOTransport.bind(TCPNIOTransport.java:375)
at org.glassfish.grizzly.http.server.NetworkListener.start(NetworkListener.java:549)
at org.glassfish.grizzly.http.server.HttpServer.start(HttpServer.java:255)
at com.sun.jersey.api.container.grizzly2.GrizzlyServerFactory.createHttpServer(GrizzlyServerFactory.java:326)
at com.sun.jersey.api.container.grizzly2.GrizzlyServerFactory.createHttpServer(GrizzlyServerFactory.java:343)
at com.sun.jersey.test.framework.spi.container.grizzly2.web.GrizzlyWebTestContainerFactory$GrizzlyWebTestContainer.instantiateGrizzlyWebServer(GrizzlyWebTestContainerFactory.java:219)
at com.sun.jersey.test.framework.spi.container.grizzly2.web.GrizzlyWebTestContainerFactory$GrizzlyWebTestContainer.<init>(GrizzlyWebTestContainerFactory.java:129)
at com.sun.jersey.test.framework.spi.container.grizzly2.web.GrizzlyWebTestContainerFactory$GrizzlyWebTestContainer.<init>(GrizzlyWebTestContainerFactory.java:86)
at com.sun.jersey.test.framework.spi.container.grizzly2.web.GrizzlyWebTestContainerFactory.create(GrizzlyWebTestContainerFactory.java:79)
at com.sun.jersey.test.framework.JerseyTest.getContainer(JerseyTest.java:342)
at com.sun.jersey.test.framework.JerseyTest.<init>(JerseyTest.java:217)
at org.apache.hadoop.yarn.webapp.JerseyTestBase.<init>(JerseyTestBase.java:27)
at org.apache.hadoop.yarn.server.resourcemanager.webapp.TestRMWebServicesAppsModification.<init>(TestRMWebServicesAppsModification.java:277)
REGRESSION: org.apache.hadoop.yarn.server.resourcemanager.webapp.TestRMWebServicesAppsModification.testUpdateAppPriority[2]
Error Message:
java.net.BindException: Address already in use
Stack Trace:
com.sun.jersey.test.framework.spi.container.TestContainerException: java.net.BindException: Address already in use
at sun.nio.ch.Net.bind0(Native Method)
at sun.nio.ch.Net.bind(Net.java:444)
at sun.nio.ch.Net.bind(Net.java:436)
at sun.nio.ch.ServerSocketChannelImpl.bind(ServerSocketChannelImpl.java:214)
at sun.nio.ch.ServerSocketAdaptor.bind(ServerSocketAdaptor.java:74)
at org.glassfish.grizzly.nio.transport.TCPNIOTransport.bind(TCPNIOTransport.java:413)
at org.glassfish.grizzly.nio.transport.TCPNIOTransport.bind(TCPNIOTransport.java:384)
at org.glassfish.grizzly.nio.transport.TCPNIOTransport.bind(TCPNIOTransport.java:375)
at org.glassfish.grizzly.http.server.NetworkListener.start(NetworkListener.java:549)
at org.glassfish.grizzly.http.server.HttpServer.start(HttpServer.java:255)
at com.sun.jersey.api.container.grizzly2.GrizzlyServerFactory.createHttpServer(GrizzlyServerFactory.java:326)
at com.sun.jersey.api.container.grizzly2.GrizzlyServerFactory.createHttpServer(GrizzlyServerFactory.java:343)
at com.sun.jersey.test.framework.spi.container.grizzly2.web.GrizzlyWebTestContainerFactory$GrizzlyWebTestContainer.instantiateGrizzlyWebServer(GrizzlyWebTestContainerFactory.java:219)
at com.sun.jersey.test.framework.spi.container.grizzly2.web.GrizzlyWebTestContainerFactory$GrizzlyWebTestContainer.<init>(GrizzlyWebTestContainerFactory.java:129)
at com.sun.jersey.test.framework.spi.container.grizzly2.web.GrizzlyWebTestContainerFactory$GrizzlyWebTestContainer.<init>(GrizzlyWebTestContainerFactory.java:86)
at com.sun.jersey.test.framework.spi.container.grizzly2.web.GrizzlyWebTestContainerFactory.create(GrizzlyWebTestContainerFactory.java:79)
at com.sun.jersey.test.framework.JerseyTest.getContainer(JerseyTest.java:342)
at com.sun.jersey.test.framework.JerseyTest.<init>(JerseyTest.java:217)
at org.apache.hadoop.yarn.webapp.JerseyTestBase.<init>(JerseyTestBase.java:27)
at org.apache.hadoop.yarn.server.resourcemanager.webapp.TestRMWebServicesAppsModification.<init>(TestRMWebServicesAppsModification.java:277)
REGRESSION: org.apache.hadoop.yarn.server.resourcemanager.webapp.TestRMWebServicesAppsModification.testAppSubmitBadJsonAndXML[2]
Error Message:
java.net.BindException: Address already in use
Stack Trace:
com.sun.jersey.test.framework.spi.container.TestContainerException: java.net.BindException: Address already in use
at sun.nio.ch.Net.bind0(Native Method)
at sun.nio.ch.Net.bind(Net.java:444)
at sun.nio.ch.Net.bind(Net.java:436)
at sun.nio.ch.ServerSocketChannelImpl.bind(ServerSocketChannelImpl.java:214)
at sun.nio.ch.ServerSocketAdaptor.bind(ServerSocketAdaptor.java:74)
at org.glassfish.grizzly.nio.transport.TCPNIOTransport.bind(TCPNIOTransport.java:413)
at org.glassfish.grizzly.nio.transport.TCPNIOTransport.bind(TCPNIOTransport.java:384)
at org.glassfish.grizzly.nio.transport.TCPNIOTransport.bind(TCPNIOTransport.java:375)
at org.glassfish.grizzly.http.server.NetworkListener.start(NetworkListener.java:549)
at org.glassfish.grizzly.http.server.HttpServer.start(HttpServer.java:255)
at com.sun.jersey.api.container.grizzly2.GrizzlyServerFactory.createHttpServer(GrizzlyServerFactory.java:326)
at com.sun.jersey.api.container.grizzly2.GrizzlyServerFactory.createHttpServer(GrizzlyServerFactory.java:343)
at com.sun.jersey.test.framework.spi.container.grizzly2.web.GrizzlyWebTestContainerFactory$GrizzlyWebTestContainer.instantiateGrizzlyWebServer(GrizzlyWebTestContainerFactory.java:219)
at com.sun.jersey.test.framework.spi.container.grizzly2.web.GrizzlyWebTestContainerFactory$GrizzlyWebTestContainer.<init>(GrizzlyWebTestContainerFactory.java:129)
at com.sun.jersey.test.framework.spi.container.grizzly2.web.GrizzlyWebTestContainerFactory$GrizzlyWebTestContainer.<init>(GrizzlyWebTestContainerFactory.java:86)
at com.sun.jersey.test.framework.spi.container.grizzly2.web.GrizzlyWebTestContainerFactory.create(GrizzlyWebTestContainerFactory.java:79)
at com.sun.jersey.test.framework.JerseyTest.getContainer(JerseyTest.java:342)
at com.sun.jersey.test.framework.JerseyTest.<init>(JerseyTest.java:217)
at org.apache.hadoop.yarn.webapp.JerseyTestBase.<init>(JerseyTestBase.java:27)
at org.apache.hadoop.yarn.server.resourcemanager.webapp.TestRMWebServicesAppsModification.<init>(TestRMWebServicesAppsModification.java:277)
REGRESSION: org.apache.hadoop.yarn.server.resourcemanager.webapp.TestRMWebServicesAppsModification.testGetAppQueue[3]
Error Message:
java.net.BindException: Address already in use
Stack Trace:
com.sun.jersey.test.framework.spi.container.TestContainerException: java.net.BindException: Address already in use
at sun.nio.ch.Net.bind0(Native Method)
at sun.nio.ch.Net.bind(Net.java:444)
at sun.nio.ch.Net.bind(Net.java:436)
at sun.nio.ch.ServerSocketChannelImpl.bind(ServerSocketChannelImpl.java:214)
at sun.nio.ch.ServerSocketAdaptor.bind(ServerSocketAdaptor.java:74)
at org.glassfish.grizzly.nio.transport.TCPNIOTransport.bind(TCPNIOTransport.java:413)
at org.glassfish.grizzly.nio.transport.TCPNIOTransport.bind(TCPNIOTransport.java:384)
at org.glassfish.grizzly.nio.transport.TCPNIOTransport.bind(TCPNIOTransport.java:375)
at org.glassfish.grizzly.http.server.NetworkListener.start(NetworkListener.java:549)
at org.glassfish.grizzly.http.server.HttpServer.start(HttpServer.java:255)
at com.sun.jersey.api.container.grizzly2.GrizzlyServerFactory.createHttpServer(GrizzlyServerFactory.java:326)
at com.sun.jersey.api.container.grizzly2.GrizzlyServerFactory.createHttpServer(GrizzlyServerFactory.java:343)
at com.sun.jersey.test.framework.spi.container.grizzly2.web.GrizzlyWebTestContainerFactory$GrizzlyWebTestContainer.instantiateGrizzlyWebServer(GrizzlyWebTestContainerFactory.java:219)
at com.sun.jersey.test.framework.spi.container.grizzly2.web.GrizzlyWebTestContainerFactory$GrizzlyWebTestContainer.<init>(GrizzlyWebTestContainerFactory.java:129)
at com.sun.jersey.test.framework.spi.container.grizzly2.web.GrizzlyWebTestContainerFactory$GrizzlyWebTestContainer.<init>(GrizzlyWebTestContainerFactory.java:86)
at com.sun.jersey.test.framework.spi.container.grizzly2.web.GrizzlyWebTestContainerFactory.create(GrizzlyWebTestContainerFactory.java:79)
at com.sun.jersey.test.framework.JerseyTest.getContainer(JerseyTest.java:342)
at com.sun.jersey.test.framework.JerseyTest.<init>(JerseyTest.java:217)
at org.apache.hadoop.yarn.webapp.JerseyTestBase.<init>(JerseyTestBase.java:27)
at org.apache.hadoop.yarn.server.resourcemanager.webapp.TestRMWebServicesAppsModification.<init>(TestRMWebServicesAppsModification.java:277)
REGRESSION: org.apache.hadoop.yarn.server.resourcemanager.webapp.TestRMWebServicesAppsModification.testAppMove[3]
Error Message:
java.net.BindException: Address already in use
Stack Trace:
com.sun.jersey.test.framework.spi.container.TestContainerException: java.net.BindException: Address already in use
at sun.nio.ch.Net.bind0(Native Method)
at sun.nio.ch.Net.bind(Net.java:444)
at sun.nio.ch.Net.bind(Net.java:436)
at sun.nio.ch.ServerSocketChannelImpl.bind(ServerSocketChannelImpl.java:214)
at sun.nio.ch.ServerSocketAdaptor.bind(ServerSocketAdaptor.java:74)
at org.glassfish.grizzly.nio.transport.TCPNIOTransport.bind(TCPNIOTransport.java:413)
at org.glassfish.grizzly.nio.transport.TCPNIOTransport.bind(TCPNIOTransport.java:384)
at org.glassfish.grizzly.nio.transport.TCPNIOTransport.bind(TCPNIOTransport.java:375)
at org.glassfish.grizzly.http.server.NetworkListener.start(NetworkListener.java:549)
at org.glassfish.grizzly.http.server.HttpServer.start(HttpServer.java:255)
at com.sun.jersey.api.container.grizzly2.GrizzlyServerFactory.createHttpServer(GrizzlyServerFactory.java:326)
at com.sun.jersey.api.container.grizzly2.GrizzlyServerFactory.createHttpServer(GrizzlyServerFactory.java:343)
at com.sun.jersey.test.framework.spi.container.grizzly2.web.GrizzlyWebTestContainerFactory$GrizzlyWebTestContainer.instantiateGrizzlyWebServer(GrizzlyWebTestContainerFactory.java:219)
at com.sun.jersey.test.framework.spi.container.grizzly2.web.GrizzlyWebTestContainerFactory$GrizzlyWebTestContainer.<init>(GrizzlyWebTestContainerFactory.java:129)
at com.sun.jersey.test.framework.spi.container.grizzly2.web.GrizzlyWebTestContainerFactory$GrizzlyWebTestContainer.<init>(GrizzlyWebTestContainerFactory.java:86)
at com.sun.jersey.test.framework.spi.container.grizzly2.web.GrizzlyWebTestContainerFactory.create(GrizzlyWebTestContainerFactory.java:79)
at com.sun.jersey.test.framework.JerseyTest.getContainer(JerseyTest.java:342)
at com.sun.jersey.test.framework.JerseyTest.<init>(JerseyTest.java:217)
at org.apache.hadoop.yarn.webapp.JerseyTestBase.<init>(JerseyTestBase.java:27)
at org.apache.hadoop.yarn.server.resourcemanager.webapp.TestRMWebServicesAppsModification.<init>(TestRMWebServicesAppsModification.java:277)
REGRESSION: org.apache.hadoop.yarn.server.resourcemanager.webapp.TestRMWebServicesAppsModification.testSingleAppKill[3]
Error Message:
java.net.BindException: Address already in use
Stack Trace:
com.sun.jersey.test.framework.spi.container.TestContainerException: java.net.BindException: Address already in use
at sun.nio.ch.Net.bind0(Native Method)
at sun.nio.ch.Net.bind(Net.java:444)
at sun.nio.ch.Net.bind(Net.java:436)
at sun.nio.ch.ServerSocketChannelImpl.bind(ServerSocketChannelImpl.java:214)
at sun.nio.ch.ServerSocketAdaptor.bind(ServerSocketAdaptor.java:74)
at org.glassfish.grizzly.nio.transport.TCPNIOTransport.bind(TCPNIOTransport.java:413)
at org.glassfish.grizzly.nio.transport.TCPNIOTransport.bind(TCPNIOTransport.java:384)
at org.glassfish.grizzly.nio.transport.TCPNIOTransport.bind(TCPNIOTransport.java:375)
at org.glassfish.grizzly.http.server.NetworkListener.start(NetworkListener.java:549)
at org.glassfish.grizzly.http.server.HttpServer.start(HttpServer.java:255)
at com.sun.jersey.api.container.grizzly2.GrizzlyServerFactory.createHttpServer(GrizzlyServerFactory.java:326)
at com.sun.jersey.api.container.grizzly2.GrizzlyServerFactory.createHttpServer(GrizzlyServerFactory.java:343)
at com.sun.jersey.test.framework.spi.container.grizzly2.web.GrizzlyWebTestContainerFactory$GrizzlyWebTestContainer.instantiateGrizzlyWebServer(GrizzlyWebTestContainerFactory.java:219)
at com.sun.jersey.test.framework.spi.container.grizzly2.web.GrizzlyWebTestContainerFactory$GrizzlyWebTestContainer.<init>(GrizzlyWebTestContainerFactory.java:129)
at com.sun.jersey.test.framework.spi.container.grizzly2.web.GrizzlyWebTestContainerFactory$GrizzlyWebTestContainer.<init>(GrizzlyWebTestContainerFactory.java:86)
at com.sun.jersey.test.framework.spi.container.grizzly2.web.GrizzlyWebTestContainerFactory.create(GrizzlyWebTestContainerFactory.java:79)
at com.sun.jersey.test.framework.JerseyTest.getContainer(JerseyTest.java:342)
at com.sun.jersey.test.framework.JerseyTest.<init>(JerseyTest.java:217)
at org.apache.hadoop.yarn.webapp.JerseyTestBase.<init>(JerseyTestBase.java:27)
at org.apache.hadoop.yarn.server.resourcemanager.webapp.TestRMWebServicesAppsModification.<init>(TestRMWebServicesAppsModification.java:277)
REGRESSION: org.apache.hadoop.yarn.server.resourcemanager.webapp.TestRMWebServicesAppsModification.testSingleAppKillInvalidState[3]
Error Message:
java.net.BindException: Address already in use
Stack Trace:
com.sun.jersey.test.framework.spi.container.TestContainerException: java.net.BindException: Address already in use
at sun.nio.ch.Net.bind0(Native Method)
at sun.nio.ch.Net.bind(Net.java:444)
at sun.nio.ch.Net.bind(Net.java:436)
at sun.nio.ch.ServerSocketChannelImpl.bind(ServerSocketChannelImpl.java:214)
at sun.nio.ch.ServerSocketAdaptor.bind(ServerSocketAdaptor.java:74)
at org.glassfish.grizzly.nio.transport.TCPNIOTransport.bind(TCPNIOTransport.java:413)
at org.glassfish.grizzly.nio.transport.TCPNIOTransport.bind(TCPNIOTransport.java:384)
at org.glassfish.grizzly.nio.transport.TCPNIOTransport.bind(TCPNIOTransport.java:375)
at org.glassfish.grizzly.http.server.NetworkListener.start(NetworkListener.java:549)
at org.glassfish.grizzly.http.server.HttpServer.start(HttpServer.java:255)
at com.sun.jersey.api.container.grizzly2.GrizzlyServerFactory.createHttpServer(GrizzlyServerFactory.java:326)
at com.sun.jersey.api.container.grizzly2.GrizzlyServerFactory.createHttpServer(GrizzlyServerFactory.java:343)
at com.sun.jersey.test.framework.spi.container.grizzly2.web.GrizzlyWebTestContainerFactory$GrizzlyWebTestContainer.instantiateGrizzlyWebServer(GrizzlyWebTestContainerFactory.java:219)
at com.sun.jersey.test.framework.spi.container.grizzly2.web.GrizzlyWebTestContainerFactory$GrizzlyWebTestContainer.<init>(GrizzlyWebTestContainerFactory.java:129)
at com.sun.jersey.test.framework.spi.container.grizzly2.web.GrizzlyWebTestContainerFactory$GrizzlyWebTestContainer.<init>(GrizzlyWebTestContainerFactory.java:86)
at com.sun.jersey.test.framework.spi.container.grizzly2.web.GrizzlyWebTestContainerFactory.create(GrizzlyWebTestContainerFactory.java:79)
at com.sun.jersey.test.framework.JerseyTest.getContainer(JerseyTest.java:342)
at com.sun.jersey.test.framework.JerseyTest.<init>(JerseyTest.java:217)
at org.apache.hadoop.yarn.webapp.JerseyTestBase.<init>(JerseyTestBase.java:27)
at org.apache.hadoop.yarn.server.resourcemanager.webapp.TestRMWebServicesAppsModification.<init>(TestRMWebServicesAppsModification.java:277)
REGRESSION: org.apache.hadoop.yarn.server.resourcemanager.webapp.TestRMWebServicesAppsModification.testSingleAppKillUnauthorized[3]
Error Message:
java.net.BindException: Address already in use
Stack Trace:
com.sun.jersey.test.framework.spi.container.TestContainerException: java.net.BindException: Address already in use
at sun.nio.ch.Net.bind0(Native Method)
at sun.nio.ch.Net.bind(Net.java:444)
at sun.nio.ch.Net.bind(Net.java:436)
at sun.nio.ch.ServerSocketChannelImpl.bind(ServerSocketChannelImpl.java:214)
at sun.nio.ch.ServerSocketAdaptor.bind(ServerSocketAdaptor.java:74)
at org.glassfish.grizzly.nio.transport.TCPNIOTransport.bind(TCPNIOTransport.java:413)
at org.glassfish.grizzly.nio.transport.TCPNIOTransport.bind(TCPNIOTransport.java:384)
at org.glassfish.grizzly.nio.transport.TCPNIOTransport.bind(TCPNIOTransport.java:375)
at org.glassfish.grizzly.http.server.NetworkListener.start(NetworkListener.java:549)
at org.glassfish.grizzly.http.server.HttpServer.start(HttpServer.java:255)
at com.sun.jersey.api.container.grizzly2.GrizzlyServerFactory.createHttpServer(GrizzlyServerFactory.java:326)
at com.sun.jersey.api.container.grizzly2.GrizzlyServerFactory.createHttpServer(GrizzlyServerFactory.java:343)
at com.sun.jersey.test.framework.spi.container.grizzly2.web.GrizzlyWebTestContainerFactory$GrizzlyWebTestContainer.instantiateGrizzlyWebServer(GrizzlyWebTestContainerFactory.java:219)
at com.sun.jersey.test.framework.spi.container.grizzly2.web.GrizzlyWebTestContainerFactory$GrizzlyWebTestContainer.<init>(GrizzlyWebTestContainerFactory.java:129)
at com.sun.jersey.test.framework.spi.container.grizzly2.web.GrizzlyWebTestContainerFactory$GrizzlyWebTestContainer.<init>(GrizzlyWebTestContainerFactory.java:86)
at com.sun.jersey.test.framework.spi.container.grizzly2.web.GrizzlyWebTestContainerFactory.create(GrizzlyWebTestContainerFactory.java:79)
at com.sun.jersey.test.framework.JerseyTest.getContainer(JerseyTest.java:342)
at com.sun.jersey.test.framework.JerseyTest.<init>(JerseyTest.java:217)
at org.apache.hadoop.yarn.webapp.JerseyTestBase.<init>(JerseyTestBase.java:27)
at org.apache.hadoop.yarn.server.resourcemanager.webapp.TestRMWebServicesAppsModification.<init>(TestRMWebServicesAppsModification.java:277)
REGRESSION: org.apache.hadoop.yarn.server.resourcemanager.webapp.TestRMWebServicesAppsModification.testGetNewApplication[3]
Error Message:
java.net.BindException: Address already in use
Stack Trace:
com.sun.jersey.test.framework.spi.container.TestContainerException: java.net.BindException: Address already in use
at sun.nio.ch.Net.bind0(Native Method)
at sun.nio.ch.Net.bind(Net.java:444)
at sun.nio.ch.Net.bind(Net.java:436)
at sun.nio.ch.ServerSocketChannelImpl.bind(ServerSocketChannelImpl.java:214)
at sun.nio.ch.ServerSocketAdaptor.bind(ServerSocketAdaptor.java:74)
at org.glassfish.grizzly.nio.transport.TCPNIOTransport.bind(TCPNIOTransport.java:413)
at org.glassfish.grizzly.nio.transport.TCPNIOTransport.bind(TCPNIOTransport.java:384)
at org.glassfish.grizzly.nio.transport.TCPNIOTransport.bind(TCPNIOTransport.java:375)
at org.glassfish.grizzly.http.server.NetworkListener.start(NetworkListener.java:549)
at org.glassfish.grizzly.http.server.HttpServer.start(HttpServer.java:255)
at com.sun.jersey.api.container.grizzly2.GrizzlyServerFactory.createHttpServer(GrizzlyServerFactory.java:326)
at com.sun.jersey.api.container.grizzly2.GrizzlyServerFactory.createHttpServer(GrizzlyServerFactory.java:343)
at com.sun.jersey.test.framework.spi.container.grizzly2.web.GrizzlyWebTestContainerFactory$GrizzlyWebTestContainer.instantiateGrizzlyWebServer(GrizzlyWebTestContainerFactory.java:219)
at com.sun.jersey.test.framework.spi.container.grizzly2.web.GrizzlyWebTestContainerFactory$GrizzlyWebTestContainer.<init>(GrizzlyWebTestContainerFactory.java:129)
at com.sun.jersey.test.framework.spi.container.grizzly2.web.GrizzlyWebTestContainerFactory$GrizzlyWebTestContainer.<init>(GrizzlyWebTestContainerFactory.java:86)
at com.sun.jersey.test.framework.spi.container.grizzly2.web.GrizzlyWebTestContainerFactory.create(GrizzlyWebTestContainerFactory.java:79)
at com.sun.jersey.test.framework.JerseyTest.getContainer(JerseyTest.java:342)
at com.sun.jersey.test.framework.JerseyTest.<init>(JerseyTest.java:217)
at org.apache.hadoop.yarn.webapp.JerseyTestBase.<init>(JerseyTestBase.java:27)
at org.apache.hadoop.yarn.server.resourcemanager.webapp.TestRMWebServicesAppsModification.<init>(TestRMWebServicesAppsModification.java:277)
REGRESSION: org.apache.hadoop.yarn.server.resourcemanager.webapp.TestRMWebServicesAppsModification.testSingleAppKillInvalidId[3]
Error Message:
java.net.BindException: Address already in use
Stack Trace:
com.sun.jersey.test.framework.spi.container.TestContainerException: java.net.BindException: Address already in use
at sun.nio.ch.Net.bind0(Native Method)
at sun.nio.ch.Net.bind(Net.java:444)
at sun.nio.ch.Net.bind(Net.java:436)
at sun.nio.ch.ServerSocketChannelImpl.bind(ServerSocketChannelImpl.java:214)
at sun.nio.ch.ServerSocketAdaptor.bind(ServerSocketAdaptor.java:74)
at org.glassfish.grizzly.nio.transport.TCPNIOTransport.bind(TCPNIOTransport.java:413)
at org.glassfish.grizzly.nio.transport.TCPNIOTransport.bind(TCPNIOTransport.java:384)
at org.glassfish.grizzly.nio.transport.TCPNIOTransport.bind(TCPNIOTransport.java:375)
at org.glassfish.grizzly.http.server.NetworkListener.start(NetworkListener.java:549)
at org.glassfish.grizzly.http.server.HttpServer.start(HttpServer.java:255)
at com.sun.jersey.api.container.grizzly2.GrizzlyServerFactory.createHttpServer(GrizzlyServerFactory.java:326)
at com.sun.jersey.api.container.grizzly2.GrizzlyServerFactory.createHttpServer(GrizzlyServerFactory.java:343)
at com.sun.jersey.test.framework.spi.container.grizzly2.web.GrizzlyWebTestContainerFactory$GrizzlyWebTestContainer.instantiateGrizzlyWebServer(GrizzlyWebTestContainerFactory.java:219)
at com.sun.jersey.test.framework.spi.container.grizzly2.web.GrizzlyWebTestContainerFactory$GrizzlyWebTestContainer.<init>(GrizzlyWebTestContainerFactory.java:129)
at com.sun.jersey.test.framework.spi.container.grizzly2.web.GrizzlyWebTestContainerFactory$GrizzlyWebTestContainer.<init>(GrizzlyWebTestContainerFactory.java:86)
at com.sun.jersey.test.framework.spi.container.grizzly2.web.GrizzlyWebTestContainerFactory.create(GrizzlyWebTestContainerFactory.java:79)
at com.sun.jersey.test.framework.JerseyTest.getContainer(JerseyTest.java:342)
at com.sun.jersey.test.framework.JerseyTest.<init>(JerseyTest.java:217)
at org.apache.hadoop.yarn.webapp.JerseyTestBase.<init>(JerseyTestBase.java:27)
at org.apache.hadoop.yarn.server.resourcemanager.webapp.TestRMWebServicesAppsModification.<init>(TestRMWebServicesAppsModification.java:277)
REGRESSION: org.apache.hadoop.yarn.server.resourcemanager.webapp.TestRMWebServicesAppsModification.testSingleAppState[3]
Error Message:
java.net.BindException: Address already in use
Stack Trace:
com.sun.jersey.test.framework.spi.container.TestContainerException: java.net.BindException: Address already in use
at sun.nio.ch.Net.bind0(Native Method)
at sun.nio.ch.Net.bind(Net.java:444)
at sun.nio.ch.Net.bind(Net.java:436)
at sun.nio.ch.ServerSocketChannelImpl.bind(ServerSocketChannelImpl.java:214)
at sun.nio.ch.ServerSocketAdaptor.bind(ServerSocketAdaptor.java:74)
at org.glassfish.grizzly.nio.transport.TCPNIOTransport.bind(TCPNIOTransport.java:413)
at org.glassfish.grizzly.nio.transport.TCPNIOTransport.bind(TCPNIOTransport.java:384)
at org.glassfish.grizzly.nio.transport.TCPNIOTransport.bind(TCPNIOTransport.java:375)
at org.glassfish.grizzly.http.server.NetworkListener.start(NetworkListener.java:549)
at org.glassfish.grizzly.http.server.HttpServer.start(HttpServer.java:255)
at com.sun.jersey.api.container.grizzly2.GrizzlyServerFactory.createHttpServer(GrizzlyServerFactory.java:326)
at com.sun.jersey.api.container.grizzly2.GrizzlyServerFactory.createHttpServer(GrizzlyServerFactory.java:343)
at com.sun.jersey.test.framework.spi.container.grizzly2.web.GrizzlyWebTestContainerFactory$GrizzlyWebTestContainer.instantiateGrizzlyWebServer(GrizzlyWebTestContainerFactory.java:219)
at com.sun.jersey.test.framework.spi.container.grizzly2.web.GrizzlyWebTestContainerFactory$GrizzlyWebTestContainer.<init>(GrizzlyWebTestContainerFactory.java:129)
at com.sun.jersey.test.framework.spi.container.grizzly2.web.GrizzlyWebTestContainerFactory$GrizzlyWebTestContainer.<init>(GrizzlyWebTestContainerFactory.java:86)
at com.sun.jersey.test.framework.spi.container.grizzly2.web.GrizzlyWebTestContainerFactory.create(GrizzlyWebTestContainerFactory.java:79)
at com.sun.jersey.test.framework.JerseyTest.getContainer(JerseyTest.java:342)
at com.sun.jersey.test.framework.JerseyTest.<init>(JerseyTest.java:217)
at org.apache.hadoop.yarn.webapp.JerseyTestBase.<init>(JerseyTestBase.java:27)
at org.apache.hadoop.yarn.server.resourcemanager.webapp.TestRMWebServicesAppsModification.<init>(TestRMWebServicesAppsModification.java:277)
REGRESSION: org.apache.hadoop.yarn.server.resourcemanager.webapp.TestRMWebServicesAppsModification.testGetNewApplicationAndSubmit[3]
Error Message:
java.net.BindException: Address already in use
Stack Trace:
com.sun.jersey.test.framework.spi.container.TestContainerException: java.net.BindException: Address already in use
at sun.nio.ch.Net.bind0(Native Method)
at sun.nio.ch.Net.bind(Net.java:444)
at sun.nio.ch.Net.bind(Net.java:436)
at sun.nio.ch.ServerSocketChannelImpl.bind(ServerSocketChannelImpl.java:214)
at sun.nio.ch.ServerSocketAdaptor.bind(ServerSocketAdaptor.java:74)
at org.glassfish.grizzly.nio.transport.TCPNIOTransport.bind(TCPNIOTransport.java:413)
at org.glassfish.grizzly.nio.transport.TCPNIOTransport.bind(TCPNIOTransport.java:384)
at org.glassfish.grizzly.nio.transport.TCPNIOTransport.bind(TCPNIOTransport.java:375)
at org.glassfish.grizzly.http.server.NetworkListener.start(NetworkListener.java:549)
at org.glassfish.grizzly.http.server.HttpServer.start(HttpServer.java:255)
at com.sun.jersey.api.container.grizzly2.GrizzlyServerFactory.createHttpServer(GrizzlyServerFactory.java:326)
at com.sun.jersey.api.container.grizzly2.GrizzlyServerFactory.createHttpServer(GrizzlyServerFactory.java:343)
at com.sun.jersey.test.framework.spi.container.grizzly2.web.GrizzlyWebTestContainerFactory$GrizzlyWebTestContainer.instantiateGrizzlyWebServer(GrizzlyWebTestContainerFactory.java:219)
at com.sun.jersey.test.framework.spi.container.grizzly2.web.GrizzlyWebTestContainerFactory$GrizzlyWebTestContainer.<init>(GrizzlyWebTestContainerFactory.java:129)
at com.sun.jersey.test.framework.spi.container.grizzly2.web.GrizzlyWebTestContainerFactory$GrizzlyWebTestContainer.<init>(GrizzlyWebTestContainerFactory.java:86)
at com.sun.jersey.test.framework.spi.container.grizzly2.web.GrizzlyWebTestContainerFactory.create(GrizzlyWebTestContainerFactory.java:79)
at com.sun.jersey.test.framework.JerseyTest.getContainer(JerseyTest.java:342)
at com.sun.jersey.test.framework.JerseyTest.<init>(JerseyTest.java:217)
at org.apache.hadoop.yarn.webapp.JerseyTestBase.<init>(JerseyTestBase.java:27)
at org.apache.hadoop.yarn.server.resourcemanager.webapp.TestRMWebServicesAppsModification.<init>(TestRMWebServicesAppsModification.java:277)
REGRESSION: org.apache.hadoop.yarn.server.resourcemanager.webapp.TestRMWebServicesAppsModification.testUpdateAppPriority[3]
Error Message:
java.net.BindException: Address already in use
Stack Trace:
com.sun.jersey.test.framework.spi.container.TestContainerException: java.net.BindException: Address already in use
at sun.nio.ch.Net.bind0(Native Method)
at sun.nio.ch.Net.bind(Net.java:444)
at sun.nio.ch.Net.bind(Net.java:436)
at sun.nio.ch.ServerSocketChannelImpl.bind(ServerSocketChannelImpl.java:214)
at sun.nio.ch.ServerSocketAdaptor.bind(ServerSocketAdaptor.java:74)
at org.glassfish.grizzly.nio.transport.TCPNIOTransport.bind(TCPNIOTransport.java:413)
at org.glassfish.grizzly.nio.transport.TCPNIOTransport.bind(TCPNIOTransport.java:384)
at org.glassfish.grizzly.nio.transport.TCPNIOTransport.bind(TCPNIOTransport.java:375)
at org.glassfish.grizzly.http.server.NetworkListener.start(NetworkListener.java:549)
at org.glassfish.grizzly.http.server.HttpServer.start(HttpServer.java:255)
at com.sun.jersey.api.container.grizzly2.GrizzlyServerFactory.createHttpServer(GrizzlyServerFactory.java:326)
at com.sun.jersey.api.container.grizzly2.GrizzlyServerFactory.createHttpServer(GrizzlyServerFactory.java:343)
at com.sun.jersey.test.framework.spi.container.grizzly2.web.GrizzlyWebTestContainerFactory$GrizzlyWebTestContainer.instantiateGrizzlyWebServer(GrizzlyWebTestContainerFactory.java:219)
at com.sun.jersey.test.framework.spi.container.grizzly2.web.GrizzlyWebTestContainerFactory$GrizzlyWebTestContainer.<init>(GrizzlyWebTestContainerFactory.java:129)
at com.sun.jersey.test.framework.spi.container.grizzly2.web.GrizzlyWebTestContainerFactory$GrizzlyWebTestContainer.<init>(GrizzlyWebTestContainerFactory.java:86)
at com.sun.jersey.test.framework.spi.container.grizzly2.web.GrizzlyWebTestContainerFactory.create(GrizzlyWebTestContainerFactory.java:79)
at com.sun.jersey.test.framework.JerseyTest.getContainer(JerseyTest.java:342)
at com.sun.jersey.test.framework.JerseyTest.<init>(JerseyTest.java:217)
at org.apache.hadoop.yarn.webapp.JerseyTestBase.<init>(JerseyTestBase.java:27)
at org.apache.hadoop.yarn.server.resourcemanager.webapp.TestRMWebServicesAppsModification.<init>(TestRMWebServicesAppsModification.java:277)
REGRESSION: org.apache.hadoop.yarn.server.resourcemanager.webapp.TestRMWebServicesAppsModification.testAppSubmitBadJsonAndXML[3]
Error Message:
java.net.BindException: Address already in use
Stack Trace:
com.sun.jersey.test.framework.spi.container.TestContainerException: java.net.BindException: Address already in use
at sun.nio.ch.Net.bind0(Native Method)
at sun.nio.ch.Net.bind(Net.java:444)
at sun.nio.ch.Net.bind(Net.java:436)
at sun.nio.ch.ServerSocketChannelImpl.bind(ServerSocketChannelImpl.java:214)
at sun.nio.ch.ServerSocketAdaptor.bind(ServerSocketAdaptor.java:74)
at org.glassfish.grizzly.nio.transport.TCPNIOTransport.bind(TCPNIOTransport.java:413)
at org.glassfish.grizzly.nio.transport.TCPNIOTransport.bind(TCPNIOTransport.java:384)
at org.glassfish.grizzly.nio.transport.TCPNIOTransport.bind(TCPNIOTransport.java:375)
at org.glassfish.grizzly.http.server.NetworkListener.start(NetworkListener.java:549)
at org.glassfish.grizzly.http.server.HttpServer.start(HttpServer.java:255)
at com.sun.jersey.api.container.grizzly2.GrizzlyServerFactory.createHttpServer(GrizzlyServerFactory.java:326)
at com.sun.jersey.api.container.grizzly2.GrizzlyServerFactory.createHttpServer(GrizzlyServerFactory.java:343)
at com.sun.jersey.test.framework.spi.container.grizzly2.web.GrizzlyWebTestContainerFactory$GrizzlyWebTestContainer.instantiateGrizzlyWebServer(GrizzlyWebTestContainerFactory.java:219)
at com.sun.jersey.test.framework.spi.container.grizzly2.web.GrizzlyWebTestContainerFactory$GrizzlyWebTestContainer.<init>(GrizzlyWebTestContainerFactory.java:129)
at com.sun.jersey.test.framework.spi.container.grizzly2.web.GrizzlyWebTestContainerFactory$GrizzlyWebTestContainer.<init>(GrizzlyWebTestContainerFactory.java:86)
at com.sun.jersey.test.framework.spi.container.grizzly2.web.GrizzlyWebTestContainerFactory.create(GrizzlyWebTestContainerFactory.java:79)
at com.sun.jersey.test.framework.JerseyTest.getContainer(JerseyTest.java:342)
at com.sun.jersey.test.framework.JerseyTest.<init>(JerseyTest.java:217)
at org.apache.hadoop.yarn.webapp.JerseyTestBase.<init>(JerseyTestBase.java:27)
at org.apache.hadoop.yarn.server.resourcemanager.webapp.TestRMWebServicesAppsModification.<init>(TestRMWebServicesAppsModification.java:277)
Failed: YARN-3212 PreCommit Build #9146
Posted by Apache Jenkins Server <je...@builds.apache.org>.
Jira: https://issues.apache.org/jira/browse/YARN-3212
Build: https://builds.apache.org/job/PreCommit-YARN-Build/9146/
###################################################################################
########################## LAST 60 LINES OF THE CONSOLE ###########################
[...truncated 308 lines...]
| +1 | eclipse:eclipse | 0m 34s | The patch built with
| | | | eclipse:eclipse.
| +1 | findbugs | 1m 30s | The patch does not introduce any
| | | | new Findbugs (version 3.0.0)
| | | | warnings.
| -1 | yarn tests | 49m 57s | Tests failed in
| | | | hadoop-yarn-server-resourcemanager.
| | | 90m 17s |
Reason | Tests
Failed unit tests | hadoop.yarn.server.resourcemanager.applicationsmanager.TestAMRestart
| hadoop.yarn.server.resourcemanager.TestRMRestart
| hadoop.yarn.server.resourcemanager.ahs.TestRMApplicationHistoryWriter
Timed out tests | org.apache.hadoop.yarn.server.resourcemanager.applicationsmanager.TestAMRMRPCResponseId
|| Subsystem || Report/Notes ||
============================================================================
| Patch URL | http://issues.apache.org/jira/secure/attachment/12756037/YARN-3212-v6.1.patch |
| Optional Tests | javadoc javac unit findbugs checkstyle |
| git revision | trunk / b2017d9 |
| whitespace | /home/jenkins/jenkins-slave/workspace/PreCommit-YARN-Build/patchprocess/whitespace.txt |
| hadoop-yarn-server-resourcemanager test log | /home/jenkins/jenkins-slave/workspace/PreCommit-YARN-Build/patchprocess/testrun_hadoop-yarn-server-resourcemanager.txt |
| Test Results | https://builds.apache.org/job/PreCommit-YARN-Build/9146/testReport/ |
| Java | 1.7.0_55 |
| uname | Linux asf903.gq1.ygridcore.net 3.13.0-36-lowlatency #63-Ubuntu SMP PREEMPT Wed Sep 3 21:56:12 UTC 2014 x86_64 x86_64 x86_64 GNU/Linux |
============================================================================
============================================================================
Adding comment to JIRA
============================================================================
============================================================================
Comment added.
805a93a92389041354e9168af267bc89703f3254 logged out
============================================================================
============================================================================
Finished build.
============================================================================
============================================================================
Build step 'Execute shell' marked build as failure
Archiving artifacts
Sending artifact delta relative to PreCommit-YARN-Build #9133
Archived 29 artifacts
Archive block size is 32768
Received 78 blocks and 11329868 bytes
Compression is 18.4%
Took 2.3 sec
[description-setter] Could not determine description.
Recording test results
Email was triggered for: Failure
Sending email for trigger: Failure
###################################################################################
############################## FAILED TESTS (if any) ##############################
17 tests failed.
REGRESSION: org.apache.hadoop.yarn.server.resourcemanager.TestRMRestart.testDecomissionedNMsMetricsOnRMRestart[1]
Error Message:
java.util.zip.ZipException: invalid code lengths set
Stack Trace:
java.lang.RuntimeException: java.util.zip.ZipException: invalid code lengths set
at org.apache.hadoop.conf.Configuration.loadResource(Configuration.java:2720)
at org.apache.hadoop.conf.Configuration.loadResources(Configuration.java:2558)
at org.apache.hadoop.conf.Configuration.getProps(Configuration.java:2469)
at org.apache.hadoop.conf.Configuration.set(Configuration.java:1205)
at org.apache.hadoop.conf.Configuration.set(Configuration.java:1177)
at org.apache.hadoop.yarn.server.resourcemanager.ParameterizedSchedulerTestBase.configureFairScheduler(ParameterizedSchedulerTestBase.java:97)
at org.apache.hadoop.yarn.server.resourcemanager.ParameterizedSchedulerTestBase.configureScheduler(ParameterizedSchedulerTestBase.java:75)
at sun.reflect.GeneratedMethodAccessor65.invoke(Unknown Source)
at sun.reflect.DelegatingMethodAccessorImpl.invoke(DelegatingMethodAccessorImpl.java:43)
at java.lang.reflect.Method.invoke(Method.java:606)
at org.junit.runners.model.FrameworkMethod$1.runReflectiveCall(FrameworkMethod.java:47)
at org.junit.internal.runners.model.ReflectiveCallable.run(ReflectiveCallable.java:12)
at org.junit.runners.model.FrameworkMethod.invokeExplosively(FrameworkMethod.java:44)
at org.junit.internal.runners.statements.RunBefores.evaluate(RunBefores.java:24)
at org.junit.internal.runners.statements.RunAfters.evaluate(RunAfters.java:27)
at org.junit.runners.ParentRunner.runLeaf(ParentRunner.java:271)
at org.junit.runners.BlockJUnit4ClassRunner.runChild(BlockJUnit4ClassRunner.java:70)
at org.junit.runners.BlockJUnit4ClassRunner.runChild(BlockJUnit4ClassRunner.java:50)
at org.junit.runners.ParentRunner$3.run(ParentRunner.java:238)
at org.junit.runners.ParentRunner$1.schedule(ParentRunner.java:63)
at org.junit.runners.ParentRunner.runChildren(ParentRunner.java:236)
at org.junit.runners.ParentRunner.access$000(ParentRunner.java:53)
at org.junit.runners.ParentRunner$2.evaluate(ParentRunner.java:229)
at org.junit.runners.ParentRunner.run(ParentRunner.java:309)
at org.junit.runners.Suite.runChild(Suite.java:127)
at org.junit.runners.Suite.runChild(Suite.java:26)
at org.junit.runners.ParentRunner$3.run(ParentRunner.java:238)
at org.junit.runners.ParentRunner$1.schedule(ParentRunner.java:63)
at org.junit.runners.ParentRunner.runChildren(ParentRunner.java:236)
at org.junit.runners.ParentRunner.access$000(ParentRunner.java:53)
at org.junit.runners.ParentRunner$2.evaluate(ParentRunner.java:229)
at org.junit.runners.ParentRunner.run(ParentRunner.java:309)
at org.apache.maven.surefire.junit4.JUnit4Provider.execute(JUnit4Provider.java:264)
at org.apache.maven.surefire.junit4.JUnit4Provider.executeTestSet(JUnit4Provider.java:153)
at org.apache.maven.surefire.junit4.JUnit4Provider.invoke(JUnit4Provider.java:124)
at org.apache.maven.surefire.booter.ForkedBooter.invokeProviderInSameClassLoader(ForkedBooter.java:200)
at org.apache.maven.surefire.booter.ForkedBooter.runSuitesInProcess(ForkedBooter.java:153)
at org.apache.maven.surefire.booter.ForkedBooter.main(ForkedBooter.java:103)
Caused by: java.util.zip.ZipException: invalid code lengths set
at java.util.zip.InflaterInputStream.read(InflaterInputStream.java:164)
at java.util.zip.InflaterInputStream.read(InflaterInputStream.java:122)
at java.io.FilterInputStream.read(FilterInputStream.java:83)
at org.apache.xerces.impl.XMLEntityManager$RewindableInputStream.read(Unknown Source)
at org.apache.xerces.impl.XMLEntityManager.setupCurrentEntity(Unknown Source)
at org.apache.xerces.impl.XMLVersionDetector.determineDocVersion(Unknown Source)
at org.apache.xerces.parsers.XML11Configuration.parse(Unknown Source)
at org.apache.xerces.parsers.XML11Configuration.parse(Unknown Source)
at org.apache.xerces.parsers.XMLParser.parse(Unknown Source)
at org.apache.xerces.parsers.DOMParser.parse(Unknown Source)
at org.apache.xerces.jaxp.DocumentBuilderImpl.parse(Unknown Source)
at javax.xml.parsers.DocumentBuilder.parse(DocumentBuilder.java:150)
at org.apache.hadoop.conf.Configuration.parse(Configuration.java:2546)
at org.apache.hadoop.conf.Configuration.parse(Configuration.java:2534)
at org.apache.hadoop.conf.Configuration.loadResource(Configuration.java:2605)
at org.apache.hadoop.conf.Configuration.loadResources(Configuration.java:2558)
at org.apache.hadoop.conf.Configuration.getProps(Configuration.java:2469)
at org.apache.hadoop.conf.Configuration.set(Configuration.java:1205)
at org.apache.hadoop.conf.Configuration.set(Configuration.java:1177)
at org.apache.hadoop.yarn.server.resourcemanager.ParameterizedSchedulerTestBase.configureFairScheduler(ParameterizedSchedulerTestBase.java:97)
at org.apache.hadoop.yarn.server.resourcemanager.ParameterizedSchedulerTestBase.configureScheduler(ParameterizedSchedulerTestBase.java:75)
at sun.reflect.GeneratedMethodAccessor65.invoke(Unknown Source)
at sun.reflect.DelegatingMethodAccessorImpl.invoke(DelegatingMethodAccessorImpl.java:43)
at java.lang.reflect.Method.invoke(Method.java:606)
at org.junit.runners.model.FrameworkMethod$1.runReflectiveCall(FrameworkMethod.java:47)
at org.junit.internal.runners.model.ReflectiveCallable.run(ReflectiveCallable.java:12)
at org.junit.runners.model.FrameworkMethod.invokeExplosively(FrameworkMethod.java:44)
at org.junit.internal.runners.statements.RunBefores.evaluate(RunBefores.java:24)
at org.junit.internal.runners.statements.RunAfters.evaluate(RunAfters.java:27)
at org.junit.runners.ParentRunner.runLeaf(ParentRunner.java:271)
at org.junit.runners.BlockJUnit4ClassRunner.runChild(BlockJUnit4ClassRunner.java:70)
at org.junit.runners.BlockJUnit4ClassRunner.runChild(BlockJUnit4ClassRunner.java:50)
at org.junit.runners.ParentRunner$3.run(ParentRunner.java:238)
at org.junit.runners.ParentRunner$1.schedule(ParentRunner.java:63)
at org.junit.runners.ParentRunner.runChildren(ParentRunner.java:236)
at org.junit.runners.ParentRunner.access$000(ParentRunner.java:53)
at org.junit.runners.ParentRunner$2.evaluate(ParentRunner.java:229)
at org.junit.runners.ParentRunner.run(ParentRunner.java:309)
at org.junit.runners.Suite.runChild(Suite.java:127)
at org.junit.runners.Suite.runChild(Suite.java:26)
at org.junit.runners.ParentRunner$3.run(ParentRunner.java:238)
at org.junit.runners.ParentRunner$1.schedule(ParentRunner.java:63)
at org.junit.runners.ParentRunner.runChildren(ParentRunner.java:236)
at org.junit.runners.ParentRunner.access$000(ParentRunner.java:53)
at org.junit.runners.ParentRunner$2.evaluate(ParentRunner.java:229)
at org.junit.runners.ParentRunner.run(ParentRunner.java:309)
at org.apache.maven.surefire.junit4.JUnit4Provider.execute(JUnit4Provider.java:264)
at org.apache.maven.surefire.junit4.JUnit4Provider.executeTestSet(JUnit4Provider.java:153)
at org.apache.maven.surefire.junit4.JUnit4Provider.invoke(JUnit4Provider.java:124)
at org.apache.maven.surefire.booter.ForkedBooter.invokeProviderInSameClassLoader(ForkedBooter.java:200)
at org.apache.maven.surefire.booter.ForkedBooter.runSuitesInProcess(ForkedBooter.java:153)
at org.apache.maven.surefire.booter.ForkedBooter.main(ForkedBooter.java:103)
REGRESSION: org.apache.hadoop.yarn.server.resourcemanager.TestRMRestart.testFinishedAppRemovalAfterRMRestart[1]
Error Message:
java.util.zip.ZipException: invalid code lengths set
Stack Trace:
java.lang.RuntimeException: java.util.zip.ZipException: invalid code lengths set
at org.apache.hadoop.conf.Configuration.loadResource(Configuration.java:2720)
at org.apache.hadoop.conf.Configuration.loadResources(Configuration.java:2558)
at org.apache.hadoop.conf.Configuration.getProps(Configuration.java:2469)
at org.apache.hadoop.conf.Configuration.set(Configuration.java:1205)
at org.apache.hadoop.conf.Configuration.set(Configuration.java:1177)
at org.apache.hadoop.yarn.server.resourcemanager.ParameterizedSchedulerTestBase.configureFairScheduler(ParameterizedSchedulerTestBase.java:97)
at org.apache.hadoop.yarn.server.resourcemanager.ParameterizedSchedulerTestBase.configureScheduler(ParameterizedSchedulerTestBase.java:75)
at sun.reflect.GeneratedMethodAccessor65.invoke(Unknown Source)
at sun.reflect.DelegatingMethodAccessorImpl.invoke(DelegatingMethodAccessorImpl.java:43)
at java.lang.reflect.Method.invoke(Method.java:606)
at org.junit.runners.model.FrameworkMethod$1.runReflectiveCall(FrameworkMethod.java:47)
at org.junit.internal.runners.model.ReflectiveCallable.run(ReflectiveCallable.java:12)
at org.junit.runners.model.FrameworkMethod.invokeExplosively(FrameworkMethod.java:44)
at org.junit.internal.runners.statements.RunBefores.evaluate(RunBefores.java:24)
at org.junit.internal.runners.statements.RunAfters.evaluate(RunAfters.java:27)
at org.junit.runners.ParentRunner.runLeaf(ParentRunner.java:271)
at org.junit.runners.BlockJUnit4ClassRunner.runChild(BlockJUnit4ClassRunner.java:70)
at org.junit.runners.BlockJUnit4ClassRunner.runChild(BlockJUnit4ClassRunner.java:50)
at org.junit.runners.ParentRunner$3.run(ParentRunner.java:238)
at org.junit.runners.ParentRunner$1.schedule(ParentRunner.java:63)
at org.junit.runners.ParentRunner.runChildren(ParentRunner.java:236)
at org.junit.runners.ParentRunner.access$000(ParentRunner.java:53)
at org.junit.runners.ParentRunner$2.evaluate(ParentRunner.java:229)
at org.junit.runners.ParentRunner.run(ParentRunner.java:309)
at org.junit.runners.Suite.runChild(Suite.java:127)
at org.junit.runners.Suite.runChild(Suite.java:26)
at org.junit.runners.ParentRunner$3.run(ParentRunner.java:238)
at org.junit.runners.ParentRunner$1.schedule(ParentRunner.java:63)
at org.junit.runners.ParentRunner.runChildren(ParentRunner.java:236)
at org.junit.runners.ParentRunner.access$000(ParentRunner.java:53)
at org.junit.runners.ParentRunner$2.evaluate(ParentRunner.java:229)
at org.junit.runners.ParentRunner.run(ParentRunner.java:309)
at org.apache.maven.surefire.junit4.JUnit4Provider.execute(JUnit4Provider.java:264)
at org.apache.maven.surefire.junit4.JUnit4Provider.executeTestSet(JUnit4Provider.java:153)
at org.apache.maven.surefire.junit4.JUnit4Provider.invoke(JUnit4Provider.java:124)
at org.apache.maven.surefire.booter.ForkedBooter.invokeProviderInSameClassLoader(ForkedBooter.java:200)
at org.apache.maven.surefire.booter.ForkedBooter.runSuitesInProcess(ForkedBooter.java:153)
at org.apache.maven.surefire.booter.ForkedBooter.main(ForkedBooter.java:103)
Caused by: java.util.zip.ZipException: invalid code lengths set
at java.util.zip.InflaterInputStream.read(InflaterInputStream.java:164)
at java.util.zip.InflaterInputStream.read(InflaterInputStream.java:122)
at java.io.FilterInputStream.read(FilterInputStream.java:83)
at org.apache.xerces.impl.XMLEntityManager$RewindableInputStream.read(Unknown Source)
at org.apache.xerces.impl.XMLEntityManager.setupCurrentEntity(Unknown Source)
at org.apache.xerces.impl.XMLVersionDetector.determineDocVersion(Unknown Source)
at org.apache.xerces.parsers.XML11Configuration.parse(Unknown Source)
at org.apache.xerces.parsers.XML11Configuration.parse(Unknown Source)
at org.apache.xerces.parsers.XMLParser.parse(Unknown Source)
at org.apache.xerces.parsers.DOMParser.parse(Unknown Source)
at org.apache.xerces.jaxp.DocumentBuilderImpl.parse(Unknown Source)
at javax.xml.parsers.DocumentBuilder.parse(DocumentBuilder.java:150)
at org.apache.hadoop.conf.Configuration.parse(Configuration.java:2546)
at org.apache.hadoop.conf.Configuration.parse(Configuration.java:2534)
at org.apache.hadoop.conf.Configuration.loadResource(Configuration.java:2605)
at org.apache.hadoop.conf.Configuration.loadResources(Configuration.java:2558)
at org.apache.hadoop.conf.Configuration.getProps(Configuration.java:2469)
at org.apache.hadoop.conf.Configuration.set(Configuration.java:1205)
at org.apache.hadoop.conf.Configuration.set(Configuration.java:1177)
at org.apache.hadoop.yarn.server.resourcemanager.ParameterizedSchedulerTestBase.configureFairScheduler(ParameterizedSchedulerTestBase.java:97)
at org.apache.hadoop.yarn.server.resourcemanager.ParameterizedSchedulerTestBase.configureScheduler(ParameterizedSchedulerTestBase.java:75)
at sun.reflect.GeneratedMethodAccessor65.invoke(Unknown Source)
at sun.reflect.DelegatingMethodAccessorImpl.invoke(DelegatingMethodAccessorImpl.java:43)
at java.lang.reflect.Method.invoke(Method.java:606)
at org.junit.runners.model.FrameworkMethod$1.runReflectiveCall(FrameworkMethod.java:47)
at org.junit.internal.runners.model.ReflectiveCallable.run(ReflectiveCallable.java:12)
at org.junit.runners.model.FrameworkMethod.invokeExplosively(FrameworkMethod.java:44)
at org.junit.internal.runners.statements.RunBefores.evaluate(RunBefores.java:24)
at org.junit.internal.runners.statements.RunAfters.evaluate(RunAfters.java:27)
at org.junit.runners.ParentRunner.runLeaf(ParentRunner.java:271)
at org.junit.runners.BlockJUnit4ClassRunner.runChild(BlockJUnit4ClassRunner.java:70)
at org.junit.runners.BlockJUnit4ClassRunner.runChild(BlockJUnit4ClassRunner.java:50)
at org.junit.runners.ParentRunner$3.run(ParentRunner.java:238)
at org.junit.runners.ParentRunner$1.schedule(ParentRunner.java:63)
at org.junit.runners.ParentRunner.runChildren(ParentRunner.java:236)
at org.junit.runners.ParentRunner.access$000(ParentRunner.java:53)
at org.junit.runners.ParentRunner$2.evaluate(ParentRunner.java:229)
at org.junit.runners.ParentRunner.run(ParentRunner.java:309)
at org.junit.runners.Suite.runChild(Suite.java:127)
at org.junit.runners.Suite.runChild(Suite.java:26)
at org.junit.runners.ParentRunner$3.run(ParentRunner.java:238)
at org.junit.runners.ParentRunner$1.schedule(ParentRunner.java:63)
at org.junit.runners.ParentRunner.runChildren(ParentRunner.java:236)
at org.junit.runners.ParentRunner.access$000(ParentRunner.java:53)
at org.junit.runners.ParentRunner$2.evaluate(ParentRunner.java:229)
at org.junit.runners.ParentRunner.run(ParentRunner.java:309)
at org.apache.maven.surefire.junit4.JUnit4Provider.execute(JUnit4Provider.java:264)
at org.apache.maven.surefire.junit4.JUnit4Provider.executeTestSet(JUnit4Provider.java:153)
at org.apache.maven.surefire.junit4.JUnit4Provider.invoke(JUnit4Provider.java:124)
at org.apache.maven.surefire.booter.ForkedBooter.invokeProviderInSameClassLoader(ForkedBooter.java:200)
at org.apache.maven.surefire.booter.ForkedBooter.runSuitesInProcess(ForkedBooter.java:153)
at org.apache.maven.surefire.booter.ForkedBooter.main(ForkedBooter.java:103)
REGRESSION: org.apache.hadoop.yarn.server.resourcemanager.ahs.TestRMApplicationHistoryWriter.testWriteApplicationAttempt
Error Message:
java.util.zip.ZipException: invalid code lengths set
Stack Trace:
java.lang.RuntimeException: java.util.zip.ZipException: invalid code lengths set
at java.util.zip.InflaterInputStream.read(InflaterInputStream.java:164)
at java.util.zip.InflaterInputStream.read(InflaterInputStream.java:122)
at java.io.FilterInputStream.read(FilterInputStream.java:83)
at org.apache.xerces.impl.XMLEntityManager$RewindableInputStream.read(Unknown Source)
at org.apache.xerces.impl.XMLEntityManager.setupCurrentEntity(Unknown Source)
at org.apache.xerces.impl.XMLVersionDetector.determineDocVersion(Unknown Source)
at org.apache.xerces.parsers.XML11Configuration.parse(Unknown Source)
at org.apache.xerces.parsers.XML11Configuration.parse(Unknown Source)
at org.apache.xerces.parsers.XMLParser.parse(Unknown Source)
at org.apache.xerces.parsers.DOMParser.parse(Unknown Source)
at org.apache.xerces.jaxp.DocumentBuilderImpl.parse(Unknown Source)
at javax.xml.parsers.DocumentBuilder.parse(DocumentBuilder.java:150)
at org.apache.hadoop.conf.Configuration.parse(Configuration.java:2546)
at org.apache.hadoop.conf.Configuration.parse(Configuration.java:2534)
at org.apache.hadoop.conf.Configuration.loadResource(Configuration.java:2605)
at org.apache.hadoop.conf.Configuration.loadResources(Configuration.java:2558)
at org.apache.hadoop.conf.Configuration.getProps(Configuration.java:2469)
at org.apache.hadoop.conf.Configuration.set(Configuration.java:1205)
at org.apache.hadoop.conf.Configuration.set(Configuration.java:1177)
at org.apache.hadoop.conf.Configuration.setBoolean(Configuration.java:1513)
at org.apache.hadoop.yarn.server.resourcemanager.ahs.TestRMApplicationHistoryWriter.setup(TestRMApplicationHistoryWriter.java:83)
REGRESSION: org.apache.hadoop.yarn.server.resourcemanager.ahs.TestRMApplicationHistoryWriter.testWriteApplicationAttempt
Error Message:
null
Stack Trace:
java.lang.NullPointerException: null
at org.apache.hadoop.yarn.server.resourcemanager.ahs.TestRMApplicationHistoryWriter.tearDown(TestRMApplicationHistoryWriter.java:128)
REGRESSION: org.apache.hadoop.yarn.server.resourcemanager.ahs.TestRMApplicationHistoryWriter.testWriteApplication
Error Message:
java.util.zip.ZipException: invalid code lengths set
Stack Trace:
java.lang.RuntimeException: java.util.zip.ZipException: invalid code lengths set
at java.util.zip.InflaterInputStream.read(InflaterInputStream.java:164)
at java.util.zip.InflaterInputStream.read(InflaterInputStream.java:122)
at java.io.FilterInputStream.read(FilterInputStream.java:83)
at org.apache.xerces.impl.XMLEntityManager$RewindableInputStream.read(Unknown Source)
at org.apache.xerces.impl.XMLEntityManager.setupCurrentEntity(Unknown Source)
at org.apache.xerces.impl.XMLVersionDetector.determineDocVersion(Unknown Source)
at org.apache.xerces.parsers.XML11Configuration.parse(Unknown Source)
at org.apache.xerces.parsers.XML11Configuration.parse(Unknown Source)
at org.apache.xerces.parsers.XMLParser.parse(Unknown Source)
at org.apache.xerces.parsers.DOMParser.parse(Unknown Source)
at org.apache.xerces.jaxp.DocumentBuilderImpl.parse(Unknown Source)
at javax.xml.parsers.DocumentBuilder.parse(DocumentBuilder.java:150)
at org.apache.hadoop.conf.Configuration.parse(Configuration.java:2546)
at org.apache.hadoop.conf.Configuration.parse(Configuration.java:2534)
at org.apache.hadoop.conf.Configuration.loadResource(Configuration.java:2605)
at org.apache.hadoop.conf.Configuration.loadResources(Configuration.java:2558)
at org.apache.hadoop.conf.Configuration.getProps(Configuration.java:2469)
at org.apache.hadoop.conf.Configuration.set(Configuration.java:1205)
at org.apache.hadoop.conf.Configuration.set(Configuration.java:1177)
at org.apache.hadoop.conf.Configuration.setBoolean(Configuration.java:1513)
at org.apache.hadoop.yarn.server.resourcemanager.ahs.TestRMApplicationHistoryWriter.setup(TestRMApplicationHistoryWriter.java:83)
REGRESSION: org.apache.hadoop.yarn.server.resourcemanager.ahs.TestRMApplicationHistoryWriter.testWriteApplication
Error Message:
null
Stack Trace:
java.lang.NullPointerException: null
at org.apache.hadoop.yarn.server.resourcemanager.ahs.TestRMApplicationHistoryWriter.tearDown(TestRMApplicationHistoryWriter.java:128)
REGRESSION: org.apache.hadoop.yarn.server.resourcemanager.ahs.TestRMApplicationHistoryWriter.testWriteContainer
Error Message:
java.util.zip.ZipException: invalid code lengths set
Stack Trace:
java.lang.RuntimeException: java.util.zip.ZipException: invalid code lengths set
at java.util.zip.InflaterInputStream.read(InflaterInputStream.java:164)
at java.util.zip.InflaterInputStream.read(InflaterInputStream.java:122)
at java.io.FilterInputStream.read(FilterInputStream.java:83)
at org.apache.xerces.impl.XMLEntityManager$RewindableInputStream.read(Unknown Source)
at org.apache.xerces.impl.XMLEntityManager.setupCurrentEntity(Unknown Source)
at org.apache.xerces.impl.XMLVersionDetector.determineDocVersion(Unknown Source)
at org.apache.xerces.parsers.XML11Configuration.parse(Unknown Source)
at org.apache.xerces.parsers.XML11Configuration.parse(Unknown Source)
at org.apache.xerces.parsers.XMLParser.parse(Unknown Source)
at org.apache.xerces.parsers.DOMParser.parse(Unknown Source)
at org.apache.xerces.jaxp.DocumentBuilderImpl.parse(Unknown Source)
at javax.xml.parsers.DocumentBuilder.parse(DocumentBuilder.java:150)
at org.apache.hadoop.conf.Configuration.parse(Configuration.java:2546)
at org.apache.hadoop.conf.Configuration.parse(Configuration.java:2534)
at org.apache.hadoop.conf.Configuration.loadResource(Configuration.java:2605)
at org.apache.hadoop.conf.Configuration.loadResources(Configuration.java:2558)
at org.apache.hadoop.conf.Configuration.getProps(Configuration.java:2469)
at org.apache.hadoop.conf.Configuration.set(Configuration.java:1205)
at org.apache.hadoop.conf.Configuration.set(Configuration.java:1177)
at org.apache.hadoop.conf.Configuration.setBoolean(Configuration.java:1513)
at org.apache.hadoop.yarn.server.resourcemanager.ahs.TestRMApplicationHistoryWriter.setup(TestRMApplicationHistoryWriter.java:83)
REGRESSION: org.apache.hadoop.yarn.server.resourcemanager.ahs.TestRMApplicationHistoryWriter.testWriteContainer
Error Message:
null
Stack Trace:
java.lang.NullPointerException: null
at org.apache.hadoop.yarn.server.resourcemanager.ahs.TestRMApplicationHistoryWriter.tearDown(TestRMApplicationHistoryWriter.java:128)
REGRESSION: org.apache.hadoop.yarn.server.resourcemanager.ahs.TestRMApplicationHistoryWriter.testRMWritingMassiveHistoryForCapacitySche
Error Message:
java.util.zip.ZipException: invalid code lengths set
Stack Trace:
java.lang.RuntimeException: java.util.zip.ZipException: invalid code lengths set
at java.util.zip.InflaterInputStream.read(InflaterInputStream.java:164)
at java.util.zip.InflaterInputStream.read(InflaterInputStream.java:122)
at java.io.FilterInputStream.read(FilterInputStream.java:83)
at org.apache.xerces.impl.XMLEntityManager$RewindableInputStream.read(Unknown Source)
at org.apache.xerces.impl.XMLEntityManager.setupCurrentEntity(Unknown Source)
at org.apache.xerces.impl.XMLVersionDetector.determineDocVersion(Unknown Source)
at org.apache.xerces.parsers.XML11Configuration.parse(Unknown Source)
at org.apache.xerces.parsers.XML11Configuration.parse(Unknown Source)
at org.apache.xerces.parsers.XMLParser.parse(Unknown Source)
at org.apache.xerces.parsers.DOMParser.parse(Unknown Source)
at org.apache.xerces.jaxp.DocumentBuilderImpl.parse(Unknown Source)
at javax.xml.parsers.DocumentBuilder.parse(DocumentBuilder.java:150)
at org.apache.hadoop.conf.Configuration.parse(Configuration.java:2546)
at org.apache.hadoop.conf.Configuration.parse(Configuration.java:2534)
at org.apache.hadoop.conf.Configuration.loadResource(Configuration.java:2605)
at org.apache.hadoop.conf.Configuration.loadResources(Configuration.java:2558)
at org.apache.hadoop.conf.Configuration.getProps(Configuration.java:2469)
at org.apache.hadoop.conf.Configuration.set(Configuration.java:1205)
at org.apache.hadoop.conf.Configuration.set(Configuration.java:1177)
at org.apache.hadoop.conf.Configuration.setBoolean(Configuration.java:1513)
at org.apache.hadoop.yarn.server.resourcemanager.ahs.TestRMApplicationHistoryWriter.setup(TestRMApplicationHistoryWriter.java:83)
REGRESSION: org.apache.hadoop.yarn.server.resourcemanager.ahs.TestRMApplicationHistoryWriter.testRMWritingMassiveHistoryForCapacitySche
Error Message:
null
Stack Trace:
java.lang.NullPointerException: null
at org.apache.hadoop.yarn.server.resourcemanager.ahs.TestRMApplicationHistoryWriter.tearDown(TestRMApplicationHistoryWriter.java:128)
REGRESSION: org.apache.hadoop.yarn.server.resourcemanager.applicationsmanager.TestAMRestart.testAMBlacklistPreventsRestartOnSameNode
Error Message:
org/apache/hadoop/yarn/factories/RecordFactory
Stack Trace:
java.lang.NoClassDefFoundError: org/apache/hadoop/yarn/factories/RecordFactory
at java.net.URLClassLoader$1.run(URLClassLoader.java:366)
at java.net.URLClassLoader$1.run(URLClassLoader.java:355)
at java.security.AccessController.doPrivileged(Native Method)
at java.net.URLClassLoader.findClass(URLClassLoader.java:354)
at java.lang.ClassLoader.loadClass(ClassLoader.java:425)
at sun.misc.Launcher$AppClassLoader.loadClass(Launcher.java:308)
at java.lang.ClassLoader.loadClass(ClassLoader.java:358)
at java.lang.ClassLoader.defineClass1(Native Method)
at java.lang.ClassLoader.defineClass(ClassLoader.java:800)
at java.security.SecureClassLoader.defineClass(SecureClassLoader.java:142)
at java.net.URLClassLoader.defineClass(URLClassLoader.java:449)
at java.net.URLClassLoader.access$100(URLClassLoader.java:71)
at java.net.URLClassLoader$1.run(URLClassLoader.java:361)
at java.net.URLClassLoader$1.run(URLClassLoader.java:355)
at java.security.AccessController.doPrivileged(Native Method)
at java.net.URLClassLoader.findClass(URLClassLoader.java:354)
at java.lang.ClassLoader.loadClass(ClassLoader.java:425)
at sun.misc.Launcher$AppClassLoader.loadClass(Launcher.java:308)
at java.lang.ClassLoader.loadClass(ClassLoader.java:358)
at java.lang.Class.forName0(Native Method)
at java.lang.Class.forName(Class.java:190)
at org.apache.hadoop.yarn.factory.providers.RecordFactoryProvider.getFactoryClassInstance(RecordFactoryProvider.java:57)
at org.apache.hadoop.yarn.factory.providers.RecordFactoryProvider.getRecordFactory(RecordFactoryProvider.java:52)
at org.apache.hadoop.yarn.util.Records.<clinit>(Records.java:32)
at org.apache.hadoop.yarn.util.resource.Resources.createResource(Resources.java:102)
at org.apache.hadoop.yarn.server.resourcemanager.RMServerUtils.<clinit>(RMServerUtils.java:262)
at org.apache.hadoop.yarn.server.resourcemanager.ResourceManager.serviceInit(ResourceManager.java:215)
at org.apache.hadoop.service.AbstractService.init(AbstractService.java:163)
at org.apache.hadoop.yarn.server.resourcemanager.MockRM.<init>(MockRM.java:120)
at org.apache.hadoop.yarn.server.resourcemanager.MockRM.<init>(MockRM.java:113)
at org.apache.hadoop.yarn.server.resourcemanager.applicationsmanager.TestAMRestart$1.<init>(TestAMRestart.java:384)
at org.apache.hadoop.yarn.server.resourcemanager.applicationsmanager.TestAMRestart.testAMBlacklistPreventsRestartOnSameNode(TestAMRestart.java:384)
REGRESSION: org.apache.hadoop.yarn.server.resourcemanager.applicationsmanager.TestAMRestart.testRMAppAttemptFailuresValidityInterval
Error Message:
Could not initialize class org.apache.hadoop.yarn.server.resourcemanager.RMServerUtils
Stack Trace:
java.lang.NoClassDefFoundError: Could not initialize class org.apache.hadoop.yarn.server.resourcemanager.RMServerUtils
at org.apache.hadoop.yarn.server.resourcemanager.ResourceManager.serviceInit(ResourceManager.java:215)
at org.apache.hadoop.service.AbstractService.init(AbstractService.java:163)
at org.apache.hadoop.yarn.server.resourcemanager.MockRM.<init>(MockRM.java:120)
at org.apache.hadoop.yarn.server.resourcemanager.MockRM.<init>(MockRM.java:113)
at org.apache.hadoop.yarn.server.resourcemanager.applicationsmanager.TestAMRestart.testRMAppAttemptFailuresValidityInterval(TestAMRestart.java:728)
REGRESSION: org.apache.hadoop.yarn.server.resourcemanager.applicationsmanager.TestAMRestart.testShouldNotCountFailureToMaxAttemptRetry
Error Message:
Could not initialize class org.apache.hadoop.yarn.server.resourcemanager.RMServerUtils
Stack Trace:
java.lang.NoClassDefFoundError: Could not initialize class org.apache.hadoop.yarn.server.resourcemanager.RMServerUtils
at org.apache.hadoop.yarn.server.resourcemanager.ResourceManager.serviceInit(ResourceManager.java:215)
at org.apache.hadoop.service.AbstractService.init(AbstractService.java:163)
at org.apache.hadoop.yarn.server.resourcemanager.MockRM.<init>(MockRM.java:120)
at org.apache.hadoop.yarn.server.resourcemanager.MockRM.<init>(MockRM.java:113)
at org.apache.hadoop.yarn.server.resourcemanager.applicationsmanager.TestAMRestart.testShouldNotCountFailureToMaxAttemptRetry(TestAMRestart.java:490)
REGRESSION: org.apache.hadoop.yarn.server.resourcemanager.applicationsmanager.TestAMRestart.testRMRestartOrFailoverNotCountedForAMFailures
Error Message:
Could not initialize class org.apache.hadoop.yarn.server.resourcemanager.RMServerUtils
Stack Trace:
java.lang.NoClassDefFoundError: Could not initialize class org.apache.hadoop.yarn.server.resourcemanager.RMServerUtils
at org.apache.hadoop.yarn.server.resourcemanager.ResourceManager.serviceInit(ResourceManager.java:215)
at org.apache.hadoop.service.AbstractService.init(AbstractService.java:163)
at org.apache.hadoop.yarn.server.resourcemanager.MockRM.<init>(MockRM.java:120)
at org.apache.hadoop.yarn.server.resourcemanager.MockRM.<init>(MockRM.java:113)
at org.apache.hadoop.yarn.server.resourcemanager.applicationsmanager.TestAMRestart.testRMRestartOrFailoverNotCountedForAMFailures(TestAMRestart.java:667)
REGRESSION: org.apache.hadoop.yarn.server.resourcemanager.applicationsmanager.TestAMRestart.testPreemptedAMRestartOnRMRestart
Error Message:
Could not initialize class org.apache.hadoop.yarn.server.resourcemanager.RMServerUtils
Stack Trace:
java.lang.NoClassDefFoundError: Could not initialize class org.apache.hadoop.yarn.server.resourcemanager.RMServerUtils
at org.apache.hadoop.yarn.server.resourcemanager.ResourceManager.serviceInit(ResourceManager.java:215)
at org.apache.hadoop.service.AbstractService.init(AbstractService.java:163)
at org.apache.hadoop.yarn.server.resourcemanager.MockRM.<init>(MockRM.java:120)
at org.apache.hadoop.yarn.server.resourcemanager.MockRM.<init>(MockRM.java:113)
at org.apache.hadoop.yarn.server.resourcemanager.applicationsmanager.TestAMRestart.testPreemptedAMRestartOnRMRestart(TestAMRestart.java:600)
REGRESSION: org.apache.hadoop.yarn.server.resourcemanager.applicationsmanager.TestAMRestart.testAMRestartWithExistingContainers
Error Message:
Could not initialize class org.apache.hadoop.yarn.server.resourcemanager.RMServerUtils
Stack Trace:
java.lang.NoClassDefFoundError: Could not initialize class org.apache.hadoop.yarn.server.resourcemanager.RMServerUtils
at org.apache.hadoop.yarn.server.resourcemanager.ResourceManager.serviceInit(ResourceManager.java:215)
at org.apache.hadoop.service.AbstractService.init(AbstractService.java:163)
at org.apache.hadoop.yarn.server.resourcemanager.MockRM.<init>(MockRM.java:120)
at org.apache.hadoop.yarn.server.resourcemanager.MockRM.<init>(MockRM.java:113)
at org.apache.hadoop.yarn.server.resourcemanager.MockRM.<init>(MockRM.java:109)
at org.apache.hadoop.yarn.server.resourcemanager.applicationsmanager.TestAMRestart.testAMRestartWithExistingContainers(TestAMRestart.java:77)
REGRESSION: org.apache.hadoop.yarn.server.resourcemanager.applicationsmanager.TestAMRestart.testNMTokensRebindOnAMRestart
Error Message:
Could not initialize class org.apache.hadoop.yarn.server.resourcemanager.RMServerUtils
Stack Trace:
java.lang.NoClassDefFoundError: Could not initialize class org.apache.hadoop.yarn.server.resourcemanager.RMServerUtils
at org.apache.hadoop.yarn.server.resourcemanager.ResourceManager.serviceInit(ResourceManager.java:215)
at org.apache.hadoop.service.AbstractService.init(AbstractService.java:163)
at org.apache.hadoop.yarn.server.resourcemanager.MockRM.<init>(MockRM.java:120)
at org.apache.hadoop.yarn.server.resourcemanager.MockRM.<init>(MockRM.java:113)
at org.apache.hadoop.yarn.server.resourcemanager.MockRM.<init>(MockRM.java:109)
at org.apache.hadoop.yarn.server.resourcemanager.applicationsmanager.TestAMRestart.testNMTokensRebindOnAMRestart(TestAMRestart.java:281)