You are viewing a plain text version of this content. The canonical link for it is here.
Posted to builds@solr.apache.org by Apache Jenkins Server <je...@builds.apache.org> on 2023/08/22 04:56:01 UTC
[JENKINS] Solr » Solr-Check-main-s390x - Build # 337 - Failure!
Build: https://ci-builds.apache.org/job/Solr/job/Solr-Check-main-s390x/337/
No tests ran.
Build Log:
[...truncated 1482 lines...]
BUILD FAILED in 8m 38s
253 actionable tasks: 253 executed
Publishing build scan...
https://ge.apache.org/s/ssctstxca34rk
Build step 'Invoke Gradle script' changed build result to FAILURE
Build step 'Invoke Gradle script' marked build as failure
Archiving artifacts
Recording test results
ERROR: Step ‘Publish JUnit test result report’ failed: No test report files were found. Configuration error?
Email was triggered for: Failure - Any
Sending email for trigger: Failure - Any
[JENKINS] Solr » Solr-Check-main-s390x - Build # 341 - Failure!
Posted by Apache Jenkins Server <je...@builds.apache.org>.
Build: https://ci-builds.apache.org/job/Solr/job/Solr-Check-main-s390x/341/
No tests ran.
Build Log:
[...truncated 1498 lines...]
BUILD FAILED in 9m
253 actionable tasks: 253 executed
Publishing build scan...
https://ge.apache.org/s/mr6ucttdywd6i
Build step 'Invoke Gradle script' changed build result to FAILURE
Build step 'Invoke Gradle script' marked build as failure
Archiving artifacts
Recording test results
ERROR: Step ‘Publish JUnit test result report’ failed: No test report files were found. Configuration error?
Email was triggered for: Failure - Any
Sending email for trigger: Failure - Any
[JENKINS] Solr » Solr-Check-main-s390x - Build # 340 - Still Unstable!
Posted by Apache Jenkins Server <je...@builds.apache.org>.
Build: https://ci-builds.apache.org/job/Solr/job/Solr-Check-main-s390x/340/
19 tests failed.
FAILED: org.apache.solr.cloud.DistributedQueueTest.testPeekElements
Error Message:
java.lang.AssertionError: Time was 2725ms, expected 250-1500ms
Stack Trace:
java.lang.AssertionError: Time was 2725ms, expected 250-1500ms
at __randomizedtesting.SeedInfo.seed([FC377411B7D025DA:119CE3067E971C7]:0)
at org.junit.Assert.fail(Assert.java:89)
at org.junit.Assert.assertTrue(Assert.java:42)
at org.apache.solr.cloud.DistributedQueueTest.testPeekElements(DistributedQueueTest.java:287)
at java.base/jdk.internal.reflect.NativeMethodAccessorImpl.invoke0(Native Method)
at java.base/jdk.internal.reflect.NativeMethodAccessorImpl.invoke(NativeMethodAccessorImpl.java:62)
at java.base/jdk.internal.reflect.DelegatingMethodAccessorImpl.invoke(DelegatingMethodAccessorImpl.java:43)
at java.base/java.lang.reflect.Method.invoke(Method.java:566)
at com.carrotsearch.randomizedtesting.RandomizedRunner.invoke(RandomizedRunner.java:1758)
at com.carrotsearch.randomizedtesting.RandomizedRunner$8.evaluate(RandomizedRunner.java:946)
at com.carrotsearch.randomizedtesting.RandomizedRunner$9.evaluate(RandomizedRunner.java:982)
at com.carrotsearch.randomizedtesting.RandomizedRunner$10.evaluate(RandomizedRunner.java:996)
at com.carrotsearch.randomizedtesting.rules.SystemPropertiesRestoreRule$1.evaluate(SystemPropertiesRestoreRule.java:80)
at org.junit.rules.RunRules.evaluate(RunRules.java:20)
at org.apache.lucene.tests.util.TestRuleSetupTeardownChained$1.evaluate(TestRuleSetupTeardownChained.java:48)
at org.apache.lucene.tests.util.AbstractBeforeAfterRule$1.evaluate(AbstractBeforeAfterRule.java:43)
at org.apache.lucene.tests.util.TestRuleThreadAndTestName$1.evaluate(TestRuleThreadAndTestName.java:45)
at org.apache.lucene.tests.util.TestRuleIgnoreAfterMaxFailures$1.evaluate(TestRuleIgnoreAfterMaxFailures.java:60)
at org.apache.lucene.tests.util.TestRuleMarkFailure$1.evaluate(TestRuleMarkFailure.java:44)
at org.junit.rules.RunRules.evaluate(RunRules.java:20)
at com.carrotsearch.randomizedtesting.rules.StatementAdapter.evaluate(StatementAdapter.java:36)
at com.carrotsearch.randomizedtesting.ThreadLeakControl$StatementRunner.run(ThreadLeakControl.java:390)
at com.carrotsearch.randomizedtesting.ThreadLeakControl.forkTimeoutingTask(ThreadLeakControl.java:843)
at com.carrotsearch.randomizedtesting.ThreadLeakControl$3.evaluate(ThreadLeakControl.java:490)
at com.carrotsearch.randomizedtesting.RandomizedRunner.runSingleTest(RandomizedRunner.java:955)
at com.carrotsearch.randomizedtesting.RandomizedRunner$5.evaluate(RandomizedRunner.java:840)
at com.carrotsearch.randomizedtesting.RandomizedRunner$6.evaluate(RandomizedRunner.java:891)
at com.carrotsearch.randomizedtesting.RandomizedRunner$7.evaluate(RandomizedRunner.java:902)
at com.carrotsearch.randomizedtesting.rules.StatementAdapter.evaluate(StatementAdapter.java:36)
at com.carrotsearch.randomizedtesting.rules.StatementAdapter.evaluate(StatementAdapter.java:36)
at org.apache.lucene.tests.util.AbstractBeforeAfterRule$1.evaluate(AbstractBeforeAfterRule.java:43)
at com.carrotsearch.randomizedtesting.rules.SystemPropertiesRestoreRule$1.evaluate(SystemPropertiesRestoreRule.java:80)
at org.junit.rules.RunRules.evaluate(RunRules.java:20)
at org.apache.lucene.tests.util.AbstractBeforeAfterRule$1.evaluate(AbstractBeforeAfterRule.java:43)
at com.carrotsearch.randomizedtesting.rules.StatementAdapter.evaluate(StatementAdapter.java:36)
at org.apache.lucene.tests.util.TestRuleStoreClassName$1.evaluate(TestRuleStoreClassName.java:38)
at com.carrotsearch.randomizedtesting.rules.NoShadowingOrOverridesOnMethodsRule$1.evaluate(NoShadowingOrOverridesOnMethodsRule.java:40)
at com.carrotsearch.randomizedtesting.rules.NoShadowingOrOverridesOnMethodsRule$1.evaluate(NoShadowingOrOverridesOnMethodsRule.java:40)
at com.carrotsearch.randomizedtesting.rules.StatementAdapter.evaluate(StatementAdapter.java:36)
at com.carrotsearch.randomizedtesting.rules.StatementAdapter.evaluate(StatementAdapter.java:36)
at org.apache.lucene.tests.util.TestRuleAssertionsRequired$1.evaluate(TestRuleAssertionsRequired.java:53)
at org.apache.lucene.tests.util.AbstractBeforeAfterRule$1.evaluate(AbstractBeforeAfterRule.java:43)
at org.apache.lucene.tests.util.TestRuleMarkFailure$1.evaluate(TestRuleMarkFailure.java:44)
at org.apache.lucene.tests.util.TestRuleIgnoreAfterMaxFailures$1.evaluate(TestRuleIgnoreAfterMaxFailures.java:60)
at org.apache.lucene.tests.util.TestRuleIgnoreTestSuites$1.evaluate(TestRuleIgnoreTestSuites.java:47)
at org.junit.rules.RunRules.evaluate(RunRules.java:20)
at com.carrotsearch.randomizedtesting.rules.StatementAdapter.evaluate(StatementAdapter.java:36)
at com.carrotsearch.randomizedtesting.ThreadLeakControl$StatementRunner.run(ThreadLeakControl.java:390)
at com.carrotsearch.randomizedtesting.ThreadLeakControl.lambda$forkTimeoutingTask$0(ThreadLeakControl.java:850)
at java.base/java.lang.Thread.run(Thread.java:829)
FAILED: org.apache.solr.cloud.HttpPartitionOnCommitTest.test
Error Message:
org.apache.solr.client.solrj.impl.BaseHttpSolrClient$RemoteSolrException: Error from server at http://127.0.0.1:45025/solr: Underlying core creation failed while creating collection: control_collection
Stack Trace:
org.apache.solr.client.solrj.impl.BaseHttpSolrClient$RemoteSolrException: Error from server at http://127.0.0.1:45025/solr: Underlying core creation failed while creating collection: control_collection
at __randomizedtesting.SeedInfo.seed([FC377411B7D025DA:74634BCB192C4822]:0)
at app//org.apache.solr.client.solrj.impl.HttpSolrClient.executeMethod(HttpSolrClient.java:738)
at app//org.apache.solr.client.solrj.impl.HttpSolrClient.request(HttpSolrClient.java:254)
at app//org.apache.solr.client.solrj.impl.HttpSolrClient.request(HttpSolrClient.java:235)
at app//org.apache.solr.client.solrj.impl.LBSolrClient.doRequest(LBSolrClient.java:386)
at app//org.apache.solr.client.solrj.impl.LBSolrClient.request(LBSolrClient.java:352)
at app//org.apache.solr.client.solrj.impl.CloudSolrClient.sendRequest(CloudSolrClient.java:1140)
at app//org.apache.solr.client.solrj.impl.CloudSolrClient.requestWithRetryOnStaleState(CloudSolrClient.java:839)
at app//org.apache.solr.client.solrj.impl.CloudSolrClient.request(CloudSolrClient.java:767)
at app//org.apache.solr.client.solrj.SolrRequest.process(SolrRequest.java:234)
at app//org.apache.solr.client.solrj.SolrRequest.process(SolrRequest.java:249)
at app//org.apache.solr.cloud.AbstractFullDistribZkTestBase.createServers(AbstractFullDistribZkTestBase.java:353)
at app//org.apache.solr.BaseDistributedSearchTestCase$ShardsRepeatRule$ShardsFixedStatement.callStatement(BaseDistributedSearchTestCase.java:1077)
at app//org.apache.solr.BaseDistributedSearchTestCase$ShardsRepeatRule$ShardsStatement.evaluate(BaseDistributedSearchTestCase.java:1050)
at app//com.carrotsearch.randomizedtesting.rules.SystemPropertiesRestoreRule$1.evaluate(SystemPropertiesRestoreRule.java:80)
at app//org.junit.rules.RunRules.evaluate(RunRules.java:20)
at app//org.apache.lucene.tests.util.TestRuleSetupTeardownChained$1.evaluate(TestRuleSetupTeardownChained.java:48)
at app//org.apache.lucene.tests.util.AbstractBeforeAfterRule$1.evaluate(AbstractBeforeAfterRule.java:43)
at app//org.apache.lucene.tests.util.TestRuleThreadAndTestName$1.evaluate(TestRuleThreadAndTestName.java:45)
at app//org.apache.lucene.tests.util.TestRuleIgnoreAfterMaxFailures$1.evaluate(TestRuleIgnoreAfterMaxFailures.java:60)
at app//org.apache.lucene.tests.util.TestRuleMarkFailure$1.evaluate(TestRuleMarkFailure.java:44)
at app//org.junit.rules.RunRules.evaluate(RunRules.java:20)
at app//com.carrotsearch.randomizedtesting.rules.StatementAdapter.evaluate(StatementAdapter.java:36)
at app//com.carrotsearch.randomizedtesting.ThreadLeakControl$StatementRunner.run(ThreadLeakControl.java:390)
at app//com.carrotsearch.randomizedtesting.ThreadLeakControl.forkTimeoutingTask(ThreadLeakControl.java:843)
at app//com.carrotsearch.randomizedtesting.ThreadLeakControl$3.evaluate(ThreadLeakControl.java:490)
at app//com.carrotsearch.randomizedtesting.RandomizedRunner.runSingleTest(RandomizedRunner.java:955)
at app//com.carrotsearch.randomizedtesting.RandomizedRunner$5.evaluate(RandomizedRunner.java:840)
at app//com.carrotsearch.randomizedtesting.RandomizedRunner$6.evaluate(RandomizedRunner.java:891)
at app//com.carrotsearch.randomizedtesting.RandomizedRunner$7.evaluate(RandomizedRunner.java:902)
at app//com.carrotsearch.randomizedtesting.rules.StatementAdapter.evaluate(StatementAdapter.java:36)
at app//com.carrotsearch.randomizedtesting.rules.StatementAdapter.evaluate(StatementAdapter.java:36)
at app//org.apache.lucene.tests.util.AbstractBeforeAfterRule$1.evaluate(AbstractBeforeAfterRule.java:43)
at app//com.carrotsearch.randomizedtesting.rules.SystemPropertiesRestoreRule$1.evaluate(SystemPropertiesRestoreRule.java:80)
at app//org.junit.rules.RunRules.evaluate(RunRules.java:20)
at app//org.apache.lucene.tests.util.AbstractBeforeAfterRule$1.evaluate(AbstractBeforeAfterRule.java:43)
at app//com.carrotsearch.randomizedtesting.rules.StatementAdapter.evaluate(StatementAdapter.java:36)
at app//org.apache.lucene.tests.util.TestRuleStoreClassName$1.evaluate(TestRuleStoreClassName.java:38)
at app//com.carrotsearch.randomizedtesting.rules.NoShadowingOrOverridesOnMethodsRule$1.evaluate(NoShadowingOrOverridesOnMethodsRule.java:40)
at app//com.carrotsearch.randomizedtesting.rules.NoShadowingOrOverridesOnMethodsRule$1.evaluate(NoShadowingOrOverridesOnMethodsRule.java:40)
at app//com.carrotsearch.randomizedtesting.rules.StatementAdapter.evaluate(StatementAdapter.java:36)
at app//com.carrotsearch.randomizedtesting.rules.StatementAdapter.evaluate(StatementAdapter.java:36)
at app//org.apache.lucene.tests.util.TestRuleAssertionsRequired$1.evaluate(TestRuleAssertionsRequired.java:53)
at app//org.apache.lucene.tests.util.AbstractBeforeAfterRule$1.evaluate(AbstractBeforeAfterRule.java:43)
at app//org.apache.lucene.tests.util.TestRuleMarkFailure$1.evaluate(TestRuleMarkFailure.java:44)
at app//org.apache.lucene.tests.util.TestRuleIgnoreAfterMaxFailures$1.evaluate(TestRuleIgnoreAfterMaxFailures.java:60)
at app//org.apache.lucene.tests.util.TestRuleIgnoreTestSuites$1.evaluate(TestRuleIgnoreTestSuites.java:47)
at app//org.junit.rules.RunRules.evaluate(RunRules.java:20)
at app//com.carrotsearch.randomizedtesting.rules.StatementAdapter.evaluate(StatementAdapter.java:36)
at app//com.carrotsearch.randomizedtesting.ThreadLeakControl$StatementRunner.run(ThreadLeakControl.java:390)
at app//com.carrotsearch.randomizedtesting.ThreadLeakControl.lambda$forkTimeoutingTask$0(ThreadLeakControl.java:850)
at java.base@11.0.16.1/java.lang.Thread.run(Thread.java:829)
FAILED: org.apache.solr.cloud.MoveReplicaTest.test
Error Message:
org.apache.solr.client.solrj.impl.BaseHttpSolrClient$RemoteSolrException: Error from server at http://127.0.0.1:33473/solr: ADDREPLICA failed to create replica
Stack Trace:
org.apache.solr.client.solrj.impl.BaseHttpSolrClient$RemoteSolrException: Error from server at http://127.0.0.1:33473/solr: ADDREPLICA failed to create replica
at __randomizedtesting.SeedInfo.seed([FC377411B7D025DA:74634BCB192C4822]:0)
at app//org.apache.solr.client.solrj.impl.HttpSolrClient.executeMethod(HttpSolrClient.java:738)
at app//org.apache.solr.client.solrj.impl.HttpSolrClient.request(HttpSolrClient.java:254)
at app//org.apache.solr.client.solrj.impl.HttpSolrClient.request(HttpSolrClient.java:235)
at app//org.apache.solr.client.solrj.impl.LBSolrClient.doRequest(LBSolrClient.java:386)
at app//org.apache.solr.client.solrj.impl.LBSolrClient.request(LBSolrClient.java:352)
at app//org.apache.solr.client.solrj.impl.CloudSolrClient.sendRequest(CloudSolrClient.java:1140)
at app//org.apache.solr.client.solrj.impl.CloudSolrClient.requestWithRetryOnStaleState(CloudSolrClient.java:839)
at app//org.apache.solr.client.solrj.impl.CloudSolrClient.request(CloudSolrClient.java:767)
at app//org.apache.solr.client.solrj.SolrRequest.process(SolrRequest.java:234)
at app//org.apache.solr.client.solrj.SolrRequest.process(SolrRequest.java:249)
at app//org.apache.solr.cloud.AbstractMoveReplicaTestBase.test(AbstractMoveReplicaTestBase.java:216)
at app//org.apache.solr.cloud.MoveReplicaTest.test(MoveReplicaTest.java:31)
at java.base@11.0.16.1/jdk.internal.reflect.NativeMethodAccessorImpl.invoke0(Native Method)
at java.base@11.0.16.1/jdk.internal.reflect.NativeMethodAccessorImpl.invoke(NativeMethodAccessorImpl.java:62)
at java.base@11.0.16.1/jdk.internal.reflect.DelegatingMethodAccessorImpl.invoke(DelegatingMethodAccessorImpl.java:43)
at java.base@11.0.16.1/java.lang.reflect.Method.invoke(Method.java:566)
at app//com.carrotsearch.randomizedtesting.RandomizedRunner.invoke(RandomizedRunner.java:1758)
at app//com.carrotsearch.randomizedtesting.RandomizedRunner$8.evaluate(RandomizedRunner.java:946)
at app//com.carrotsearch.randomizedtesting.RandomizedRunner$9.evaluate(RandomizedRunner.java:982)
at app//com.carrotsearch.randomizedtesting.RandomizedRunner$10.evaluate(RandomizedRunner.java:996)
at app//com.carrotsearch.randomizedtesting.rules.SystemPropertiesRestoreRule$1.evaluate(SystemPropertiesRestoreRule.java:80)
at app//org.junit.rules.RunRules.evaluate(RunRules.java:20)
at app//org.apache.lucene.tests.util.TestRuleSetupTeardownChained$1.evaluate(TestRuleSetupTeardownChained.java:48)
at app//org.apache.lucene.tests.util.AbstractBeforeAfterRule$1.evaluate(AbstractBeforeAfterRule.java:43)
at app//org.apache.lucene.tests.util.TestRuleThreadAndTestName$1.evaluate(TestRuleThreadAndTestName.java:45)
at app//org.apache.lucene.tests.util.TestRuleIgnoreAfterMaxFailures$1.evaluate(TestRuleIgnoreAfterMaxFailures.java:60)
at app//org.apache.lucene.tests.util.TestRuleMarkFailure$1.evaluate(TestRuleMarkFailure.java:44)
at app//org.junit.rules.RunRules.evaluate(RunRules.java:20)
at app//com.carrotsearch.randomizedtesting.rules.StatementAdapter.evaluate(StatementAdapter.java:36)
at app//com.carrotsearch.randomizedtesting.ThreadLeakControl$StatementRunner.run(ThreadLeakControl.java:390)
at app//com.carrotsearch.randomizedtesting.ThreadLeakControl.forkTimeoutingTask(ThreadLeakControl.java:843)
at app//com.carrotsearch.randomizedtesting.ThreadLeakControl$3.evaluate(ThreadLeakControl.java:490)
at app//com.carrotsearch.randomizedtesting.RandomizedRunner.runSingleTest(RandomizedRunner.java:955)
at app//com.carrotsearch.randomizedtesting.RandomizedRunner$5.evaluate(RandomizedRunner.java:840)
at app//com.carrotsearch.randomizedtesting.RandomizedRunner$6.evaluate(RandomizedRunner.java:891)
at app//com.carrotsearch.randomizedtesting.RandomizedRunner$7.evaluate(RandomizedRunner.java:902)
at app//com.carrotsearch.randomizedtesting.rules.StatementAdapter.evaluate(StatementAdapter.java:36)
at app//com.carrotsearch.randomizedtesting.rules.StatementAdapter.evaluate(StatementAdapter.java:36)
at app//org.apache.lucene.tests.util.AbstractBeforeAfterRule$1.evaluate(AbstractBeforeAfterRule.java:43)
at app//com.carrotsearch.randomizedtesting.rules.SystemPropertiesRestoreRule$1.evaluate(SystemPropertiesRestoreRule.java:80)
at app//org.junit.rules.RunRules.evaluate(RunRules.java:20)
at app//org.apache.lucene.tests.util.AbstractBeforeAfterRule$1.evaluate(AbstractBeforeAfterRule.java:43)
at app//com.carrotsearch.randomizedtesting.rules.StatementAdapter.evaluate(StatementAdapter.java:36)
at app//org.apache.lucene.tests.util.TestRuleStoreClassName$1.evaluate(TestRuleStoreClassName.java:38)
at app//com.carrotsearch.randomizedtesting.rules.NoShadowingOrOverridesOnMethodsRule$1.evaluate(NoShadowingOrOverridesOnMethodsRule.java:40)
at app//com.carrotsearch.randomizedtesting.rules.NoShadowingOrOverridesOnMethodsRule$1.evaluate(NoShadowingOrOverridesOnMethodsRule.java:40)
at app//com.carrotsearch.randomizedtesting.rules.StatementAdapter.evaluate(StatementAdapter.java:36)
at app//com.carrotsearch.randomizedtesting.rules.StatementAdapter.evaluate(StatementAdapter.java:36)
at app//org.apache.lucene.tests.util.TestRuleAssertionsRequired$1.evaluate(TestRuleAssertionsRequired.java:53)
at app//org.apache.lucene.tests.util.AbstractBeforeAfterRule$1.evaluate(AbstractBeforeAfterRule.java:43)
at app//org.apache.lucene.tests.util.TestRuleMarkFailure$1.evaluate(TestRuleMarkFailure.java:44)
at app//org.apache.lucene.tests.util.TestRuleIgnoreAfterMaxFailures$1.evaluate(TestRuleIgnoreAfterMaxFailures.java:60)
at app//org.apache.lucene.tests.util.TestRuleIgnoreTestSuites$1.evaluate(TestRuleIgnoreTestSuites.java:47)
at app//org.junit.rules.RunRules.evaluate(RunRules.java:20)
at app//com.carrotsearch.randomizedtesting.rules.StatementAdapter.evaluate(StatementAdapter.java:36)
at app//com.carrotsearch.randomizedtesting.ThreadLeakControl$StatementRunner.run(ThreadLeakControl.java:390)
at app//com.carrotsearch.randomizedtesting.ThreadLeakControl.lambda$forkTimeoutingTask$0(ThreadLeakControl.java:850)
at java.base@11.0.16.1/java.lang.Thread.run(Thread.java:829)
FAILED: org.apache.solr.cloud.OverseerTaskQueueTest.testPeekElements
Error Message:
java.lang.AssertionError: Time was 2167ms, expected 250-1500ms
Stack Trace:
java.lang.AssertionError: Time was 2167ms, expected 250-1500ms
at __randomizedtesting.SeedInfo.seed([FC377411B7D025DA:119CE3067E971C7]:0)
at org.junit.Assert.fail(Assert.java:89)
at org.junit.Assert.assertTrue(Assert.java:42)
at org.apache.solr.cloud.DistributedQueueTest.testPeekElements(DistributedQueueTest.java:287)
at java.base/jdk.internal.reflect.NativeMethodAccessorImpl.invoke0(Native Method)
at java.base/jdk.internal.reflect.NativeMethodAccessorImpl.invoke(NativeMethodAccessorImpl.java:62)
at java.base/jdk.internal.reflect.DelegatingMethodAccessorImpl.invoke(DelegatingMethodAccessorImpl.java:43)
at java.base/java.lang.reflect.Method.invoke(Method.java:566)
at com.carrotsearch.randomizedtesting.RandomizedRunner.invoke(RandomizedRunner.java:1758)
at com.carrotsearch.randomizedtesting.RandomizedRunner$8.evaluate(RandomizedRunner.java:946)
at com.carrotsearch.randomizedtesting.RandomizedRunner$9.evaluate(RandomizedRunner.java:982)
at com.carrotsearch.randomizedtesting.RandomizedRunner$10.evaluate(RandomizedRunner.java:996)
at com.carrotsearch.randomizedtesting.rules.SystemPropertiesRestoreRule$1.evaluate(SystemPropertiesRestoreRule.java:80)
at org.junit.rules.RunRules.evaluate(RunRules.java:20)
at org.apache.lucene.tests.util.TestRuleSetupTeardownChained$1.evaluate(TestRuleSetupTeardownChained.java:48)
at org.apache.lucene.tests.util.AbstractBeforeAfterRule$1.evaluate(AbstractBeforeAfterRule.java:43)
at org.apache.lucene.tests.util.TestRuleThreadAndTestName$1.evaluate(TestRuleThreadAndTestName.java:45)
at org.apache.lucene.tests.util.TestRuleIgnoreAfterMaxFailures$1.evaluate(TestRuleIgnoreAfterMaxFailures.java:60)
at org.apache.lucene.tests.util.TestRuleMarkFailure$1.evaluate(TestRuleMarkFailure.java:44)
at org.junit.rules.RunRules.evaluate(RunRules.java:20)
at com.carrotsearch.randomizedtesting.rules.StatementAdapter.evaluate(StatementAdapter.java:36)
at com.carrotsearch.randomizedtesting.ThreadLeakControl$StatementRunner.run(ThreadLeakControl.java:390)
at com.carrotsearch.randomizedtesting.ThreadLeakControl.forkTimeoutingTask(ThreadLeakControl.java:843)
at com.carrotsearch.randomizedtesting.ThreadLeakControl$3.evaluate(ThreadLeakControl.java:490)
at com.carrotsearch.randomizedtesting.RandomizedRunner.runSingleTest(RandomizedRunner.java:955)
at com.carrotsearch.randomizedtesting.RandomizedRunner$5.evaluate(RandomizedRunner.java:840)
at com.carrotsearch.randomizedtesting.RandomizedRunner$6.evaluate(RandomizedRunner.java:891)
at com.carrotsearch.randomizedtesting.RandomizedRunner$7.evaluate(RandomizedRunner.java:902)
at com.carrotsearch.randomizedtesting.rules.StatementAdapter.evaluate(StatementAdapter.java:36)
at com.carrotsearch.randomizedtesting.rules.StatementAdapter.evaluate(StatementAdapter.java:36)
at org.apache.lucene.tests.util.AbstractBeforeAfterRule$1.evaluate(AbstractBeforeAfterRule.java:43)
at com.carrotsearch.randomizedtesting.rules.SystemPropertiesRestoreRule$1.evaluate(SystemPropertiesRestoreRule.java:80)
at org.junit.rules.RunRules.evaluate(RunRules.java:20)
at org.apache.lucene.tests.util.AbstractBeforeAfterRule$1.evaluate(AbstractBeforeAfterRule.java:43)
at com.carrotsearch.randomizedtesting.rules.StatementAdapter.evaluate(StatementAdapter.java:36)
at org.apache.lucene.tests.util.TestRuleStoreClassName$1.evaluate(TestRuleStoreClassName.java:38)
at com.carrotsearch.randomizedtesting.rules.NoShadowingOrOverridesOnMethodsRule$1.evaluate(NoShadowingOrOverridesOnMethodsRule.java:40)
at com.carrotsearch.randomizedtesting.rules.NoShadowingOrOverridesOnMethodsRule$1.evaluate(NoShadowingOrOverridesOnMethodsRule.java:40)
at com.carrotsearch.randomizedtesting.rules.StatementAdapter.evaluate(StatementAdapter.java:36)
at com.carrotsearch.randomizedtesting.rules.StatementAdapter.evaluate(StatementAdapter.java:36)
at org.apache.lucene.tests.util.TestRuleAssertionsRequired$1.evaluate(TestRuleAssertionsRequired.java:53)
at org.apache.lucene.tests.util.AbstractBeforeAfterRule$1.evaluate(AbstractBeforeAfterRule.java:43)
at org.apache.lucene.tests.util.TestRuleMarkFailure$1.evaluate(TestRuleMarkFailure.java:44)
at org.apache.lucene.tests.util.TestRuleIgnoreAfterMaxFailures$1.evaluate(TestRuleIgnoreAfterMaxFailures.java:60)
at org.apache.lucene.tests.util.TestRuleIgnoreTestSuites$1.evaluate(TestRuleIgnoreTestSuites.java:47)
at org.junit.rules.RunRules.evaluate(RunRules.java:20)
at com.carrotsearch.randomizedtesting.rules.StatementAdapter.evaluate(StatementAdapter.java:36)
at com.carrotsearch.randomizedtesting.ThreadLeakControl$StatementRunner.run(ThreadLeakControl.java:390)
at com.carrotsearch.randomizedtesting.ThreadLeakControl.lambda$forkTimeoutingTask$0(ThreadLeakControl.java:850)
at java.base/java.lang.Thread.run(Thread.java:829)
FAILED: org.apache.solr.cloud.OverseerTest.testReplay
Error Message:
java.util.concurrent.TimeoutException: Timeout waiting to see state for collection=collection1 :null
Stack Trace:
java.util.concurrent.TimeoutException: Timeout waiting to see state for collection=collection1 :null
at __randomizedtesting.SeedInfo.seed([FC377411B7D025DA:B4FE7C5559E354A1]:0)
at org.apache.solr.common.cloud.ZkStateReader.waitForState(ZkStateReader.java:1810)
at org.apache.solr.cloud.OverseerTest.testReplay(OverseerTest.java:1649)
at java.base/jdk.internal.reflect.NativeMethodAccessorImpl.invoke0(Native Method)
at java.base/jdk.internal.reflect.NativeMethodAccessorImpl.invoke(NativeMethodAccessorImpl.java:62)
at java.base/jdk.internal.reflect.DelegatingMethodAccessorImpl.invoke(DelegatingMethodAccessorImpl.java:43)
at java.base/java.lang.reflect.Method.invoke(Method.java:566)
at com.carrotsearch.randomizedtesting.RandomizedRunner.invoke(RandomizedRunner.java:1758)
at com.carrotsearch.randomizedtesting.RandomizedRunner$8.evaluate(RandomizedRunner.java:946)
at com.carrotsearch.randomizedtesting.RandomizedRunner$9.evaluate(RandomizedRunner.java:982)
at com.carrotsearch.randomizedtesting.RandomizedRunner$10.evaluate(RandomizedRunner.java:996)
at com.carrotsearch.randomizedtesting.rules.SystemPropertiesRestoreRule$1.evaluate(SystemPropertiesRestoreRule.java:80)
at org.junit.rules.RunRules.evaluate(RunRules.java:20)
at org.apache.lucene.tests.util.TestRuleSetupTeardownChained$1.evaluate(TestRuleSetupTeardownChained.java:48)
at org.apache.lucene.tests.util.AbstractBeforeAfterRule$1.evaluate(AbstractBeforeAfterRule.java:43)
at org.apache.lucene.tests.util.TestRuleThreadAndTestName$1.evaluate(TestRuleThreadAndTestName.java:45)
at org.apache.lucene.tests.util.TestRuleIgnoreAfterMaxFailures$1.evaluate(TestRuleIgnoreAfterMaxFailures.java:60)
at org.apache.lucene.tests.util.TestRuleMarkFailure$1.evaluate(TestRuleMarkFailure.java:44)
at org.junit.rules.RunRules.evaluate(RunRules.java:20)
at com.carrotsearch.randomizedtesting.rules.StatementAdapter.evaluate(StatementAdapter.java:36)
at com.carrotsearch.randomizedtesting.ThreadLeakControl$StatementRunner.run(ThreadLeakControl.java:390)
at com.carrotsearch.randomizedtesting.ThreadLeakControl.forkTimeoutingTask(ThreadLeakControl.java:843)
at com.carrotsearch.randomizedtesting.ThreadLeakControl$3.evaluate(ThreadLeakControl.java:490)
at com.carrotsearch.randomizedtesting.RandomizedRunner.runSingleTest(RandomizedRunner.java:955)
at com.carrotsearch.randomizedtesting.RandomizedRunner$5.evaluate(RandomizedRunner.java:840)
at com.carrotsearch.randomizedtesting.RandomizedRunner$6.evaluate(RandomizedRunner.java:891)
at com.carrotsearch.randomizedtesting.RandomizedRunner$7.evaluate(RandomizedRunner.java:902)
at com.carrotsearch.randomizedtesting.rules.StatementAdapter.evaluate(StatementAdapter.java:36)
at com.carrotsearch.randomizedtesting.rules.StatementAdapter.evaluate(StatementAdapter.java:36)
at org.apache.lucene.tests.util.AbstractBeforeAfterRule$1.evaluate(AbstractBeforeAfterRule.java:43)
at com.carrotsearch.randomizedtesting.rules.SystemPropertiesRestoreRule$1.evaluate(SystemPropertiesRestoreRule.java:80)
at org.junit.rules.RunRules.evaluate(RunRules.java:20)
at org.apache.lucene.tests.util.AbstractBeforeAfterRule$1.evaluate(AbstractBeforeAfterRule.java:43)
at com.carrotsearch.randomizedtesting.rules.StatementAdapter.evaluate(StatementAdapter.java:36)
at org.apache.lucene.tests.util.TestRuleStoreClassName$1.evaluate(TestRuleStoreClassName.java:38)
at com.carrotsearch.randomizedtesting.rules.NoShadowingOrOverridesOnMethodsRule$1.evaluate(NoShadowingOrOverridesOnMethodsRule.java:40)
at com.carrotsearch.randomizedtesting.rules.NoShadowingOrOverridesOnMethodsRule$1.evaluate(NoShadowingOrOverridesOnMethodsRule.java:40)
at com.carrotsearch.randomizedtesting.rules.StatementAdapter.evaluate(StatementAdapter.java:36)
at com.carrotsearch.randomizedtesting.rules.StatementAdapter.evaluate(StatementAdapter.java:36)
at org.apache.lucene.tests.util.TestRuleAssertionsRequired$1.evaluate(TestRuleAssertionsRequired.java:53)
at org.apache.lucene.tests.util.AbstractBeforeAfterRule$1.evaluate(AbstractBeforeAfterRule.java:43)
at org.apache.lucene.tests.util.TestRuleMarkFailure$1.evaluate(TestRuleMarkFailure.java:44)
at org.apache.lucene.tests.util.TestRuleIgnoreAfterMaxFailures$1.evaluate(TestRuleIgnoreAfterMaxFailures.java:60)
at org.apache.lucene.tests.util.TestRuleIgnoreTestSuites$1.evaluate(TestRuleIgnoreTestSuites.java:47)
at org.junit.rules.RunRules.evaluate(RunRules.java:20)
at com.carrotsearch.randomizedtesting.rules.StatementAdapter.evaluate(StatementAdapter.java:36)
at com.carrotsearch.randomizedtesting.ThreadLeakControl$StatementRunner.run(ThreadLeakControl.java:390)
at com.carrotsearch.randomizedtesting.ThreadLeakControl.lambda$forkTimeoutingTask$0(ThreadLeakControl.java:850)
at java.base/java.lang.Thread.run(Thread.java:829)
FAILED: org.apache.solr.cloud.ShardRoutingCustomTest.test
Error Message:
org.apache.solr.client.solrj.impl.BaseHttpSolrClient$RemoteSolrException: Error from server at https://127.0.0.1:38495/solr: ADDREPLICA failed to create replica
Stack Trace:
org.apache.solr.client.solrj.impl.BaseHttpSolrClient$RemoteSolrException: Error from server at https://127.0.0.1:38495/solr: ADDREPLICA failed to create replica
at __randomizedtesting.SeedInfo.seed([FC377411B7D025DA:74634BCB192C4822]:0)
at app//org.apache.solr.client.solrj.impl.HttpSolrClient.executeMethod(HttpSolrClient.java:738)
at app//org.apache.solr.client.solrj.impl.HttpSolrClient.request(HttpSolrClient.java:254)
at app//org.apache.solr.client.solrj.impl.HttpSolrClient.request(HttpSolrClient.java:235)
at app//org.apache.solr.client.solrj.impl.LBSolrClient.doRequest(LBSolrClient.java:386)
at app//org.apache.solr.client.solrj.impl.LBSolrClient.request(LBSolrClient.java:352)
at app//org.apache.solr.client.solrj.impl.CloudSolrClient.sendRequest(CloudSolrClient.java:1140)
at app//org.apache.solr.client.solrj.impl.CloudSolrClient.requestWithRetryOnStaleState(CloudSolrClient.java:839)
at app//org.apache.solr.client.solrj.impl.CloudSolrClient.request(CloudSolrClient.java:767)
at app//org.apache.solr.client.solrj.SolrRequest.process(SolrRequest.java:234)
at app//org.apache.solr.client.solrj.SolrRequest.process(SolrRequest.java:249)
at app//org.apache.solr.cloud.ShardRoutingCustomTest.doCustomSharding(ShardRoutingCustomTest.java:76)
at app//org.apache.solr.cloud.ShardRoutingCustomTest.test(ShardRoutingCustomTest.java:46)
at java.base@11.0.16.1/jdk.internal.reflect.NativeMethodAccessorImpl.invoke0(Native Method)
at java.base@11.0.16.1/jdk.internal.reflect.NativeMethodAccessorImpl.invoke(NativeMethodAccessorImpl.java:62)
at java.base@11.0.16.1/jdk.internal.reflect.DelegatingMethodAccessorImpl.invoke(DelegatingMethodAccessorImpl.java:43)
at java.base@11.0.16.1/java.lang.reflect.Method.invoke(Method.java:566)
at app//com.carrotsearch.randomizedtesting.RandomizedRunner.invoke(RandomizedRunner.java:1758)
at app//com.carrotsearch.randomizedtesting.RandomizedRunner$8.evaluate(RandomizedRunner.java:946)
at app//com.carrotsearch.randomizedtesting.RandomizedRunner$9.evaluate(RandomizedRunner.java:982)
at app//com.carrotsearch.randomizedtesting.RandomizedRunner$10.evaluate(RandomizedRunner.java:996)
at app//org.apache.solr.BaseDistributedSearchTestCase$ShardsRepeatRule$ShardsFixedStatement.callStatement(BaseDistributedSearchTestCase.java:1079)
at app//org.apache.solr.BaseDistributedSearchTestCase$ShardsRepeatRule$ShardsStatement.evaluate(BaseDistributedSearchTestCase.java:1050)
at app//com.carrotsearch.randomizedtesting.rules.SystemPropertiesRestoreRule$1.evaluate(SystemPropertiesRestoreRule.java:80)
at app//org.junit.rules.RunRules.evaluate(RunRules.java:20)
at app//org.apache.lucene.tests.util.TestRuleSetupTeardownChained$1.evaluate(TestRuleSetupTeardownChained.java:48)
at app//org.apache.lucene.tests.util.AbstractBeforeAfterRule$1.evaluate(AbstractBeforeAfterRule.java:43)
at app//org.apache.lucene.tests.util.TestRuleThreadAndTestName$1.evaluate(TestRuleThreadAndTestName.java:45)
at app//org.apache.lucene.tests.util.TestRuleIgnoreAfterMaxFailures$1.evaluate(TestRuleIgnoreAfterMaxFailures.java:60)
at app//org.apache.lucene.tests.util.TestRuleMarkFailure$1.evaluate(TestRuleMarkFailure.java:44)
at app//org.junit.rules.RunRules.evaluate(RunRules.java:20)
at app//com.carrotsearch.randomizedtesting.rules.StatementAdapter.evaluate(StatementAdapter.java:36)
at app//com.carrotsearch.randomizedtesting.ThreadLeakControl$StatementRunner.run(ThreadLeakControl.java:390)
at app//com.carrotsearch.randomizedtesting.ThreadLeakControl.forkTimeoutingTask(ThreadLeakControl.java:843)
at app//com.carrotsearch.randomizedtesting.ThreadLeakControl$3.evaluate(ThreadLeakControl.java:490)
at app//com.carrotsearch.randomizedtesting.RandomizedRunner.runSingleTest(RandomizedRunner.java:955)
at app//com.carrotsearch.randomizedtesting.RandomizedRunner$5.evaluate(RandomizedRunner.java:840)
at app//com.carrotsearch.randomizedtesting.RandomizedRunner$6.evaluate(RandomizedRunner.java:891)
at app//com.carrotsearch.randomizedtesting.RandomizedRunner$7.evaluate(RandomizedRunner.java:902)
at app//com.carrotsearch.randomizedtesting.rules.StatementAdapter.evaluate(StatementAdapter.java:36)
at app//com.carrotsearch.randomizedtesting.rules.StatementAdapter.evaluate(StatementAdapter.java:36)
at app//org.apache.lucene.tests.util.AbstractBeforeAfterRule$1.evaluate(AbstractBeforeAfterRule.java:43)
at app//com.carrotsearch.randomizedtesting.rules.SystemPropertiesRestoreRule$1.evaluate(SystemPropertiesRestoreRule.java:80)
at app//org.junit.rules.RunRules.evaluate(RunRules.java:20)
at app//org.apache.lucene.tests.util.AbstractBeforeAfterRule$1.evaluate(AbstractBeforeAfterRule.java:43)
at app//com.carrotsearch.randomizedtesting.rules.StatementAdapter.evaluate(StatementAdapter.java:36)
at app//org.apache.lucene.tests.util.TestRuleStoreClassName$1.evaluate(TestRuleStoreClassName.java:38)
at app//com.carrotsearch.randomizedtesting.rules.NoShadowingOrOverridesOnMethodsRule$1.evaluate(NoShadowingOrOverridesOnMethodsRule.java:40)
at app//com.carrotsearch.randomizedtesting.rules.NoShadowingOrOverridesOnMethodsRule$1.evaluate(NoShadowingOrOverridesOnMethodsRule.java:40)
at app//com.carrotsearch.randomizedtesting.rules.StatementAdapter.evaluate(StatementAdapter.java:36)
at app//com.carrotsearch.randomizedtesting.rules.StatementAdapter.evaluate(StatementAdapter.java:36)
at app//org.apache.lucene.tests.util.TestRuleAssertionsRequired$1.evaluate(TestRuleAssertionsRequired.java:53)
at app//org.apache.lucene.tests.util.AbstractBeforeAfterRule$1.evaluate(AbstractBeforeAfterRule.java:43)
at app//org.apache.lucene.tests.util.TestRuleMarkFailure$1.evaluate(TestRuleMarkFailure.java:44)
at app//org.apache.lucene.tests.util.TestRuleIgnoreAfterMaxFailures$1.evaluate(TestRuleIgnoreAfterMaxFailures.java:60)
at app//org.apache.lucene.tests.util.TestRuleIgnoreTestSuites$1.evaluate(TestRuleIgnoreTestSuites.java:47)
at app//org.junit.rules.RunRules.evaluate(RunRules.java:20)
at app//com.carrotsearch.randomizedtesting.rules.StatementAdapter.evaluate(StatementAdapter.java:36)
at app//com.carrotsearch.randomizedtesting.ThreadLeakControl$StatementRunner.run(ThreadLeakControl.java:390)
at app//com.carrotsearch.randomizedtesting.ThreadLeakControl.lambda$forkTimeoutingTask$0(ThreadLeakControl.java:850)
at java.base@11.0.16.1/java.lang.Thread.run(Thread.java:829)
FAILED: org.apache.solr.cloud.ShardRoutingCustomTest.classMethod
Error Message:
com.carrotsearch.randomizedtesting.ThreadLeakError: 29 threads leaked from SUITE scope at org.apache.solr.cloud.ShardRoutingCustomTest:
1) Thread[id=4895, name=zkCallback-2781-thread-5, state=TIMED_WAITING, group=TGRP-ShardRoutingCustomTest]
at java.base@11.0.16.1/jdk.internal.misc.Unsafe.park(Native Method)
at java.base@11.0.16.1/java.util.concurrent.locks.LockSupport.parkNanos(LockSupport.java:234)
at java.base@11.0.16.1/java.util.concurrent.SynchronousQueue$TransferStack.awaitFulfill(SynchronousQueue.java:462)
at java.base@11.0.16.1/java.util.concurrent.SynchronousQueue$TransferStack.transfer(SynchronousQueue.java:361)
at java.base@11.0.16.1/java.util.concurrent.SynchronousQueue.poll(SynchronousQueue.java:937)
at java.base@11.0.16.1/java.util.concurrent.ThreadPoolExecutor.getTask(ThreadPoolExecutor.java:1053)
at java.base@11.0.16.1/java.util.concurrent.ThreadPoolExecutor.runWorker(ThreadPoolExecutor.java:1114)
at java.base@11.0.16.1/java.util.concurrent.ThreadPoolExecutor$Worker.run(ThreadPoolExecutor.java:628)
at java.base@11.0.16.1/java.lang.Thread.run(Thread.java:829)
2) Thread[id=4874, name=zkCallback-2781-thread-3, state=WAITING, group=TGRP-ShardRoutingCustomTest]
at java.base@11.0.16.1/java.lang.Object.wait(Native Method)
at java.base@11.0.16.1/java.lang.Object.wait(Object.java:328)
at app//org.apache.zookeeper.ClientCnxn.submitRequest(ClientCnxn.java:1577)
at app//org.apache.zookeeper.ClientCnxn.submitRequest(ClientCnxn.java:1549)
at app//org.apache.zookeeper.ZooKeeper.create(ZooKeeper.java:1345)
at app//org.apache.solr.common.cloud.SolrZkClient.lambda$makePath$10(SolrZkClient.java:688)
at app//org.apache.solr.common.cloud.SolrZkClient$$Lambda$820/0x0000000100908440.execute(Unknown Source)
at app//org.apache.solr.common.cloud.ZkCmdExecutor.retryOperation(ZkCmdExecutor.java:70)
at app//org.apache.solr.common.cloud.SolrZkClient.makePath(SolrZkClient.java:686)
at app//org.apache.solr.common.cloud.SolrZkClient.makePath(SolrZkClient.java:610)
at app//org.apache.solr.common.cloud.SolrZkClient.makePath(SolrZkClient.java:596)
at app//org.apache.solr.cloud.OverseerElectionContext.runLeaderProcess(OverseerElectionContext.java:65)
at app//org.apache.solr.cloud.LeaderElector.runIamLeaderProcess(LeaderElector.java:170)
at app//org.apache.solr.cloud.LeaderElector.checkIfIamLeader(LeaderElector.java:130)
at app//org.apache.solr.cloud.LeaderElector$ElectionWatcher.process(LeaderElector.java:350)
at app//org.apache.solr.common.cloud.SolrZkClient$ProcessWatchWithExecutor.lambda$process$1(SolrZkClient.java:1047)
at app//org.apache.solr.common.cloud.SolrZkClient$ProcessWatchWithExecutor$$Lambda$911/0x0000000100976c40.run(Unknown Source)
at java.base@11.0.16.1/java.util.concurrent.Executors$RunnableAdapter.call(Executors.java:515)
at java.base@11.0.16.1/java.util.concurrent.FutureTask.run(FutureTask.java:264)
at app//org.apache.solr.common.util.ExecutorUtil$MDCAwareThreadPoolExecutor.lambda$execute$0(ExecutorUtil.java:289)
at app//org.apache.solr.common.util.ExecutorUtil$MDCAwareThreadPoolExecutor$$Lambda$330/0x000000010052ac40.run(Unknown Source)
at java.base@11.0.16.1/java.util.concurrent.ThreadPoolExecutor.runWorker(ThreadPoolExecutor.java:1128)
at java.base@11.0.16.1/java.util.concurrent.ThreadPoolExecutor$Worker.run(ThreadPoolExecutor.java:628)
at java.base@11.0.16.1/java.lang.Thread.run(Thread.java:829)
3) Thread[id=4838, name=qtp2130335196-4838, state=TIMED_WAITING, group=TGRP-ShardRoutingCustomTest]
at java.base@11.0.16.1/jdk.internal.misc.Unsafe.park(Native Method)
at java.base@11.0.16.1/java.util.concurrent.locks.LockSupport.parkNanos(LockSupport.java:234)
at java.base@11.0.16.1/java.util.concurrent.locks.AbstractQueuedSynchronizer$ConditionObject.awaitNanos(AbstractQueuedSynchronizer.java:2123)
at app//org.eclipse.jetty.util.BlockingArrayQueue.poll(BlockingArrayQueue.java:219)
at app//org.eclipse.jetty.util.thread.QueuedThreadPool$Runner.idleJobPoll(QueuedThreadPool.java:1124)
at app//org.eclipse.jetty.util.thread.QueuedThreadPool$Runner.run(QueuedThreadPool.java:1141)
at java.base@11.0.16.1/java.lang.Thread.run(Thread.java:829)
4) Thread[id=4862, name=Connector-Scheduler-4c438d99-1, state=TIMED_WAITING, group=TGRP-ShardRoutingCustomTest]
at java.base@11.0.16.1/jdk.internal.misc.Unsafe.park(Native Method)
at java.base@11.0.16.1/java.util.concurrent.locks.LockSupport.parkNanos(LockSupport.java:234)
at java.base@11.0.16.1/java.util.concurrent.locks.AbstractQueuedSynchronizer$ConditionObject.awaitNanos(AbstractQueuedSynchronizer.java:2123)
at java.base@11.0.16.1/java.util.concurrent.ScheduledThreadPoolExecutor$DelayedWorkQueue.take(ScheduledThreadPoolExecutor.java:1182)
at java.base@11.0.16.1/java.util.concurrent.ScheduledThreadPoolExecutor$DelayedWorkQueue.take(ScheduledThreadPoolExecutor.java:899)
at java.base@11.0.16.1/java.util.concurrent.ThreadPoolExecutor.getTask(ThreadPoolExecutor.java:1054)
at java.base@11.0.16.1/java.util.concurrent.ThreadPoolExecutor.runWorker(ThreadPoolExecutor.java:1114)
at java.base@11.0.16.1/java.util.concurrent.ThreadPoolExecutor$Worker.run(ThreadPoolExecutor.java:628)
at java.base@11.0.16.1/java.lang.Thread.run(Thread.java:829)
5) Thread[id=4840, name=qtp2130335196-4840, state=TIMED_WAITING, group=TGRP-ShardRoutingCustomTest]
at java.base@11.0.16.1/jdk.internal.misc.Unsafe.park(Native Method)
at java.base@11.0.16.1/java.util.concurrent.locks.LockSupport.parkNanos(LockSupport.java:234)
at java.base@11.0.16.1/java.util.concurrent.locks.AbstractQueuedSynchronizer$ConditionObject.awaitNanos(AbstractQueuedSynchronizer.java:2123)
at app//org.eclipse.jetty.util.BlockingArrayQueue.poll(BlockingArrayQueue.java:219)
at app//org.eclipse.jetty.util.thread.QueuedThreadPool$Runner.idleJobPoll(QueuedThreadPool.java:1124)
at app//org.eclipse.jetty.util.thread.QueuedThreadPool$Runner.run(QueuedThreadPool.java:1141)
at java.base@11.0.16.1/java.lang.Thread.run(Thread.java:829)
6) Thread[id=4894, name=zkCallback-2781-thread-4, state=TIMED_WAITING, group=TGRP-ShardRoutingCustomTest]
at java.base@11.0.16.1/jdk.internal.misc.Unsafe.park(Native Method)
at java.base@11.0.16.1/java.util.concurrent.locks.LockSupport.parkNanos(LockSupport.java:234)
at java.base@11.0.16.1/java.util.concurrent.SynchronousQueue$TransferStack.awaitFulfill(SynchronousQueue.java:462)
at java.base@11.0.16.1/java.util.concurrent.SynchronousQueue$TransferStack.transfer(SynchronousQueue.java:361)
at java.base@11.0.16.1/java.util.concurrent.SynchronousQueue.poll(SynchronousQueue.java:937)
at java.base@11.0.16.1/java.util.concurrent.ThreadPoolExecutor.getTask(ThreadPoolExecutor.java:1053)
at java.base@11.0.16.1/java.util.concurrent.ThreadPoolExecutor.runWorker(ThreadPoolExecutor.java:1114)
at java.base@11.0.16.1/java.util.concurrent.ThreadPoolExecutor$Worker.run(ThreadPoolExecutor.java:628)
at java.base@11.0.16.1/java.lang.Thread.run(Thread.java:829)
7) Thread[id=4855, name=TEST-ShardRoutingCustomTest.test-seed#[FC377411B7D025DA]-SendThread(127.0.0.1:34533), state=TIMED_WAITING, group=TGRP-ShardRoutingCustomTest]
at java.base@11.0.16.1/java.lang.Thread.sleep(Native Method)
at app//org.apache.zookeeper.ClientCnxn$SendThread.startConnect(ClientCnxn.java:1127)
at app//org.apache.zookeeper.ClientCnxn$SendThread.run(ClientCnxn.java:1192)
8) Thread[id=4846, name=httpShardExecutor-2775-thread-1, state=RUNNABLE, group=TGRP-ShardRoutingCustomTest]
at java.base@11.0.16.1/sun.nio.ch.EPoll.wait(Native Method)
at java.base@11.0.16.1/sun.nio.ch.EPollSelectorImpl.doSelect(EPollSelectorImpl.java:120)
at java.base@11.0.16.1/sun.nio.ch.SelectorImpl.lockAndDoSelect(SelectorImpl.java:124)
at java.base@11.0.16.1/sun.nio.ch.SelectorImpl.select(SelectorImpl.java:141)
at app//org.eclipse.jetty.io.ManagedSelector.nioSelect(ManagedSelector.java:180)
at app//org.eclipse.jetty.io.ManagedSelector.select(ManagedSelector.java:187)
at app//org.eclipse.jetty.io.ManagedSelector$SelectorProducer.select(ManagedSelector.java:604)
at app//org.eclipse.jetty.io.ManagedSelector$SelectorProducer.produce(ManagedSelector.java:541)
at app//org.eclipse.jetty.util.thread.strategy.AdaptiveExecutionStrategy.produceTask(AdaptiveExecutionStrategy.java:450)
at app//org.eclipse.jetty.util.thread.strategy.AdaptiveExecutionStrategy.tryProduce(AdaptiveExecutionStrategy.java:243)
at app//org.eclipse.jetty.util.thread.strategy.AdaptiveExecutionStrategy.produce(AdaptiveExecutionStrategy.java:194)
at app//org.eclipse.jetty.io.ManagedSelector$$Lambda$329/0x000000010052b440.run(Unknown Source)
at app//org.apache.solr.common.util.ExecutorUtil$MDCAwareThreadPoolExecutor.lambda$execute$0(ExecutorUtil.java:289)
at app//org.apache.solr.common.util.ExecutorUtil$MDCAwareThreadPoolExecutor$$Lambda$330/0x000000010052ac40.run(Unknown Source)
at java.base@11.0.16.1/java.util.concurrent.ThreadPoolExecutor.runWorker(ThreadPoolExecutor.java:1128)
at java.base@11.0.16.1/java.util.concurrent.ThreadPoolExecutor$Worker.run(ThreadPoolExecutor.java:628)
at java.base@11.0.16.1/java.lang.Thread.run(Thread.java:829)
9) Thread[id=4856, name=TEST-ShardRoutingCustomTest.test-seed#[FC377411B7D025DA]-EventThread, state=WAITING, group=TGRP-ShardRoutingCustomTest]
at java.base@11.0.16.1/jdk.internal.misc.Unsafe.park(Native Method)
at java.base@11.0.16.1/java.util.concurrent.locks.LockSupport.park(LockSupport.java:194)
at java.base@11.0.16.1/java.util.concurrent.locks.AbstractQueuedSynchronizer$ConditionObject.await(AbstractQueuedSynchronizer.java:2081)
at java.base@11.0.16.1/java.util.concurrent.LinkedBlockingQueue.take(LinkedBlockingQueue.java:433)
at app//org.apache.zookeeper.ClientCnxn$EventThread.run(ClientCnxn.java:534)
10) Thread[id=4836, name=qtp2130335196-4836, state=TIMED_WAITING, group=TGRP-ShardRoutingCustomTest]
at java.base@11.0.16.1/jdk.internal.misc.Unsafe.park(Native Method)
at java.base@11.0.16.1/java.util.concurrent.locks.LockSupport.parkNanos(LockSupport.java:234)
at java.base@11.0.16.1/java.util.concurrent.locks.AbstractQueuedSynchronizer$ConditionObject.awaitNanos(AbstractQueuedSynchronizer.java:2123)
at app//org.eclipse.jetty.util.BlockingArrayQueue.poll(BlockingArrayQueue.java:219)
at app//org.eclipse.jetty.util.thread.QueuedThreadPool$Runner.idleJobPoll(QueuedThreadPool.java:1124)
at app//org.eclipse.jetty.util.thread.QueuedThreadPool$Runner.run(QueuedThreadPool.java:1141)
at java.base@11.0.16.1/java.lang.Thread.run(Thread.java:829)
11) Thread[id=4861, name=coreContainerWorkExecutor-2772-thread-1, state=TIMED_WAITING, group=TGRP-ShardRoutingCustomTest]
at java.base@11.0.16.1/jdk.internal.misc.Unsafe.park(Native Method)
at java.base@11.0.16.1/java.util.concurrent.locks.LockSupport.parkNanos(LockSupport.java:234)
at java.base@11.0.16.1/java.util.concurrent.SynchronousQueue$TransferStack.awaitFulfill(SynchronousQueue.java:462)
at java.base@11.0.16.1/java.util.concurrent.SynchronousQueue$TransferStack.transfer(SynchronousQueue.java:361)
at java.base@11.0.16.1/java.util.concurrent.SynchronousQueue.poll(SynchronousQueue.java:937)
at java.base@11.0.16.1/java.util.concurrent.ThreadPoolExecutor.getTask(ThreadPoolExecutor.java:1053)
at java.base@11.0.16.1/java.util.concurrent.ThreadPoolExecutor.runWorker(ThreadPoolExecutor.java:1114)
at java.base@11.0.16.1/java.util.concurrent.ThreadPoolExecutor$Worker.run(ThreadPoolExecutor.java:628)
at java.base@11.0.16.1/java.lang.Thread.run(Thread.java:829)
12) Thread[id=4835, name=qtp2130335196-4835-acceptor-0@705e0b-ServerConnector@4c438d99{ssl, (ssl, alpn, http/1.1, h2)}{127.0.0.1:38495}, state=RUNNABLE, group=TGRP-ShardRoutingCustomTest]
at java.base@11.0.16.1/sun.nio.ch.ServerSocketChannelImpl.accept0(Native Method)
at java.base@11.0.16.1/sun.nio.ch.ServerSocketChannelImpl.accept(ServerSocketChannelImpl.java:533)
at java.base@11.0.16.1/sun.nio.ch.ServerSocketChannelImpl.accept(ServerSocketChannelImpl.java:285)
at app//org.eclipse.jetty.server.ServerConnector.accept(ServerConnector.java:409)
at app//org.eclipse.jetty.server.AbstractConnector$Acceptor.run(AbstractConnector.java:748)
at app//org.eclipse.jetty.util.thread.QueuedThreadPool.runJob(QueuedThreadPool.java:969)
at app//org.eclipse.jetty.util.thread.QueuedThreadPool$Runner.doRunJob(QueuedThreadPool.java:1194)
at app//org.eclipse.jetty.util.thread.QueuedThreadPool$Runner.run(QueuedThreadPool.java:1149)
at java.base@11.0.16.1/java.lang.Thread.run(Thread.java:829)
13) Thread[id=4841, name=qtp2130335196-4841, state=TIMED_WAITING, group=TGRP-ShardRoutingCustomTest]
at java.base@11.0.16.1/jdk.internal.misc.Unsafe.park(Native Method)
at java.base@11.0.16.1/java.util.concurrent.locks.LockSupport.parkNanos(LockSupport.java:234)
at java.base@11.0.16.1/java.util.concurrent.locks.AbstractQueuedSynchronizer$ConditionObject.awaitNanos(AbstractQueuedSynchronizer.java:2123)
at app//org.eclipse.jetty.util.BlockingArrayQueue.poll(BlockingArrayQueue.java:219)
at app//org.eclipse.jetty.util.thread.QueuedThreadPool$Runner.idleJobPoll(QueuedThreadPool.java:1124)
at app//org.eclipse.jetty.util.thread.QueuedThreadPool$Runner.run(QueuedThreadPool.java:1141)
at java.base@11.0.16.1/java.lang.Thread.run(Thread.java:829)
14) Thread[id=4837, name=qtp2130335196-4837, state=TIMED_WAITING, group=TGRP-ShardRoutingCustomTest]
at java.base@11.0.16.1/jdk.internal.misc.Unsafe.park(Native Method)
at java.base@11.0.16.1/java.util.concurrent.locks.LockSupport.parkNanos(LockSupport.java:234)
at java.base@11.0.16.1/java.util.concurrent.locks.AbstractQueuedSynchronizer$ConditionObject.awaitNanos(AbstractQueuedSynchronizer.java:2123)
at app//org.eclipse.jetty.util.BlockingArrayQueue.poll(BlockingArrayQueue.java:219)
at app//org.eclipse.jetty.util.thread.QueuedThreadPool$Runner.idleJobPoll(QueuedThreadPool.java:1124)
at app//org.eclipse.jetty.util.thread.QueuedThreadPool$Runner.run(QueuedThreadPool.java:1141)
at java.base@11.0.16.1/java.lang.Thread.run(Thread.java:829)
15) Thread[id=4858, name=zkCallback-2781-thread-1, state=TIMED_WAITING, group=TGRP-ShardRoutingCustomTest]
at java.base@11.0.16.1/jdk.internal.misc.Unsafe.park(Native Method)
at java.base@11.0.16.1/java.util.concurrent.locks.LockSupport.parkNanos(LockSupport.java:234)
at java.base@11.0.16.1/java.util.concurrent.SynchronousQueue$TransferStack.awaitFulfill(SynchronousQueue.java:462)
at java.base@11.0.16.1/java.util.concurrent.SynchronousQueue$TransferStack.transfer(SynchronousQueue.java:361)
at java.base@11.0.16.1/java.util.concurrent.SynchronousQueue.poll(SynchronousQueue.java:937)
at java.base@11.0.16.1/java.util.concurrent.ThreadPoolExecutor.getTask(ThreadPoolExecutor.java:1053)
at java.base@11.0.16.1/java.util.concurrent.ThreadPoolExecutor.runWorker(ThreadPoolExecutor.java:1114)
at java.base@11.0.16.1/java.util.concurrent.ThreadPoolExecutor$Worker.run(ThreadPoolExecutor.java:628)
at java.base@11.0.16.1/java.lang.Thread.run(Thread.java:829)
16) Thread[id=4860, name=CloserThread, state=WAITING, group=TGRP-ShardRoutingCustomTest]
at java.base@11.0.16.1/java.lang.Object.wait(Native Method)
at java.base@11.0.16.1/java.lang.Object.wait(Object.java:328)
at app//org.apache.solr.core.CloserThread.run(CoreContainer.java:2560)
17) Thread[id=4896, name=zkCallback-2781-thread-6, state=TIMED_WAITING, group=TGRP-ShardRoutingCustomTest]
at java.base@11.0.16.1/jdk.internal.misc.Unsafe.park(Native Method)
at java.base@11.0.16.1/java.util.concurrent.locks.LockSupport.parkNanos(LockSupport.java:234)
at java.base@11.0.16.1/java.util.concurrent.SynchronousQueue$TransferStack.awaitFulfill(SynchronousQueue.java:462)
at java.base@11.0.16.1/java.util.concurrent.SynchronousQueue$TransferStack.transfer(SynchronousQueue.java:361)
at java.base@11.0.16.1/java.util.concurrent.SynchronousQueue.poll(SynchronousQueue.java:937)
at java.base@11.0.16.1/java.util.concurrent.ThreadPoolExecutor.getTask(ThreadPoolExecutor.java:1053)
at java.base@11.0.16.1/java.util.concurrent.ThreadPoolExecutor.runWorker(ThreadPoolExecutor.java:1114)
at java.base@11.0.16.1/java.util.concurrent.ThreadPoolExecutor$Worker.run(ThreadPoolExecutor.java:628)
at java.base@11.0.16.1/java.lang.Thread.run(Thread.java:829)
18) Thread[id=4847, name=httpShardExecutor-2775-thread-2, state=RUNNABLE, group=TGRP-ShardRoutingCustomTest]
at java.base@11.0.16.1/sun.nio.ch.EPoll.wait(Native Method)
at java.base@11.0.16.1/sun.nio.ch.EPollSelectorImpl.doSelect(EPollSelectorImpl.java:120)
at java.base@11.0.16.1/sun.nio.ch.SelectorImpl.lockAndDoSelect(SelectorImpl.java:124)
at java.base@11.0.16.1/sun.nio.ch.SelectorImpl.select(SelectorImpl.java:141)
at app//org.eclipse.jetty.io.ManagedSelector.nioSelect(ManagedSelector.java:180)
at app//org.eclipse.jetty.io.ManagedSelector.select(ManagedSelector.java:187)
at app//org.eclipse.jetty.io.ManagedSelector$SelectorProducer.select(ManagedSelector.java:604)
at app//org.eclipse.jetty.io.ManagedSelector$SelectorProducer.produce(ManagedSelector.java:541)
at app//org.eclipse.jetty.util.thread.strategy.AdaptiveExecutionStrategy.produceTask(AdaptiveExecutionStrategy.java:450)
at app//org.eclipse.jetty.util.thread.strategy.AdaptiveExecutionStrategy.tryProduce(AdaptiveExecutionStrategy.java:243)
at app//org.eclipse.jetty.util.thread.strategy.AdaptiveExecutionStrategy.produce(AdaptiveExecutionStrategy.java:194)
at app//org.eclipse.jetty.io.ManagedSelector$$Lambda$329/0x000000010052b440.run(Unknown Source)
at app//org.apache.solr.common.util.ExecutorUtil$MDCAwareThreadPoolExecutor.lambda$execute$0(ExecutorUtil.java:289)
at app//org.apache.solr.common.util.ExecutorUtil$MDCAwareThreadPoolExecutor$$Lambda$330/0x000000010052ac40.run(Unknown Source)
at java.base@11.0.16.1/java.util.concurrent.ThreadPoolExecutor.runWorker(ThreadPoolExecutor.java:1128)
at java.base@11.0.16.1/java.util.concurrent.ThreadPoolExecutor$Worker.run(ThreadPoolExecutor.java:628)
at java.base@11.0.16.1/java.lang.Thread.run(Thread.java:829)
19) Thread[id=4865, name=watches-2783-thread-1, state=TIMED_WAITING, group=TGRP-ShardRoutingCustomTest]
at java.base@11.0.16.1/jdk.internal.misc.Unsafe.park(Native Method)
at java.base@11.0.16.1/java.util.concurrent.locks.LockSupport.parkNanos(LockSupport.java:234)
at java.base@11.0.16.1/java.util.concurrent.SynchronousQueue$TransferStack.awaitFulfill(SynchronousQueue.java:462)
at java.base@11.0.16.1/java.util.concurrent.SynchronousQueue$TransferStack.transfer(SynchronousQueue.java:361)
at java.base@11.0.16.1/java.util.concurrent.SynchronousQueue.poll(SynchronousQueue.java:937)
at java.base@11.0.16.1/java.util.concurrent.ThreadPoolExecutor.getTask(ThreadPoolExecutor.java:1053)
at java.base@11.0.16.1/java.util.concurrent.ThreadPoolExecutor.runWorker(ThreadPoolExecutor.java:1114)
at java.base@11.0.16.1/java.util.concurrent.ThreadPoolExecutor$Worker.run(ThreadPoolExecutor.java:628)
at java.base@11.0.16.1/java.lang.Thread.run(Thread.java:829)
20) Thread[id=4857, name=zkConnectionManagerCallback-2782-thread-1, state=WAITING, group=TGRP-ShardRoutingCustomTest]
at java.base@11.0.16.1/jdk.internal.misc.Unsafe.park(Native Method)
at java.base@11.0.16.1/java.util.concurrent.locks.LockSupport.park(LockSupport.java:194)
at java.base@11.0.16.1/java.util.concurrent.locks.AbstractQueuedSynchronizer$ConditionObject.await(AbstractQueuedSynchronizer.java:2081)
at java.base@11.0.16.1/java.util.concurrent.LinkedBlockingQueue.take(LinkedBlockingQueue.java:433)
at java.base@11.0.16.1/java.util.concurrent.ThreadPoolExecutor.getTask(ThreadPoolExecutor.java:1054)
at java.base@11.0.16.1/java.util.concurrent.ThreadPoolExecutor.runWorker(ThreadPoolExecutor.java:1114)
at java.base@11.0.16.1/java.util.concurrent.ThreadPoolExecutor$Worker.run(ThreadPoolExecutor.java:628)
at java.base@11.0.16.1/java.lang.Thread.run(Thread.java:829)
21) Thread[id=4851, name=h2sc-2777-thread-2, state=RUNNABLE, group=TGRP-ShardRoutingCustomTest]
at java.base@11.0.16.1/sun.nio.ch.EPoll.wait(Native Method)
at java.base@11.0.16.1/sun.nio.ch.EPollSelectorImpl.doSelect(EPollSelectorImpl.java:120)
at java.base@11.0.16.1/sun.nio.ch.SelectorImpl.lockAndDoSelect(SelectorImpl.java:124)
at java.base@11.0.16.1/sun.nio.ch.SelectorImpl.select(SelectorImpl.java:141)
at app//org.eclipse.jetty.io.ManagedSelector.nioSelect(ManagedSelector.java:180)
at app//org.eclipse.jetty.io.ManagedSelector.select(ManagedSelector.java:187)
at app//org.eclipse.jetty.io.ManagedSelector$SelectorProducer.select(ManagedSelector.java:604)
at app//org.eclipse.jetty.io.ManagedSelector$SelectorProducer.produce(ManagedSelector.java:541)
at app//org.eclipse.jetty.util.thread.strategy.AdaptiveExecutionStrategy.produceTask(AdaptiveExecutionStrategy.java:450)
at app//org.eclipse.jetty.util.thread.strategy.AdaptiveExecutionStrategy.tryProduce(AdaptiveExecutionStrategy.java:243)
at app//org.eclipse.jetty.util.thread.strategy.AdaptiveExecutionStrategy.produce(AdaptiveExecutionStrategy.java:194)
at app//org.eclipse.jetty.io.ManagedSelector$$Lambda$329/0x000000010052b440.run(Unknown Source)
at app//org.apache.solr.common.util.ExecutorUtil$MDCAwareThreadPoolExecutor.lambda$execute$0(ExecutorUtil.java:289)
at app//org.apache.solr.common.util.ExecutorUtil$MDCAwareThreadPoolExecutor$$Lambda$330/0x000000010052ac40.run(Unknown Source)
at java.base@11.0.16.1/java.util.concurrent.ThreadPoolExecutor.runWorker(ThreadPoolExecutor.java:1128)
at java.base@11.0.16.1/java.util.concurrent.ThreadPoolExecutor$Worker.run(ThreadPoolExecutor.java:628)
at java.base@11.0.16.1/java.lang.Thread.run(Thread.java:829)
22) Thread[id=4897, name=zkCallback-2781-thread-7, state=TIMED_WAITING, group=TGRP-ShardRoutingCustomTest]
at java.base@11.0.16.1/jdk.internal.misc.Unsafe.park(Native Method)
at java.base@11.0.16.1/java.util.concurrent.locks.LockSupport.parkNanos(LockSupport.java:234)
at java.base@11.0.16.1/java.util.concurrent.SynchronousQueue$TransferStack.awaitFulfill(SynchronousQueue.java:462)
at java.base@11.0.16.1/java.util.concurrent.SynchronousQueue$TransferStack.transfer(SynchronousQueue.java:361)
at java.base@11.0.16.1/java.util.concurrent.SynchronousQueue.poll(SynchronousQueue.java:937)
at java.base@11.0.16.1/java.util.concurrent.ThreadPoolExecutor.getTask(ThreadPoolExecutor.java:1053)
at java.base@11.0.16.1/java.util.concurrent.ThreadPoolExecutor.runWorker(ThreadPoolExecutor.java:1114)
at java.base@11.0.16.1/java.util.concurrent.ThreadPoolExecutor$Worker.run(ThreadPoolExecutor.java:628)
at java.base@11.0.16.1/java.lang.Thread.run(Thread.java:829)
23) Thread[id=4842, name=Session-HouseKeeper-6c6da862-1, state=TIMED_WAITING, group=TGRP-ShardRoutingCustomTest]
at java.base@11.0.16.1/jdk.internal.misc.Unsafe.park(Native Method)
at java.base@11.0.16.1/java.util.concurrent.locks.LockSupport.parkNanos(LockSupport.java:234)
at java.base@11.0.16.1/java.util.concurrent.locks.AbstractQueuedSynchronizer$ConditionObject.awaitNanos(AbstractQueuedSynchronizer.java:2123)
at java.base@11.0.16.1/java.util.concurrent.ScheduledThreadPoolExecutor$DelayedWorkQueue.take(ScheduledThreadPoolExecutor.java:1182)
at java.base@11.0.16.1/java.util.concurrent.ScheduledThreadPoolExecutor$DelayedWorkQueue.take(ScheduledThreadPoolExecutor.java:899)
at java.base@11.0.16.1/java.util.concurrent.ThreadPoolExecutor.getTask(ThreadPoolExecutor.java:1054)
at java.base@11.0.16.1/java.util.concurrent.ThreadPoolExecutor.runWorker(ThreadPoolExecutor.java:1114)
at java.base@11.0.16.1/java.util.concurrent.ThreadPoolExecutor$Worker.run(ThreadPoolExecutor.java:628)
at java.base@11.0.16.1/java.lang.Thread.run(Thread.java:829)
24) Thread[id=4867, name=watches-2783-thread-2, state=TIMED_WAITING, group=TGRP-ShardRoutingCustomTest]
at java.base@11.0.16.1/jdk.internal.misc.Unsafe.park(Native Method)
at java.base@11.0.16.1/java.util.concurrent.locks.LockSupport.parkNanos(LockSupport.java:234)
at java.base@11.0.16.1/java.util.concurrent.SynchronousQueue$TransferStack.awaitFulfill(SynchronousQueue.java:462)
at java.base@11.0.16.1/java.util.concurrent.SynchronousQueue$TransferStack.transfer(SynchronousQueue.java:361)
at java.base@11.0.16.1/java.util.concurrent.SynchronousQueue.poll(SynchronousQueue.java:937)
at java.base@11.0.16.1/java.util.concurrent.ThreadPoolExecutor.getTask(ThreadPoolExecutor.java:1053)
at java.base@11.0.16.1/java.util.concurrent.ThreadPoolExecutor.runWorker(ThreadPoolExecutor.java:1114)
at java.base@11.0.16.1/java.util.concurrent.ThreadPoolExecutor$Worker.run(ThreadPoolExecutor.java:628)
at java.base@11.0.16.1/java.lang.Thread.run(Thread.java:829)
25) Thread[id=4834, name=qtp2130335196-4834, state=RUNNABLE, group=TGRP-ShardRoutingCustomTest]
at java.base@11.0.16.1/sun.nio.ch.EPoll.wait(Native Method)
at java.base@11.0.16.1/sun.nio.ch.EPollSelectorImpl.doSelect(EPollSelectorImpl.java:120)
at java.base@11.0.16.1/sun.nio.ch.SelectorImpl.lockAndDoSelect(SelectorImpl.java:124)
at java.base@11.0.16.1/sun.nio.ch.SelectorImpl.select(SelectorImpl.java:141)
at app//org.eclipse.jetty.io.ManagedSelector.nioSelect(ManagedSelector.java:180)
at app//org.eclipse.jetty.io.ManagedSelector.select(ManagedSelector.java:187)
at app//org.eclipse.jetty.io.ManagedSelector$SelectorProducer.select(ManagedSelector.java:604)
at app//org.eclipse.jetty.io.ManagedSelector$SelectorProducer.produce(ManagedSelector.java:541)
at app//org.eclipse.jetty.util.thread.strategy.AdaptiveExecutionStrategy.produceTask(AdaptiveExecutionStrategy.java:450)
at app//org.eclipse.jetty.util.thread.strategy.AdaptiveExecutionStrategy.tryProduce(AdaptiveExecutionStrategy.java:243)
at app//org.eclipse.jetty.util.thread.strategy.AdaptiveExecutionStrategy.produce(AdaptiveExecutionStrategy.java:194)
at app//org.eclipse.jetty.io.ManagedSelector$$Lambda$329/0x000000010052b440.run(Unknown Source)
at app//org.eclipse.jetty.util.thread.QueuedThreadPool.runJob(QueuedThreadPool.java:969)
at app//org.eclipse.jetty.util.thread.QueuedThreadPool$Runner.doRunJob(QueuedThreadPool.java:1194)
at app//org.eclipse.jetty.util.thread.QueuedThreadPool$Runner.run(QueuedThreadPool.java:1149)
at java.base@11.0.16.1/java.lang.Thread.run(Thread.java:829)
26) Thread[id=4850, name=h2sc-2777-thread-1, state=RUNNABLE, group=TGRP-ShardRoutingCustomTest]
at java.base@11.0.16.1/sun.nio.ch.EPoll.wait(Native Method)
at java.base@11.0.16.1/sun.nio.ch.EPollSelectorImpl.doSelect(EPollSelectorImpl.java:120)
at java.base@11.0.16.1/sun.nio.ch.SelectorImpl.lockAndDoSelect(SelectorImpl.java:124)
at java.base@11.0.16.1/sun.nio.ch.SelectorImpl.select(SelectorImpl.java:141)
at app//org.eclipse.jetty.io.ManagedSelector.nioSelect(ManagedSelector.java:180)
at app//org.eclipse.jetty.io.ManagedSelector.select(ManagedSelector.java:187)
at app//org.eclipse.jetty.io.ManagedSelector$SelectorProducer.select(ManagedSelector.java:604)
at app//org.eclipse.jetty.io.ManagedSelector$SelectorProducer.produce(ManagedSelector.java:541)
at app//org.eclipse.jetty.util.thread.strategy.AdaptiveExecutionStrategy.produceTask(AdaptiveExecutionStrategy.java:450)
at app//org.eclipse.jetty.util.thread.strategy.AdaptiveExecutionStrategy.tryProduce(AdaptiveExecutionStrategy.java:243)
at app//org.eclipse.jetty.util.thread.strategy.AdaptiveExecutionStrategy.produce(AdaptiveExecutionStrategy.java:194)
at app//org.eclipse.jetty.io.ManagedSelector$$Lambda$329/0x000000010052b440.run(Unknown Source)
at app//org.apache.solr.common.util.ExecutorUtil$MDCAwareThreadPoolExecutor.lambda$execute$0(ExecutorUtil.java:289)
at app//org.apache.solr.common.util.ExecutorUtil$MDCAwareThreadPoolExecutor$$Lambda$330/0x000000010052ac40.run(Unknown Source)
at java.base@11.0.16.1/java.util.concurrent.ThreadPoolExecutor.runWorker(ThreadPoolExecutor.java:1128)
at java.base@11.0.16.1/java.util.concurrent.ThreadPoolExecutor$Worker.run(ThreadPoolExecutor.java:628)
at java.base@11.0.16.1/java.lang.Thread.run(Thread.java:829)
27) Thread[id=4868, name=zkCallback-2781-thread-2, state=TIMED_WAITING, group=TGRP-ShardRoutingCustomTest]
at java.base@11.0.16.1/jdk.internal.misc.Unsafe.park(Native Method)
at java.base@11.0.16.1/java.util.concurrent.locks.LockSupport.parkNanos(LockSupport.java:234)
at java.base@11.0.16.1/java.util.concurrent.SynchronousQueue$TransferStack.awaitFulfill(SynchronousQueue.java:462)
at java.base@11.0.16.1/java.util.concurrent.SynchronousQueue$TransferStack.transfer(SynchronousQueue.java:361)
at java.base@11.0.16.1/java.util.concurrent.SynchronousQueue.poll(SynchronousQueue.java:937)
at java.base@11.0.16.1/java.util.concurrent.ThreadPoolExecutor.getTask(ThreadPoolExecutor.java:1053)
at java.base@11.0.16.1/java.util.concurrent.ThreadPoolExecutor.runWorker(ThreadPoolExecutor.java:1114)
at java.base@11.0.16.1/java.util.concurrent.ThreadPoolExecutor$Worker.run(ThreadPoolExecutor.java:628)
at java.base@11.0.16.1/java.lang.Thread.run(Thread.java:829)
28) Thread[id=4839, name=qtp2130335196-4839, state=TIMED_WAITING, group=TGRP-ShardRoutingCustomTest]
at java.base@11.0.16.1/jdk.internal.misc.Unsafe.park(Native Method)
at java.base@11.0.16.1/java.util.concurrent.locks.LockSupport.parkNanos(LockSupport.java:234)
at java.base@11.0.16.1/java.util.concurrent.locks.AbstractQueuedSynchronizer$ConditionObject.awaitNanos(AbstractQueuedSynchronizer.java:2123)
at app//org.eclipse.jetty.util.BlockingArrayQueue.poll(BlockingArrayQueue.java:219)
at app//org.eclipse.jetty.util.thread.QueuedThreadPool$Runner.idleJobPoll(QueuedThreadPool.java:1124)
at app//org.eclipse.jetty.util.thread.QueuedThreadPool$Runner.run(QueuedThreadPool.java:1141)
at java.base@11.0.16.1/java.lang.Thread.run(Thread.java:829)
29) Thread[id=4870, name=searcherExecutor-2789-thread-1, state=WAITING, group=TGRP-ShardRoutingCustomTest]
at java.base@11.0.16.1/jdk.internal.misc.Unsafe.park(Native Method)
at java.base@11.0.16.1/java.util.concurrent.locks.LockSupport.park(LockSupport.java:194)
at java.base@11.0.16.1/java.util.concurrent.locks.AbstractQueuedSynchronizer$ConditionObject.await(AbstractQueuedSynchronizer.java:2081)
at java.base@11.0.16.1/java.util.concurrent.LinkedBlockingQueue.take(LinkedBlockingQueue.java:433)
at java.base@11.0.16.1/java.util.concurrent.ThreadPoolExecutor.getTask(ThreadPoolExecutor.java:1054)
at java.base@11.0.16.1/java.util.concurrent.ThreadPoolExecutor.runWorker(ThreadPoolExecutor.java:1114)
at java.base@11.0.16.1/java.util.concurrent.ThreadPoolExecutor$Worker.run(ThreadPoolExecutor.java:628)
at java.base@11.0.16.1/java.lang.Thread.run(Thread.java:829)
Stack Trace:
com.carrotsearch.randomizedtesting.ThreadLeakError: 29 threads leaked from SUITE scope at org.apache.solr.cloud.ShardRoutingCustomTest:
1) Thread[id=4895, name=zkCallback-2781-thread-5, state=TIMED_WAITING, group=TGRP-ShardRoutingCustomTest]
at java.base@11.0.16.1/jdk.internal.misc.Unsafe.park(Native Method)
at java.base@11.0.16.1/java.util.concurrent.locks.LockSupport.parkNanos(LockSupport.java:234)
at java.base@11.0.16.1/java.util.concurrent.SynchronousQueue$TransferStack.awaitFulfill(SynchronousQueue.java:462)
at java.base@11.0.16.1/java.util.concurrent.SynchronousQueue$TransferStack.transfer(SynchronousQueue.java:361)
at java.base@11.0.16.1/java.util.concurrent.SynchronousQueue.poll(SynchronousQueue.java:937)
at java.base@11.0.16.1/java.util.concurrent.ThreadPoolExecutor.getTask(ThreadPoolExecutor.java:1053)
at java.base@11.0.16.1/java.util.concurrent.ThreadPoolExecutor.runWorker(ThreadPoolExecutor.java:1114)
at java.base@11.0.16.1/java.util.concurrent.ThreadPoolExecutor$Worker.run(ThreadPoolExecutor.java:628)
at java.base@11.0.16.1/java.lang.Thread.run(Thread.java:829)
2) Thread[id=4874, name=zkCallback-2781-thread-3, state=WAITING, group=TGRP-ShardRoutingCustomTest]
at java.base@11.0.16.1/java.lang.Object.wait(Native Method)
at java.base@11.0.16.1/java.lang.Object.wait(Object.java:328)
at app//org.apache.zookeeper.ClientCnxn.submitRequest(ClientCnxn.java:1577)
at app//org.apache.zookeeper.ClientCnxn.submitRequest(ClientCnxn.java:1549)
at app//org.apache.zookeeper.ZooKeeper.create(ZooKeeper.java:1345)
at app//org.apache.solr.common.cloud.SolrZkClient.lambda$makePath$10(SolrZkClient.java:688)
at app//org.apache.solr.common.cloud.SolrZkClient$$Lambda$820/0x0000000100908440.execute(Unknown Source)
at app//org.apache.solr.common.cloud.ZkCmdExecutor.retryOperation(ZkCmdExecutor.java:70)
at app//org.apache.solr.common.cloud.SolrZkClient.makePath(SolrZkClient.java:686)
at app//org.apache.solr.common.cloud.SolrZkClient.makePath(SolrZkClient.java:610)
at app//org.apache.solr.common.cloud.SolrZkClient.makePath(SolrZkClient.java:596)
at app//org.apache.solr.cloud.OverseerElectionContext.runLeaderProcess(OverseerElectionContext.java:65)
at app//org.apache.solr.cloud.LeaderElector.runIamLeaderProcess(LeaderElector.java:170)
at app//org.apache.solr.cloud.LeaderElector.checkIfIamLeader(LeaderElector.java:130)
at app//org.apache.solr.cloud.LeaderElector$ElectionWatcher.process(LeaderElector.java:350)
at app//org.apache.solr.common.cloud.SolrZkClient$ProcessWatchWithExecutor.lambda$process$1(SolrZkClient.java:1047)
at app//org.apache.solr.common.cloud.SolrZkClient$ProcessWatchWithExecutor$$Lambda$911/0x0000000100976c40.run(Unknown Source)
at java.base@11.0.16.1/java.util.concurrent.Executors$RunnableAdapter.call(Executors.java:515)
at java.base@11.0.16.1/java.util.concurrent.FutureTask.run(FutureTask.java:264)
at app//org.apache.solr.common.util.ExecutorUtil$MDCAwareThreadPoolExecutor.lambda$execute$0(ExecutorUtil.java:289)
at app//org.apache.solr.common.util.ExecutorUtil$MDCAwareThreadPoolExecutor$$Lambda$330/0x000000010052ac40.run(Unknown Source)
at java.base@11.0.16.1/java.util.concurrent.ThreadPoolExecutor.runWorker(ThreadPoolExecutor.java:1128)
at java.base@11.0.16.1/java.util.concurrent.ThreadPoolExecutor$Worker.run(ThreadPoolExecutor.java:628)
at java.base@11.0.16.1/java.lang.Thread.run(Thread.java:829)
3) Thread[id=4838, name=qtp2130335196-4838, state=TIMED_WAITING, group=TGRP-ShardRoutingCustomTest]
at java.base@11.0.16.1/jdk.internal.misc.Unsafe.park(Native Method)
at java.base@11.0.16.1/java.util.concurrent.locks.LockSupport.parkNanos(LockSupport.java:234)
at java.base@11.0.16.1/java.util.concurrent.locks.AbstractQueuedSynchronizer$ConditionObject.awaitNanos(AbstractQueuedSynchronizer.java:2123)
at app//org.eclipse.jetty.util.BlockingArrayQueue.poll(BlockingArrayQueue.java:219)
at app//org.eclipse.jetty.util.thread.QueuedThreadPool$Runner.idleJobPoll(QueuedThreadPool.java:1124)
at app//org.eclipse.jetty.util.thread.QueuedThreadPool$Runner.run(QueuedThreadPool.java:1141)
at java.base@11.0.16.1/java.lang.Thread.run(Thread.java:829)
4) Thread[id=4862, name=Connector-Scheduler-4c438d99-1, state=TIMED_WAITING, group=TGRP-ShardRoutingCustomTest]
at java.base@11.0.16.1/jdk.internal.misc.Unsafe.park(Native Method)
at java.base@11.0.16.1/java.util.concurrent.locks.LockSupport.parkNanos(LockSupport.java:234)
at java.base@11.0.16.1/java.util.concurrent.locks.AbstractQueuedSynchronizer$ConditionObject.awaitNanos(AbstractQueuedSynchronizer.java:2123)
at java.base@11.0.16.1/java.util.concurrent.ScheduledThreadPoolExecutor$DelayedWorkQueue.take(ScheduledThreadPoolExecutor.java:1182)
at java.base@11.0.16.1/java.util.concurrent.ScheduledThreadPoolExecutor$DelayedWorkQueue.take(ScheduledThreadPoolExecutor.java:899)
at java.base@11.0.16.1/java.util.concurrent.ThreadPoolExecutor.getTask(ThreadPoolExecutor.java:1054)
at java.base@11.0.16.1/java.util.concurrent.ThreadPoolExecutor.runWorker(ThreadPoolExecutor.java:1114)
at java.base@11.0.16.1/java.util.concurrent.ThreadPoolExecutor$Worker.run(ThreadPoolExecutor.java:628)
at java.base@11.0.16.1/java.lang.Thread.run(Thread.java:829)
5) Thread[id=4840, name=qtp2130335196-4840, state=TIMED_WAITING, group=TGRP-ShardRoutingCustomTest]
at java.base@11.0.16.1/jdk.internal.misc.Unsafe.park(Native Method)
at java.base@11.0.16.1/java.util.concurrent.locks.LockSupport.parkNanos(LockSupport.java:234)
at java.base@11.0.16.1/java.util.concurrent.locks.AbstractQueuedSynchronizer$ConditionObject.awaitNanos(AbstractQueuedSynchronizer.java:2123)
at app//org.eclipse.jetty.util.BlockingArrayQueue.poll(BlockingArrayQueue.java:219)
at app//org.eclipse.jetty.util.thread.QueuedThreadPool$Runner.idleJobPoll(QueuedThreadPool.java:1124)
at app//org.eclipse.jetty.util.thread.QueuedThreadPool$Runner.run(QueuedThreadPool.java:1141)
at java.base@11.0.16.1/java.lang.Thread.run(Thread.java:829)
6) Thread[id=4894, name=zkCallback-2781-thread-4, state=TIMED_WAITING, group=TGRP-ShardRoutingCustomTest]
at java.base@11.0.16.1/jdk.internal.misc.Unsafe.park(Native Method)
at java.base@11.0.16.1/java.util.concurrent.locks.LockSupport.parkNanos(LockSupport.java:234)
at java.base@11.0.16.1/java.util.concurrent.SynchronousQueue$TransferStack.awaitFulfill(SynchronousQueue.java:462)
at java.base@11.0.16.1/java.util.concurrent.SynchronousQueue$TransferStack.transfer(SynchronousQueue.java:361)
at java.base@11.0.16.1/java.util.concurrent.SynchronousQueue.poll(SynchronousQueue.java:937)
at java.base@11.0.16.1/java.util.concurrent.ThreadPoolExecutor.getTask(ThreadPoolExecutor.java:1053)
at java.base@11.0.16.1/java.util.concurrent.ThreadPoolExecutor.runWorker(ThreadPoolExecutor.java:1114)
at java.base@11.0.16.1/java.util.concurrent.ThreadPoolExecutor$Worker.run(ThreadPoolExecutor.java:628)
at java.base@11.0.16.1/java.lang.Thread.run(Thread.java:829)
7) Thread[id=4855, name=TEST-ShardRoutingCustomTest.test-seed#[FC377411B7D025DA]-SendThread(127.0.0.1:34533), state=TIMED_WAITING, group=TGRP-ShardRoutingCustomTest]
at java.base@11.0.16.1/java.lang.Thread.sleep(Native Method)
at app//org.apache.zookeeper.ClientCnxn$SendThread.startConnect(ClientCnxn.java:1127)
at app//org.apache.zookeeper.ClientCnxn$SendThread.run(ClientCnxn.java:1192)
8) Thread[id=4846, name=httpShardExecutor-2775-thread-1, state=RUNNABLE, group=TGRP-ShardRoutingCustomTest]
at java.base@11.0.16.1/sun.nio.ch.EPoll.wait(Native Method)
at java.base@11.0.16.1/sun.nio.ch.EPollSelectorImpl.doSelect(EPollSelectorImpl.java:120)
at java.base@11.0.16.1/sun.nio.ch.SelectorImpl.lockAndDoSelect(SelectorImpl.java:124)
at java.base@11.0.16.1/sun.nio.ch.SelectorImpl.select(SelectorImpl.java:141)
at app//org.eclipse.jetty.io.ManagedSelector.nioSelect(ManagedSelector.java:180)
at app//org.eclipse.jetty.io.ManagedSelector.select(ManagedSelector.java:187)
at app//org.eclipse.jetty.io.ManagedSelector$SelectorProducer.select(ManagedSelector.java:604)
at app//org.eclipse.jetty.io.ManagedSelector$SelectorProducer.produce(ManagedSelector.java:541)
at app//org.eclipse.jetty.util.thread.strategy.AdaptiveExecutionStrategy.produceTask(AdaptiveExecutionStrategy.java:450)
at app//org.eclipse.jetty.util.thread.strategy.AdaptiveExecutionStrategy.tryProduce(AdaptiveExecutionStrategy.java:243)
at app//org.eclipse.jetty.util.thread.strategy.AdaptiveExecutionStrategy.produce(AdaptiveExecutionStrategy.java:194)
at app//org.eclipse.jetty.io.ManagedSelector$$Lambda$329/0x000000010052b440.run(Unknown Source)
at app//org.apache.solr.common.util.ExecutorUtil$MDCAwareThreadPoolExecutor.lambda$execute$0(ExecutorUtil.java:289)
at app//org.apache.solr.common.util.ExecutorUtil$MDCAwareThreadPoolExecutor$$Lambda$330/0x000000010052ac40.run(Unknown Source)
at java.base@11.0.16.1/java.util.concurrent.ThreadPoolExecutor.runWorker(ThreadPoolExecutor.java:1128)
at java.base@11.0.16.1/java.util.concurrent.ThreadPoolExecutor$Worker.run(ThreadPoolExecutor.java:628)
at java.base@11.0.16.1/java.lang.Thread.run(Thread.java:829)
9) Thread[id=4856, name=TEST-ShardRoutingCustomTest.test-seed#[FC377411B7D025DA]-EventThread, state=WAITING, group=TGRP-ShardRoutingCustomTest]
at java.base@11.0.16.1/jdk.internal.misc.Unsafe.park(Native Method)
at java.base@11.0.16.1/java.util.concurrent.locks.LockSupport.park(LockSupport.java:194)
at java.base@11.0.16.1/java.util.concurrent.locks.AbstractQueuedSynchronizer$ConditionObject.await(AbstractQueuedSynchronizer.java:2081)
at java.base@11.0.16.1/java.util.concurrent.LinkedBlockingQueue.take(LinkedBlockingQueue.java:433)
at app//org.apache.zookeeper.ClientCnxn$EventThread.run(ClientCnxn.java:534)
10) Thread[id=4836, name=qtp2130335196-4836, state=TIMED_WAITING, group=TGRP-ShardRoutingCustomTest]
at java.base@11.0.16.1/jdk.internal.misc.Unsafe.park(Native Method)
at java.base@11.0.16.1/java.util.concurrent.locks.LockSupport.parkNanos(LockSupport.java:234)
at java.base@11.0.16.1/java.util.concurrent.locks.AbstractQueuedSynchronizer$ConditionObject.awaitNanos(AbstractQueuedSynchronizer.java:2123)
at app//org.eclipse.jetty.util.BlockingArrayQueue.poll(BlockingArrayQueue.java:219)
at app//org.eclipse.jetty.util.thread.QueuedThreadPool$Runner.idleJobPoll(QueuedThreadPool.java:1124)
at app//org.eclipse.jetty.util.thread.QueuedThreadPool$Runner.run(QueuedThreadPool.java:1141)
at java.base@11.0.16.1/java.lang.Thread.run(Thread.java:829)
11) Thread[id=4861, name=coreContainerWorkExecutor-2772-thread-1, state=TIMED_WAITING, group=TGRP-ShardRoutingCustomTest]
at java.base@11.0.16.1/jdk.internal.misc.Unsafe.park(Native Method)
at java.base@11.0.16.1/java.util.concurrent.locks.LockSupport.parkNanos(LockSupport.java:234)
at java.base@11.0.16.1/java.util.concurrent.SynchronousQueue$TransferStack.awaitFulfill(SynchronousQueue.java:462)
at java.base@11.0.16.1/java.util.concurrent.SynchronousQueue$TransferStack.transfer(SynchronousQueue.java:361)
at java.base@11.0.16.1/java.util.concurrent.SynchronousQueue.poll(SynchronousQueue.java:937)
at java.base@11.0.16.1/java.util.concurrent.ThreadPoolExecutor.getTask(ThreadPoolExecutor.java:1053)
at java.base@11.0.16.1/java.util.concurrent.ThreadPoolExecutor.runWorker(ThreadPoolExecutor.java:1114)
at java.base@11.0.16.1/java.util.concurrent.ThreadPoolExecutor$Worker.run(ThreadPoolExecutor.java:628)
at java.base@11.0.16.1/java.lang.Thread.run(Thread.java:829)
12) Thread[id=4835, name=qtp2130335196-4835-acceptor-0@705e0b-ServerConnector@4c438d99{ssl, (ssl, alpn, http/1.1, h2)}{127.0.0.1:38495}, state=RUNNABLE, group=TGRP-ShardRoutingCustomTest]
at java.base@11.0.16.1/sun.nio.ch.ServerSocketChannelImpl.accept0(Native Method)
at java.base@11.0.16.1/sun.nio.ch.ServerSocketChannelImpl.accept(ServerSocketChannelImpl.java:533)
at java.base@11.0.16.1/sun.nio.ch.ServerSocketChannelImpl.accept(ServerSocketChannelImpl.java:285)
at app//org.eclipse.jetty.server.ServerConnector.accept(ServerConnector.java:409)
at app//org.eclipse.jetty.server.AbstractConnector$Acceptor.run(AbstractConnector.java:748)
at app//org.eclipse.jetty.util.thread.QueuedThreadPool.runJob(QueuedThreadPool.java:969)
at app//org.eclipse.jetty.util.thread.QueuedThreadPool$Runner.doRunJob(QueuedThreadPool.java:1194)
at app//org.eclipse.jetty.util.thread.QueuedThreadPool$Runner.run(QueuedThreadPool.java:1149)
at java.base@11.0.16.1/java.lang.Thread.run(Thread.java:829)
13) Thread[id=4841, name=qtp2130335196-4841, state=TIMED_WAITING, group=TGRP-ShardRoutingCustomTest]
at java.base@11.0.16.1/jdk.internal.misc.Unsafe.park(Native Method)
at java.base@11.0.16.1/java.util.concurrent.locks.LockSupport.parkNanos(LockSupport.java:234)
at java.base@11.0.16.1/java.util.concurrent.locks.AbstractQueuedSynchronizer$ConditionObject.awaitNanos(AbstractQueuedSynchronizer.java:2123)
at app//org.eclipse.jetty.util.BlockingArrayQueue.poll(BlockingArrayQueue.java:219)
at app//org.eclipse.jetty.util.thread.QueuedThreadPool$Runner.idleJobPoll(QueuedThreadPool.java:1124)
at app//org.eclipse.jetty.util.thread.QueuedThreadPool$Runner.run(QueuedThreadPool.java:1141)
at java.base@11.0.16.1/java.lang.Thread.run(Thread.java:829)
14) Thread[id=4837, name=qtp2130335196-4837, state=TIMED_WAITING, group=TGRP-ShardRoutingCustomTest]
at java.base@11.0.16.1/jdk.internal.misc.Unsafe.park(Native Method)
at java.base@11.0.16.1/java.util.concurrent.locks.LockSupport.parkNanos(LockSupport.java:234)
at java.base@11.0.16.1/java.util.concurrent.locks.AbstractQueuedSynchronizer$ConditionObject.awaitNanos(AbstractQueuedSynchronizer.java:2123)
at app//org.eclipse.jetty.util.BlockingArrayQueue.poll(BlockingArrayQueue.java:219)
at app//org.eclipse.jetty.util.thread.QueuedThreadPool$Runner.idleJobPoll(QueuedThreadPool.java:1124)
at app//org.eclipse.jetty.util.thread.QueuedThreadPool$Runner.run(QueuedThreadPool.java:1141)
at java.base@11.0.16.1/java.lang.Thread.run(Thread.java:829)
15) Thread[id=4858, name=zkCallback-2781-thread-1, state=TIMED_WAITING, group=TGRP-ShardRoutingCustomTest]
at java.base@11.0.16.1/jdk.internal.misc.Unsafe.park(Native Method)
at java.base@11.0.16.1/java.util.concurrent.locks.LockSupport.parkNanos(LockSupport.java:234)
at java.base@11.0.16.1/java.util.concurrent.SynchronousQueue$TransferStack.awaitFulfill(SynchronousQueue.java:462)
at java.base@11.0.16.1/java.util.concurrent.SynchronousQueue$TransferStack.transfer(SynchronousQueue.java:361)
at java.base@11.0.16.1/java.util.concurrent.SynchronousQueue.poll(SynchronousQueue.java:937)
at java.base@11.0.16.1/java.util.concurrent.ThreadPoolExecutor.getTask(ThreadPoolExecutor.java:1053)
at java.base@11.0.16.1/java.util.concurrent.ThreadPoolExecutor.runWorker(ThreadPoolExecutor.java:1114)
at java.base@11.0.16.1/java.util.concurrent.ThreadPoolExecutor$Worker.run(ThreadPoolExecutor.java:628)
at java.base@11.0.16.1/java.lang.Thread.run(Thread.java:829)
16) Thread[id=4860, name=CloserThread, state=WAITING, group=TGRP-ShardRoutingCustomTest]
at java.base@11.0.16.1/java.lang.Object.wait(Native Method)
at java.base@11.0.16.1/java.lang.Object.wait(Object.java:328)
at app//org.apache.solr.core.CloserThread.run(CoreContainer.java:2560)
17) Thread[id=4896, name=zkCallback-2781-thread-6, state=TIMED_WAITING, group=TGRP-ShardRoutingCustomTest]
at java.base@11.0.16.1/jdk.internal.misc.Unsafe.park(Native Method)
at java.base@11.0.16.1/java.util.concurrent.locks.LockSupport.parkNanos(LockSupport.java:234)
at java.base@11.0.16.1/java.util.concurrent.SynchronousQueue$TransferStack.awaitFulfill(SynchronousQueue.java:462)
at java.base@11.0.16.1/java.util.concurrent.SynchronousQueue$TransferStack.transfer(SynchronousQueue.java:361)
at java.base@11.0.16.1/java.util.concurrent.SynchronousQueue.poll(SynchronousQueue.java:937)
at java.base@11.0.16.1/java.util.concurrent.ThreadPoolExecutor.getTask(ThreadPoolExecutor.java:1053)
at java.base@11.0.16.1/java.util.concurrent.ThreadPoolExecutor.runWorker(ThreadPoolExecutor.java:1114)
at java.base@11.0.16.1/java.util.concurrent.ThreadPoolExecutor$Worker.run(ThreadPoolExecutor.java:628)
at java.base@11.0.16.1/java.lang.Thread.run(Thread.java:829)
18) Thread[id=4847, name=httpShardExecutor-2775-thread-2, state=RUNNABLE, group=TGRP-ShardRoutingCustomTest]
at java.base@11.0.16.1/sun.nio.ch.EPoll.wait(Native Method)
at java.base@11.0.16.1/sun.nio.ch.EPollSelectorImpl.doSelect(EPollSelectorImpl.java:120)
at java.base@11.0.16.1/sun.nio.ch.SelectorImpl.lockAndDoSelect(SelectorImpl.java:124)
at java.base@11.0.16.1/sun.nio.ch.SelectorImpl.select(SelectorImpl.java:141)
at app//org.eclipse.jetty.io.ManagedSelector.nioSelect(ManagedSelector.java:180)
at app//org.eclipse.jetty.io.ManagedSelector.select(ManagedSelector.java:187)
at app//org.eclipse.jetty.io.ManagedSelector$SelectorProducer.select(ManagedSelector.java:604)
at app//org.eclipse.jetty.io.ManagedSelector$SelectorProducer.produce(ManagedSelector.java:541)
at app//org.eclipse.jetty.util.thread.strategy.AdaptiveExecutionStrategy.produceTask(AdaptiveExecutionStrategy.java:450)
at app//org.eclipse.jetty.util.thread.strategy.AdaptiveExecutionStrategy.tryProduce(AdaptiveExecutionStrategy.java:243)
at app//org.eclipse.jetty.util.thread.strategy.AdaptiveExecutionStrategy.produce(AdaptiveExecutionStrategy.java:194)
at app//org.eclipse.jetty.io.ManagedSelector$$Lambda$329/0x000000010052b440.run(Unknown Source)
at app//org.apache.solr.common.util.ExecutorUtil$MDCAwareThreadPoolExecutor.lambda$execute$0(ExecutorUtil.java:289)
at app//org.apache.solr.common.util.ExecutorUtil$MDCAwareThreadPoolExecutor$$Lambda$330/0x000000010052ac40.run(Unknown Source)
at java.base@11.0.16.1/java.util.concurrent.ThreadPoolExecutor.runWorker(ThreadPoolExecutor.java:1128)
at java.base@11.0.16.1/java.util.concurrent.ThreadPoolExecutor$Worker.run(ThreadPoolExecutor.java:628)
at java.base@11.0.16.1/java.lang.Thread.run(Thread.java:829)
19) Thread[id=4865, name=watches-2783-thread-1, state=TIMED_WAITING, group=TGRP-ShardRoutingCustomTest]
at java.base@11.0.16.1/jdk.internal.misc.Unsafe.park(Native Method)
at java.base@11.0.16.1/java.util.concurrent.locks.LockSupport.parkNanos(LockSupport.java:234)
at java.base@11.0.16.1/java.util.concurrent.SynchronousQueue$TransferStack.awaitFulfill(SynchronousQueue.java:462)
at java.base@11.0.16.1/java.util.concurrent.SynchronousQueue$TransferStack.transfer(SynchronousQueue.java:361)
at java.base@11.0.16.1/java.util.concurrent.SynchronousQueue.poll(SynchronousQueue.java:937)
at java.base@11.0.16.1/java.util.concurrent.ThreadPoolExecutor.getTask(ThreadPoolExecutor.java:1053)
at java.base@11.0.16.1/java.util.concurrent.ThreadPoolExecutor.runWorker(ThreadPoolExecutor.java:1114)
at java.base@11.0.16.1/java.util.concurrent.ThreadPoolExecutor$Worker.run(ThreadPoolExecutor.java:628)
at java.base@11.0.16.1/java.lang.Thread.run(Thread.java:829)
20) Thread[id=4857, name=zkConnectionManagerCallback-2782-thread-1, state=WAITING, group=TGRP-ShardRoutingCustomTest]
at java.base@11.0.16.1/jdk.internal.misc.Unsafe.park(Native Method)
at java.base@11.0.16.1/java.util.concurrent.locks.LockSupport.park(LockSupport.java:194)
at java.base@11.0.16.1/java.util.concurrent.locks.AbstractQueuedSynchronizer$ConditionObject.await(AbstractQueuedSynchronizer.java:2081)
at java.base@11.0.16.1/java.util.concurrent.LinkedBlockingQueue.take(LinkedBlockingQueue.java:433)
at java.base@11.0.16.1/java.util.concurrent.ThreadPoolExecutor.getTask(ThreadPoolExecutor.java:1054)
at java.base@11.0.16.1/java.util.concurrent.ThreadPoolExecutor.runWorker(ThreadPoolExecutor.java:1114)
at java.base@11.0.16.1/java.util.concurrent.ThreadPoolExecutor$Worker.run(ThreadPoolExecutor.java:628)
at java.base@11.0.16.1/java.lang.Thread.run(Thread.java:829)
21) Thread[id=4851, name=h2sc-2777-thread-2, state=RUNNABLE, group=TGRP-ShardRoutingCustomTest]
at java.base@11.0.16.1/sun.nio.ch.EPoll.wait(Native Method)
at java.base@11.0.16.1/sun.nio.ch.EPollSelectorImpl.doSelect(EPollSelectorImpl.java:120)
at java.base@11.0.16.1/sun.nio.ch.SelectorImpl.lockAndDoSelect(SelectorImpl.java:124)
at java.base@11.0.16.1/sun.nio.ch.SelectorImpl.select(SelectorImpl.java:141)
at app//org.eclipse.jetty.io.ManagedSelector.nioSelect(ManagedSelector.java:180)
at app//org.eclipse.jetty.io.ManagedSelector.select(ManagedSelector.java:187)
at app//org.eclipse.jetty.io.ManagedSelector$SelectorProducer.select(ManagedSelector.java:604)
at app//org.eclipse.jetty.io.ManagedSelector$SelectorProducer.produce(ManagedSelector.java:541)
at app//org.eclipse.jetty.util.thread.strategy.AdaptiveExecutionStrategy.produceTask(AdaptiveExecutionStrategy.java:450)
at app//org.eclipse.jetty.util.thread.strategy.AdaptiveExecutionStrategy.tryProduce(AdaptiveExecutionStrategy.java:243)
at app//org.eclipse.jetty.util.thread.strategy.AdaptiveExecutionStrategy.produce(AdaptiveExecutionStrategy.java:194)
at app//org.eclipse.jetty.io.ManagedSelector$$Lambda$329/0x000000010052b440.run(Unknown Source)
at app//org.apache.solr.common.util.ExecutorUtil$MDCAwareThreadPoolExecutor.lambda$execute$0(ExecutorUtil.java:289)
at app//org.apache.solr.common.util.ExecutorUtil$MDCAwareThreadPoolExecutor$$Lambda$330/0x000000010052ac40.run(Unknown Source)
at java.base@11.0.16.1/java.util.concurrent.ThreadPoolExecutor.runWorker(ThreadPoolExecutor.java:1128)
at java.base@11.0.16.1/java.util.concurrent.ThreadPoolExecutor$Worker.run(ThreadPoolExecutor.java:628)
at java.base@11.0.16.1/java.lang.Thread.run(Thread.java:829)
22) Thread[id=4897, name=zkCallback-2781-thread-7, state=TIMED_WAITING, group=TGRP-ShardRoutingCustomTest]
at java.base@11.0.16.1/jdk.internal.misc.Unsafe.park(Native Method)
at java.base@11.0.16.1/java.util.concurrent.locks.LockSupport.parkNanos(LockSupport.java:234)
at java.base@11.0.16.1/java.util.concurrent.SynchronousQueue$TransferStack.awaitFulfill(SynchronousQueue.java:462)
at java.base@11.0.16.1/java.util.concurrent.SynchronousQueue$TransferStack.transfer(SynchronousQueue.java:361)
at java.base@11.0.16.1/java.util.concurrent.SynchronousQueue.poll(SynchronousQueue.java:937)
at java.base@11.0.16.1/java.util.concurrent.ThreadPoolExecutor.getTask(ThreadPoolExecutor.java:1053)
at java.base@11.0.16.1/java.util.concurrent.ThreadPoolExecutor.runWorker(ThreadPoolExecutor.java:1114)
at java.base@11.0.16.1/java.util.concurrent.ThreadPoolExecutor$Worker.r
[...truncated too long message...]
-Ptests.seed=FC377411B7D025DA -Ptests.multiplier=2 -Ptests.badapples=false -Ptests.file.encoding=UTF-8
- org.apache.solr.cloud.ReplicationFactorTest.test (:solr:core)
Test output: /home/jenkins/jenkins-home/712657a4/workspace/Solr/Solr-Check-main-s390x/solr/core/build/test-results/test/outputs/OUTPUT-org.apache.solr.cloud.ReplicationFactorTest.txt
Reproduce with: gradlew :solr:core:test --tests "org.apache.solr.cloud.ReplicationFactorTest.test" -Ptests.jvms=4 -Ptests.haltonfailure=false "-Ptests.jvmargs=-XX:TieredStopAtLevel=1 -XX:+UseParallelGC -XX:ActiveProcessorCount=1 -XX:ReservedCodeCacheSize=120m" -Ptests.seed=FC377411B7D025DA -Ptests.multiplier=2 -Ptests.badapples=false -Ptests.file.encoding=UTF-8
- org.apache.solr.cloud.ReplaceNodeTest.test (:solr:core)
Test output: /home/jenkins/jenkins-home/712657a4/workspace/Solr/Solr-Check-main-s390x/solr/core/build/test-results/test/outputs/OUTPUT-org.apache.solr.cloud.ReplaceNodeTest.txt
Reproduce with: gradlew :solr:core:test --tests "org.apache.solr.cloud.ReplaceNodeTest.test" -Ptests.jvms=4 -Ptests.haltonfailure=false "-Ptests.jvmargs=-XX:TieredStopAtLevel=1 -XX:+UseParallelGC -XX:ActiveProcessorCount=1 -XX:ReservedCodeCacheSize=120m" -Ptests.seed=FC377411B7D025DA -Ptests.multiplier=2 -Ptests.badapples=false -Ptests.file.encoding=UTF-8
- org.apache.solr.cloud.TestDynamicFieldNamesIndexCorrectly.test (:solr:core)
Test output: /home/jenkins/jenkins-home/712657a4/workspace/Solr/Solr-Check-main-s390x/solr/core/build/test-results/test/outputs/OUTPUT-org.apache.solr.cloud.TestDynamicFieldNamesIndexCorrectly.txt
Reproduce with: gradlew :solr:core:test --tests "org.apache.solr.cloud.TestDynamicFieldNamesIndexCorrectly.test" -Ptests.jvms=4 -Ptests.haltonfailure=false "-Ptests.jvmargs=-XX:TieredStopAtLevel=1 -XX:+UseParallelGC -XX:ActiveProcessorCount=1 -XX:ReservedCodeCacheSize=120m" -Ptests.seed=FC377411B7D025DA -Ptests.multiplier=2 -Ptests.badapples=false -Ptests.file.encoding=UTF-8
- org.apache.solr.cloud.TestOnReconnectListenerSupport.test (:solr:core)
Test output: /home/jenkins/jenkins-home/712657a4/workspace/Solr/Solr-Check-main-s390x/solr/core/build/test-results/test/outputs/OUTPUT-org.apache.solr.cloud.TestOnReconnectListenerSupport.txt
Reproduce with: gradlew :solr:core:test --tests "org.apache.solr.cloud.TestOnReconnectListenerSupport.test" -Ptests.jvms=4 -Ptests.haltonfailure=false "-Ptests.jvmargs=-XX:TieredStopAtLevel=1 -XX:+UseParallelGC -XX:ActiveProcessorCount=1 -XX:ReservedCodeCacheSize=120m" -Ptests.seed=FC377411B7D025DA -Ptests.multiplier=2 -Ptests.badapples=false -Ptests.file.encoding=UTF-8
- org.apache.solr.metrics.reporters.SolrJmxReporterTest.testClosedCore (:solr:core)
Test output: /home/jenkins/jenkins-home/712657a4/workspace/Solr/Solr-Check-main-s390x/solr/core/build/test-results/test/outputs/OUTPUT-org.apache.solr.metrics.reporters.SolrJmxReporterTest.txt
Reproduce with: gradlew :solr:core:test --tests "org.apache.solr.metrics.reporters.SolrJmxReporterTest.testClosedCore" -Ptests.jvms=4 -Ptests.haltonfailure=false "-Ptests.jvmargs=-XX:TieredStopAtLevel=1 -XX:+UseParallelGC -XX:ActiveProcessorCount=1 -XX:ReservedCodeCacheSize=120m" -Ptests.seed=FC377411B7D025DA -Ptests.multiplier=2 -Ptests.badapples=false -Ptests.file.encoding=UTF-8
- org.apache.solr.search.join.ShardJoinImplicitTest.classMethod (:solr:core)
Test output: /home/jenkins/jenkins-home/712657a4/workspace/Solr/Solr-Check-main-s390x/solr/core/build/test-results/test/outputs/OUTPUT-org.apache.solr.search.join.ShardJoinImplicitTest.txt
Reproduce with: gradlew :solr:core:test --tests "org.apache.solr.search.join.ShardJoinImplicitTest.classMethod" -Ptests.jvms=4 -Ptests.haltonfailure=false "-Ptests.jvmargs=-XX:TieredStopAtLevel=1 -XX:+UseParallelGC -XX:ActiveProcessorCount=1 -XX:ReservedCodeCacheSize=120m" -Ptests.seed=FC377411B7D025DA -Ptests.multiplier=2 -Ptests.badapples=false -Ptests.file.encoding=UTF-8
- org.apache.solr.search.TestCoordinatorRole.testNRTRestart (:solr:core)
Test output: /home/jenkins/jenkins-home/712657a4/workspace/Solr/Solr-Check-main-s390x/solr/core/build/test-results/test/outputs/OUTPUT-org.apache.solr.search.TestCoordinatorRole.txt
Reproduce with: gradlew :solr:core:test --tests "org.apache.solr.search.TestCoordinatorRole.testNRTRestart" -Ptests.jvms=4 -Ptests.haltonfailure=false "-Ptests.jvmargs=-XX:TieredStopAtLevel=1 -XX:+UseParallelGC -XX:ActiveProcessorCount=1 -XX:ReservedCodeCacheSize=120m" -Ptests.seed=FC377411B7D025DA -Ptests.multiplier=2 -Ptests.badapples=false -Ptests.file.encoding=UTF-8
Deprecated Gradle features were used in this build, making it incompatible with Gradle 8.0.
You can use '--warning-mode all' to show the individual deprecation warnings and determine if they come from your own scripts or plugins.
See https://docs.gradle.org/7.6/userguide/command_line_interface.html#sec:command_line_warnings
BUILD SUCCESSFUL in 4h 57m 6s
584 actionable tasks: 584 executed
Publishing build scan...
https://ge.apache.org/s/kfos23hs6gsgw
Build step 'Invoke Gradle script' changed build result to SUCCESS
Archiving artifacts
hudson.FilePath$ValidateAntFileMask$1Cancel
at hudson.FilePath$ValidateAntFileMask$1.isCaseSensitive(FilePath.java:3300)
at org.apache.tools.ant.DirectoryScanner.isIncluded(DirectoryScanner.java:1370)
at org.apache.tools.ant.DirectoryScanner.scandir(DirectoryScanner.java:1260)
at org.apache.tools.ant.DirectoryScanner.scandir(DirectoryScanner.java:1267)
at org.apache.tools.ant.DirectoryScanner.scandir(DirectoryScanner.java:1267)
at org.apache.tools.ant.DirectoryScanner.scandir(DirectoryScanner.java:1267)
at org.apache.tools.ant.DirectoryScanner.scandir(DirectoryScanner.java:1267)
at org.apache.tools.ant.DirectoryScanner.scandir(DirectoryScanner.java:1267)
at org.apache.tools.ant.DirectoryScanner.scandir(DirectoryScanner.java:1267)
at org.apache.tools.ant.DirectoryScanner.scandir(DirectoryScanner.java:1194)
at org.apache.tools.ant.DirectoryScanner.scandir(DirectoryScanner.java:1156)
at org.apache.tools.ant.DirectoryScanner.checkIncludePatterns(DirectoryScanner.java:954)
at org.apache.tools.ant.DirectoryScanner.scan(DirectoryScanner.java:912)
at hudson.FilePath$ValidateAntFileMask.hasMatch(FilePath.java:3313)
Caused: hudson.FilePath$FileMaskNoMatchesFoundException: no matches found within 10000
at hudson.FilePath$ValidateAntFileMask.hasMatch(FilePath.java:3318)
at hudson.FilePath$ValidateAntFileMask.invoke(FilePath.java:3196)
at hudson.FilePath$ValidateAntFileMask.invoke(FilePath.java:3174)
at hudson.FilePath$FileCallableWrapper.call(FilePath.java:3578)
Also: hudson.remoting.Channel$CallSiteStackTrace: Remote call to jenkins-s390x-1
at hudson.remoting.Channel.attachCallSiteStackTrace(Channel.java:1784)
at hudson.remoting.UserRequest$ExceptionResponse.retrieve(UserRequest.java:356)
at hudson.remoting.Channel.call(Channel.java:1000)
at hudson.FilePath.act(FilePath.java:1192)
at hudson.FilePath.act(FilePath.java:1181)
at hudson.FilePath.validateAntFileMask(FilePath.java:3171)
at hudson.tasks.ArtifactArchiver.perform(ArtifactArchiver.java:271)
at hudson.tasks.BuildStepCompatibilityLayer.perform(BuildStepCompatibilityLayer.java:80)
at hudson.tasks.BuildStepMonitor$1.perform(BuildStepMonitor.java:20)
at hudson.model.AbstractBuild$AbstractBuildExecution.perform(AbstractBuild.java:818)
at hudson.model.AbstractBuild$AbstractBuildExecution.performAllBuildSteps(AbstractBuild.java:767)
at hudson.model.Build$BuildExecution.post2(Build.java:179)
at hudson.model.AbstractBuild$AbstractBuildExecution.post(AbstractBuild.java:711)
at hudson.model.Run.execute(Run.java:1925)
at hudson.model.FreeStyleBuild.run(FreeStyleBuild.java:44)
at hudson.model.ResourceController.execute(ResourceController.java:101)
at hudson.model.Executor.run(Executor.java:442)
Caused: hudson.FilePath$TunneledInterruptedException
at hudson.FilePath$FileCallableWrapper.call(FilePath.java:3580)
at hudson.remoting.UserRequest.perform(UserRequest.java:211)
at hudson.remoting.UserRequest.perform(UserRequest.java:54)
at hudson.remoting.Request$2.run(Request.java:377)
at hudson.remoting.InterceptingExecutorService.lambda$wrap$0(InterceptingExecutorService.java:78)
at java.base/java.util.concurrent.FutureTask.run(FutureTask.java:264)
at java.base/java.util.concurrent.ThreadPoolExecutor.runWorker(ThreadPoolExecutor.java:1128)
at java.base/java.util.concurrent.ThreadPoolExecutor$Worker.run(ThreadPoolExecutor.java:628)
at java.base/java.lang.Thread.run(Thread.java:829)
Caused: java.lang.InterruptedException: hudson.FilePath$FileMaskNoMatchesFoundException: no matches found within 10000
at hudson.FilePath.act(FilePath.java:1194)
at hudson.FilePath.act(FilePath.java:1181)
at hudson.FilePath.validateAntFileMask(FilePath.java:3171)
at hudson.tasks.ArtifactArchiver.perform(ArtifactArchiver.java:271)
at hudson.tasks.BuildStepCompatibilityLayer.perform(BuildStepCompatibilityLayer.java:80)
at hudson.tasks.BuildStepMonitor$1.perform(BuildStepMonitor.java:20)
at hudson.model.AbstractBuild$AbstractBuildExecution.perform(AbstractBuild.java:818)
at hudson.model.AbstractBuild$AbstractBuildExecution.performAllBuildSteps(AbstractBuild.java:767)
at hudson.model.Build$BuildExecution.post2(Build.java:179)
at hudson.model.AbstractBuild$AbstractBuildExecution.post(AbstractBuild.java:711)
at hudson.model.Run.execute(Run.java:1925)
at hudson.model.FreeStyleBuild.run(FreeStyleBuild.java:44)
at hudson.model.ResourceController.execute(ResourceController.java:101)
at hudson.model.Executor.run(Executor.java:442)
No artifacts found that match the file pattern "**/*.events,heapdumps/**,**/hs_err_pid*". Configuration error?
Recording test results
[Checks API] No suitable checks publisher found.
Build step 'Publish JUnit test result report' changed build result to UNSTABLE
Email was triggered for: Unstable (Test Failures)
Sending email for trigger: Unstable (Test Failures)
[JENKINS] Solr » Solr-Check-main-s390x - Build # 339 - Still Unstable!
Posted by Apache Jenkins Server <je...@builds.apache.org>.
Build: https://ci-builds.apache.org/job/Solr/job/Solr-Check-main-s390x/339/
39 tests failed.
FAILED: org.apache.solr.cloud.BasicDistributedZk2Test.test
Error Message:
org.apache.solr.cloud.ZkController$NotInClusterStateException: Number of replicas in the state does not match what we set:3 vs 4
Stack Trace:
org.apache.solr.cloud.ZkController$NotInClusterStateException: Number of replicas in the state does not match what we set:3 vs 4
at __randomizedtesting.SeedInfo.seed([4215AD43910254A7:CA4192993FFE395F]:0)
at app//org.apache.solr.cloud.AbstractFullDistribZkTestBase.waitForActiveReplicaCount(AbstractFullDistribZkTestBase.java:696)
at app//org.apache.solr.cloud.AbstractFullDistribZkTestBase.createJettys(AbstractFullDistribZkTestBase.java:626)
at app//org.apache.solr.cloud.AbstractFullDistribZkTestBase.createServers(AbstractFullDistribZkTestBase.java:374)
at app//org.apache.solr.BaseDistributedSearchTestCase$ShardsRepeatRule$ShardsFixedStatement.callStatement(BaseDistributedSearchTestCase.java:1077)
at app//org.apache.solr.BaseDistributedSearchTestCase$ShardsRepeatRule$ShardsStatement.evaluate(BaseDistributedSearchTestCase.java:1050)
at app//com.carrotsearch.randomizedtesting.rules.SystemPropertiesRestoreRule$1.evaluate(SystemPropertiesRestoreRule.java:80)
at app//org.junit.rules.RunRules.evaluate(RunRules.java:20)
at app//org.apache.lucene.tests.util.TestRuleSetupTeardownChained$1.evaluate(TestRuleSetupTeardownChained.java:48)
at app//org.apache.lucene.tests.util.AbstractBeforeAfterRule$1.evaluate(AbstractBeforeAfterRule.java:43)
at app//org.apache.lucene.tests.util.TestRuleThreadAndTestName$1.evaluate(TestRuleThreadAndTestName.java:45)
at app//org.apache.lucene.tests.util.TestRuleIgnoreAfterMaxFailures$1.evaluate(TestRuleIgnoreAfterMaxFailures.java:60)
at app//org.apache.lucene.tests.util.TestRuleMarkFailure$1.evaluate(TestRuleMarkFailure.java:44)
at app//org.junit.rules.RunRules.evaluate(RunRules.java:20)
at app//com.carrotsearch.randomizedtesting.rules.StatementAdapter.evaluate(StatementAdapter.java:36)
at app//com.carrotsearch.randomizedtesting.ThreadLeakControl$StatementRunner.run(ThreadLeakControl.java:390)
at app//com.carrotsearch.randomizedtesting.ThreadLeakControl.forkTimeoutingTask(ThreadLeakControl.java:843)
at app//com.carrotsearch.randomizedtesting.ThreadLeakControl$3.evaluate(ThreadLeakControl.java:490)
at app//com.carrotsearch.randomizedtesting.RandomizedRunner.runSingleTest(RandomizedRunner.java:955)
at app//com.carrotsearch.randomizedtesting.RandomizedRunner$5.evaluate(RandomizedRunner.java:840)
at app//com.carrotsearch.randomizedtesting.RandomizedRunner$6.evaluate(RandomizedRunner.java:891)
at app//com.carrotsearch.randomizedtesting.RandomizedRunner$7.evaluate(RandomizedRunner.java:902)
at app//com.carrotsearch.randomizedtesting.rules.StatementAdapter.evaluate(StatementAdapter.java:36)
at app//com.carrotsearch.randomizedtesting.rules.StatementAdapter.evaluate(StatementAdapter.java:36)
at app//org.apache.lucene.tests.util.AbstractBeforeAfterRule$1.evaluate(AbstractBeforeAfterRule.java:43)
at app//com.carrotsearch.randomizedtesting.rules.SystemPropertiesRestoreRule$1.evaluate(SystemPropertiesRestoreRule.java:80)
at app//org.junit.rules.RunRules.evaluate(RunRules.java:20)
at app//org.apache.lucene.tests.util.AbstractBeforeAfterRule$1.evaluate(AbstractBeforeAfterRule.java:43)
at app//com.carrotsearch.randomizedtesting.rules.StatementAdapter.evaluate(StatementAdapter.java:36)
at app//org.apache.lucene.tests.util.TestRuleStoreClassName$1.evaluate(TestRuleStoreClassName.java:38)
at app//com.carrotsearch.randomizedtesting.rules.NoShadowingOrOverridesOnMethodsRule$1.evaluate(NoShadowingOrOverridesOnMethodsRule.java:40)
at app//com.carrotsearch.randomizedtesting.rules.NoShadowingOrOverridesOnMethodsRule$1.evaluate(NoShadowingOrOverridesOnMethodsRule.java:40)
at app//com.carrotsearch.randomizedtesting.rules.StatementAdapter.evaluate(StatementAdapter.java:36)
at app//com.carrotsearch.randomizedtesting.rules.StatementAdapter.evaluate(StatementAdapter.java:36)
at app//org.apache.lucene.tests.util.TestRuleAssertionsRequired$1.evaluate(TestRuleAssertionsRequired.java:53)
at app//org.apache.lucene.tests.util.AbstractBeforeAfterRule$1.evaluate(AbstractBeforeAfterRule.java:43)
at app//org.apache.lucene.tests.util.TestRuleMarkFailure$1.evaluate(TestRuleMarkFailure.java:44)
at app//org.apache.lucene.tests.util.TestRuleIgnoreAfterMaxFailures$1.evaluate(TestRuleIgnoreAfterMaxFailures.java:60)
at app//org.apache.lucene.tests.util.TestRuleIgnoreTestSuites$1.evaluate(TestRuleIgnoreTestSuites.java:47)
at app//org.junit.rules.RunRules.evaluate(RunRules.java:20)
at app//com.carrotsearch.randomizedtesting.rules.StatementAdapter.evaluate(StatementAdapter.java:36)
at app//com.carrotsearch.randomizedtesting.ThreadLeakControl$StatementRunner.run(ThreadLeakControl.java:390)
at app//com.carrotsearch.randomizedtesting.ThreadLeakControl.lambda$forkTimeoutingTask$0(ThreadLeakControl.java:850)
at java.base@11.0.16.1/java.lang.Thread.run(Thread.java:829)
FAILED: org.apache.solr.cloud.BasicDistributedZk2Test.classMethod
Error Message:
com.carrotsearch.randomizedtesting.ThreadLeakError: 101 threads leaked from SUITE scope at org.apache.solr.cloud.BasicDistributedZk2Test:
1) Thread[id=1060, name=qtp792402874-1060, state=TIMED_WAITING, group=TGRP-BasicDistributedZk2Test]
at java.base@11.0.16.1/jdk.internal.misc.Unsafe.park(Native Method)
at java.base@11.0.16.1/java.util.concurrent.locks.LockSupport.parkNanos(LockSupport.java:234)
at java.base@11.0.16.1/java.util.concurrent.locks.AbstractQueuedSynchronizer$ConditionObject.awaitNanos(AbstractQueuedSynchronizer.java:2123)
at app//org.eclipse.jetty.util.BlockingArrayQueue.poll(BlockingArrayQueue.java:219)
at app//org.eclipse.jetty.util.thread.QueuedThreadPool$Runner.idleJobPoll(QueuedThreadPool.java:1124)
at app//org.eclipse.jetty.util.thread.QueuedThreadPool$Runner.run(QueuedThreadPool.java:1141)
at java.base@11.0.16.1/java.lang.Thread.run(Thread.java:829)
2) Thread[id=1099, name=qtp971043313-1099, state=TIMED_WAITING, group=TGRP-BasicDistributedZk2Test]
at java.base@11.0.16.1/jdk.internal.misc.Unsafe.park(Native Method)
at java.base@11.0.16.1/java.util.concurrent.locks.LockSupport.parkNanos(LockSupport.java:234)
at java.base@11.0.16.1/java.util.concurrent.locks.AbstractQueuedSynchronizer$ConditionObject.awaitNanos(AbstractQueuedSynchronizer.java:2123)
at app//org.eclipse.jetty.util.BlockingArrayQueue.poll(BlockingArrayQueue.java:219)
at app//org.eclipse.jetty.util.thread.QueuedThreadPool$Runner.idleJobPoll(QueuedThreadPool.java:1124)
at app//org.eclipse.jetty.util.thread.QueuedThreadPool$Runner.run(QueuedThreadPool.java:1141)
at java.base@11.0.16.1/java.lang.Thread.run(Thread.java:829)
3) Thread[id=1249, name=zkCallback-679-thread-3, state=TIMED_WAITING, group=TGRP-BasicDistributedZk2Test]
at java.base@11.0.16.1/jdk.internal.misc.Unsafe.park(Native Method)
at java.base@11.0.16.1/java.util.concurrent.locks.LockSupport.parkNanos(LockSupport.java:234)
at java.base@11.0.16.1/java.util.concurrent.SynchronousQueue$TransferStack.awaitFulfill(SynchronousQueue.java:462)
at java.base@11.0.16.1/java.util.concurrent.SynchronousQueue$TransferStack.transfer(SynchronousQueue.java:361)
at java.base@11.0.16.1/java.util.concurrent.SynchronousQueue.poll(SynchronousQueue.java:937)
at java.base@11.0.16.1/java.util.concurrent.ThreadPoolExecutor.getTask(ThreadPoolExecutor.java:1053)
at java.base@11.0.16.1/java.util.concurrent.ThreadPoolExecutor.runWorker(ThreadPoolExecutor.java:1114)
at java.base@11.0.16.1/java.util.concurrent.ThreadPoolExecutor$Worker.run(ThreadPoolExecutor.java:628)
at java.base@11.0.16.1/java.lang.Thread.run(Thread.java:829)
4) Thread[id=1100, name=qtp971043313-1100, state=TIMED_WAITING, group=TGRP-BasicDistributedZk2Test]
at java.base@11.0.16.1/jdk.internal.misc.Unsafe.park(Native Method)
at java.base@11.0.16.1/java.util.concurrent.locks.LockSupport.parkNanos(LockSupport.java:234)
at java.base@11.0.16.1/java.util.concurrent.locks.AbstractQueuedSynchronizer$ConditionObject.awaitNanos(AbstractQueuedSynchronizer.java:2123)
at app//org.eclipse.jetty.util.BlockingArrayQueue.poll(BlockingArrayQueue.java:219)
at app//org.eclipse.jetty.util.thread.QueuedThreadPool$Runner.idleJobPoll(QueuedThreadPool.java:1124)
at app//org.eclipse.jetty.util.thread.QueuedThreadPool$Runner.run(QueuedThreadPool.java:1141)
at java.base@11.0.16.1/java.lang.Thread.run(Thread.java:829)
5) Thread[id=1098, name=qtp971043313-1098-acceptor-0@4f3a1e6e-ServerConnector@3ddf6215{HTTP/1.1, (http/1.1, h2c)}{127.0.0.1:45567}, state=RUNNABLE, group=TGRP-BasicDistributedZk2Test]
at java.base@11.0.16.1/sun.nio.ch.ServerSocketChannelImpl.accept0(Native Method)
at java.base@11.0.16.1/sun.nio.ch.ServerSocketChannelImpl.accept(ServerSocketChannelImpl.java:533)
at java.base@11.0.16.1/sun.nio.ch.ServerSocketChannelImpl.accept(ServerSocketChannelImpl.java:285)
at app//org.eclipse.jetty.server.ServerConnector.accept(ServerConnector.java:409)
at app//org.eclipse.jetty.server.AbstractConnector$Acceptor.run(AbstractConnector.java:748)
at app//org.eclipse.jetty.util.thread.QueuedThreadPool.runJob(QueuedThreadPool.java:969)
at app//org.eclipse.jetty.util.thread.QueuedThreadPool$Runner.doRunJob(QueuedThreadPool.java:1194)
at app//org.eclipse.jetty.util.thread.QueuedThreadPool$Runner.run(QueuedThreadPool.java:1149)
at java.base@11.0.16.1/java.lang.Thread.run(Thread.java:829)
6) Thread[id=1157, name=httpShardExecutor-706-thread-2, state=RUNNABLE, group=TGRP-BasicDistributedZk2Test]
at java.base@11.0.16.1/sun.nio.ch.EPoll.wait(Native Method)
at java.base@11.0.16.1/sun.nio.ch.EPollSelectorImpl.doSelect(EPollSelectorImpl.java:120)
at java.base@11.0.16.1/sun.nio.ch.SelectorImpl.lockAndDoSelect(SelectorImpl.java:124)
at java.base@11.0.16.1/sun.nio.ch.SelectorImpl.select(SelectorImpl.java:141)
at app//org.eclipse.jetty.io.ManagedSelector.nioSelect(ManagedSelector.java:180)
at app//org.eclipse.jetty.io.ManagedSelector.select(ManagedSelector.java:187)
at app//org.eclipse.jetty.io.ManagedSelector$SelectorProducer.select(ManagedSelector.java:604)
at app//org.eclipse.jetty.io.ManagedSelector$SelectorProducer.produce(ManagedSelector.java:541)
at app//org.eclipse.jetty.util.thread.strategy.AdaptiveExecutionStrategy.produceTask(AdaptiveExecutionStrategy.java:450)
at app//org.eclipse.jetty.util.thread.strategy.AdaptiveExecutionStrategy.tryProduce(AdaptiveExecutionStrategy.java:243)
at app//org.eclipse.jetty.util.thread.strategy.AdaptiveExecutionStrategy.produce(AdaptiveExecutionStrategy.java:194)
at app//org.eclipse.jetty.io.ManagedSelector$$Lambda$340/0x00000001005a8440.run(Unknown Source)
at app//org.apache.solr.common.util.ExecutorUtil$MDCAwareThreadPoolExecutor.lambda$execute$0(ExecutorUtil.java:289)
at app//org.apache.solr.common.util.ExecutorUtil$MDCAwareThreadPoolExecutor$$Lambda$341/0x00000001005a8c40.run(Unknown Source)
at java.base@11.0.16.1/java.util.concurrent.ThreadPoolExecutor.runWorker(ThreadPoolExecutor.java:1128)
at java.base@11.0.16.1/java.util.concurrent.ThreadPoolExecutor$Worker.run(ThreadPoolExecutor.java:628)
at java.base@11.0.16.1/java.lang.Thread.run(Thread.java:829)
7) Thread[id=1086, name=qtp747167750-1086, state=TIMED_WAITING, group=TGRP-BasicDistributedZk2Test]
at java.base@11.0.16.1/jdk.internal.misc.Unsafe.park(Native Method)
at java.base@11.0.16.1/java.util.concurrent.locks.LockSupport.parkNanos(LockSupport.java:234)
at java.base@11.0.16.1/java.util.concurrent.locks.AbstractQueuedSynchronizer$ConditionObject.awaitNanos(AbstractQueuedSynchronizer.java:2123)
at app//org.eclipse.jetty.util.BlockingArrayQueue.poll(BlockingArrayQueue.java:219)
at app//org.eclipse.jetty.util.thread.QueuedThreadPool$Runner.idleJobPoll(QueuedThreadPool.java:1124)
at app//org.eclipse.jetty.util.thread.QueuedThreadPool$Runner.run(QueuedThreadPool.java:1141)
at java.base@11.0.16.1/java.lang.Thread.run(Thread.java:829)
8) Thread[id=1186, name=zkCallback-684-thread-2, state=TIMED_WAITING, group=TGRP-BasicDistributedZk2Test]
at java.base@11.0.16.1/jdk.internal.misc.Unsafe.park(Native Method)
at java.base@11.0.16.1/java.util.concurrent.locks.LockSupport.parkNanos(LockSupport.java:234)
at java.base@11.0.16.1/java.util.concurrent.SynchronousQueue$TransferStack.awaitFulfill(SynchronousQueue.java:462)
at java.base@11.0.16.1/java.util.concurrent.SynchronousQueue$TransferStack.transfer(SynchronousQueue.java:361)
at java.base@11.0.16.1/java.util.concurrent.SynchronousQueue.poll(SynchronousQueue.java:937)
at java.base@11.0.16.1/java.util.concurrent.ThreadPoolExecutor.getTask(ThreadPoolExecutor.java:1053)
at java.base@11.0.16.1/java.util.concurrent.ThreadPoolExecutor.runWorker(ThreadPoolExecutor.java:1114)
at java.base@11.0.16.1/java.util.concurrent.ThreadPoolExecutor$Worker.run(ThreadPoolExecutor.java:628)
at java.base@11.0.16.1/java.lang.Thread.run(Thread.java:829)
9) Thread[id=1210, name=h2sc-675-thread-3, state=WAITING, group=TGRP-BasicDistributedZk2Test]
at java.base@11.0.16.1/jdk.internal.misc.Unsafe.park(Native Method)
at java.base@11.0.16.1/java.util.concurrent.locks.LockSupport.park(LockSupport.java:194)
at java.base@11.0.16.1/java.util.concurrent.locks.AbstractQueuedSynchronizer$ConditionObject.await(AbstractQueuedSynchronizer.java:2081)
at app//org.eclipse.jetty.util.BlockingArrayQueue.take(BlockingArrayQueue.java:547)
at java.base@11.0.16.1/java.util.concurrent.ThreadPoolExecutor.getTask(ThreadPoolExecutor.java:1054)
at java.base@11.0.16.1/java.util.concurrent.ThreadPoolExecutor.runWorker(ThreadPoolExecutor.java:1114)
at java.base@11.0.16.1/java.util.concurrent.ThreadPoolExecutor$Worker.run(ThreadPoolExecutor.java:628)
at java.base@11.0.16.1/java.lang.Thread.run(Thread.java:829)
10) Thread[id=1245, name=zkCallback-712-thread-2, state=TIMED_WAITING, group=TGRP-BasicDistributedZk2Test]
at java.base@11.0.16.1/jdk.internal.misc.Unsafe.park(Native Method)
at java.base@11.0.16.1/java.util.concurrent.locks.LockSupport.parkNanos(LockSupport.java:234)
at java.base@11.0.16.1/java.util.concurrent.SynchronousQueue$TransferStack.awaitFulfill(SynchronousQueue.java:462)
at java.base@11.0.16.1/java.util.concurrent.SynchronousQueue$TransferStack.transfer(SynchronousQueue.java:361)
at java.base@11.0.16.1/java.util.concurrent.SynchronousQueue.poll(SynchronousQueue.java:937)
at java.base@11.0.16.1/java.util.concurrent.ThreadPoolExecutor.getTask(ThreadPoolExecutor.java:1053)
at java.base@11.0.16.1/java.util.concurrent.ThreadPoolExecutor.runWorker(ThreadPoolExecutor.java:1114)
at java.base@11.0.16.1/java.util.concurrent.ThreadPoolExecutor$Worker.run(ThreadPoolExecutor.java:628)
at java.base@11.0.16.1/java.lang.Thread.run(Thread.java:829)
11) Thread[id=1119, name=httpShardExecutor-673-thread-2, state=RUNNABLE, group=TGRP-BasicDistributedZk2Test]
at java.base@11.0.16.1/sun.nio.ch.EPoll.wait(Native Method)
at java.base@11.0.16.1/sun.nio.ch.EPollSelectorImpl.doSelect(EPollSelectorImpl.java:120)
at java.base@11.0.16.1/sun.nio.ch.SelectorImpl.lockAndDoSelect(SelectorImpl.java:124)
at java.base@11.0.16.1/sun.nio.ch.SelectorImpl.select(SelectorImpl.java:141)
at app//org.eclipse.jetty.io.ManagedSelector.nioSelect(ManagedSelector.java:180)
at app//org.eclipse.jetty.io.ManagedSelector.select(ManagedSelector.java:187)
at app//org.eclipse.jetty.io.ManagedSelector$SelectorProducer.select(ManagedSelector.java:604)
at app//org.eclipse.jetty.io.ManagedSelector$SelectorProducer.produce(ManagedSelector.java:541)
at app//org.eclipse.jetty.util.thread.strategy.AdaptiveExecutionStrategy.produceTask(AdaptiveExecutionStrategy.java:450)
at app//org.eclipse.jetty.util.thread.strategy.AdaptiveExecutionStrategy.tryProduce(AdaptiveExecutionStrategy.java:243)
at app//org.eclipse.jetty.util.thread.strategy.AdaptiveExecutionStrategy.produce(AdaptiveExecutionStrategy.java:194)
at app//org.eclipse.jetty.io.ManagedSelector$$Lambda$340/0x00000001005a8440.run(Unknown Source)
at app//org.apache.solr.common.util.ExecutorUtil$MDCAwareThreadPoolExecutor.lambda$execute$0(ExecutorUtil.java:289)
at app//org.apache.solr.common.util.ExecutorUtil$MDCAwareThreadPoolExecutor$$Lambda$341/0x00000001005a8c40.run(Unknown Source)
at java.base@11.0.16.1/java.util.concurrent.ThreadPoolExecutor.runWorker(ThreadPoolExecutor.java:1128)
at java.base@11.0.16.1/java.util.concurrent.ThreadPoolExecutor$Worker.run(ThreadPoolExecutor.java:628)
at java.base@11.0.16.1/java.lang.Thread.run(Thread.java:829)
12) Thread[id=1077, name=qtp1914490192-1077, state=RUNNABLE, group=TGRP-BasicDistributedZk2Test]
at java.base@11.0.16.1/sun.nio.ch.EPoll.wait(Native Method)
at java.base@11.0.16.1/sun.nio.ch.EPollSelectorImpl.doSelect(EPollSelectorImpl.java:120)
at java.base@11.0.16.1/sun.nio.ch.SelectorImpl.lockAndDoSelect(SelectorImpl.java:124)
at java.base@11.0.16.1/sun.nio.ch.SelectorImpl.select(SelectorImpl.java:141)
at app//org.eclipse.jetty.io.ManagedSelector.nioSelect(ManagedSelector.java:180)
at app//org.eclipse.jetty.io.ManagedSelector.select(ManagedSelector.java:187)
at app//org.eclipse.jetty.io.ManagedSelector$SelectorProducer.select(ManagedSelector.java:604)
at app//org.eclipse.jetty.io.ManagedSelector$SelectorProducer.produce(ManagedSelector.java:541)
at app//org.eclipse.jetty.util.thread.strategy.AdaptiveExecutionStrategy.produceTask(AdaptiveExecutionStrategy.java:450)
at app//org.eclipse.jetty.util.thread.strategy.AdaptiveExecutionStrategy.tryProduce(AdaptiveExecutionStrategy.java:243)
at app//org.eclipse.jetty.util.thread.strategy.AdaptiveExecutionStrategy.produce(AdaptiveExecutionStrategy.java:194)
at app//org.eclipse.jetty.io.ManagedSelector$$Lambda$340/0x00000001005a8440.run(Unknown Source)
at app//org.eclipse.jetty.util.thread.QueuedThreadPool.runJob(QueuedThreadPool.java:969)
at app//org.eclipse.jetty.util.thread.QueuedThreadPool$Runner.doRunJob(QueuedThreadPool.java:1194)
at app//org.eclipse.jetty.util.thread.QueuedThreadPool$Runner.run(QueuedThreadPool.java:1149)
at java.base@11.0.16.1/java.lang.Thread.run(Thread.java:829)
13) Thread[id=1169, name=CloserThread, state=WAITING, group=TGRP-BasicDistributedZk2Test]
at java.base@11.0.16.1/java.lang.Object.wait(Native Method)
at java.base@11.0.16.1/java.lang.Object.wait(Object.java:328)
at app//org.apache.solr.core.CloserThread.run(CoreContainer.java:2560)
14) Thread[id=1091, name=qtp747167750-1091, state=TIMED_WAITING, group=TGRP-BasicDistributedZk2Test]
at java.base@11.0.16.1/jdk.internal.misc.Unsafe.park(Native Method)
at java.base@11.0.16.1/java.util.concurrent.locks.LockSupport.parkNanos(LockSupport.java:234)
at java.base@11.0.16.1/java.util.concurrent.locks.AbstractQueuedSynchronizer$ConditionObject.awaitNanos(AbstractQueuedSynchronizer.java:2123)
at app//org.eclipse.jetty.util.BlockingArrayQueue.poll(BlockingArrayQueue.java:219)
at app//org.eclipse.jetty.util.thread.QueuedThreadPool$Runner.idleJobPoll(QueuedThreadPool.java:1124)
at app//org.eclipse.jetty.util.thread.QueuedThreadPool$Runner.run(QueuedThreadPool.java:1141)
at java.base@11.0.16.1/java.lang.Thread.run(Thread.java:829)
15) Thread[id=1061, name=qtp792402874-1061, state=TIMED_WAITING, group=TGRP-BasicDistributedZk2Test]
at java.base@11.0.16.1/jdk.internal.misc.Unsafe.park(Native Method)
at java.base@11.0.16.1/java.util.concurrent.locks.LockSupport.parkNanos(LockSupport.java:234)
at java.base@11.0.16.1/java.util.concurrent.locks.AbstractQueuedSynchronizer$ConditionObject.awaitNanos(AbstractQueuedSynchronizer.java:2123)
at app//org.eclipse.jetty.util.BlockingArrayQueue.poll(BlockingArrayQueue.java:219)
at app//org.eclipse.jetty.util.thread.QueuedThreadPool$Runner.idleJobPoll(QueuedThreadPool.java:1124)
at app//org.eclipse.jetty.util.thread.QueuedThreadPool$Runner.run(QueuedThreadPool.java:1141)
at java.base@11.0.16.1/java.lang.Thread.run(Thread.java:829)
16) Thread[id=1251, name=zkCallback-679-thread-4, state=TIMED_WAITING, group=TGRP-BasicDistributedZk2Test]
at java.base@11.0.16.1/jdk.internal.misc.Unsafe.park(Native Method)
at java.base@11.0.16.1/java.util.concurrent.locks.LockSupport.parkNanos(LockSupport.java:234)
at java.base@11.0.16.1/java.util.concurrent.SynchronousQueue$TransferStack.awaitFulfill(SynchronousQueue.java:462)
at java.base@11.0.16.1/java.util.concurrent.SynchronousQueue$TransferStack.transfer(SynchronousQueue.java:361)
at java.base@11.0.16.1/java.util.concurrent.SynchronousQueue.poll(SynchronousQueue.java:937)
at java.base@11.0.16.1/java.util.concurrent.ThreadPoolExecutor.getTask(ThreadPoolExecutor.java:1053)
at java.base@11.0.16.1/java.util.concurrent.ThreadPoolExecutor.runWorker(ThreadPoolExecutor.java:1114)
at java.base@11.0.16.1/java.util.concurrent.ThreadPoolExecutor$Worker.run(ThreadPoolExecutor.java:628)
at java.base@11.0.16.1/java.lang.Thread.run(Thread.java:829)
17) Thread[id=1134, name=httpShardExecutor-689-thread-2, state=RUNNABLE, group=TGRP-BasicDistributedZk2Test]
at java.base@11.0.16.1/sun.nio.ch.EPoll.wait(Native Method)
at java.base@11.0.16.1/sun.nio.ch.EPollSelectorImpl.doSelect(EPollSelectorImpl.java:120)
at java.base@11.0.16.1/sun.nio.ch.SelectorImpl.lockAndDoSelect(SelectorImpl.java:124)
at java.base@11.0.16.1/sun.nio.ch.SelectorImpl.select(SelectorImpl.java:141)
at app//org.eclipse.jetty.io.ManagedSelector.nioSelect(ManagedSelector.java:180)
at app//org.eclipse.jetty.io.ManagedSelector.select(ManagedSelector.java:187)
at app//org.eclipse.jetty.io.ManagedSelector$SelectorProducer.select(ManagedSelector.java:604)
at app//org.eclipse.jetty.io.ManagedSelector$SelectorProducer.produce(ManagedSelector.java:541)
at app//org.eclipse.jetty.util.thread.strategy.AdaptiveExecutionStrategy.produceTask(AdaptiveExecutionStrategy.java:450)
at app//org.eclipse.jetty.util.thread.strategy.AdaptiveExecutionStrategy.tryProduce(AdaptiveExecutionStrategy.java:243)
at app//org.eclipse.jetty.util.thread.strategy.AdaptiveExecutionStrategy.produce(AdaptiveExecutionStrategy.java:194)
at app//org.eclipse.jetty.io.ManagedSelector$$Lambda$340/0x00000001005a8440.run(Unknown Source)
at app//org.apache.solr.common.util.ExecutorUtil$MDCAwareThreadPoolExecutor.lambda$execute$0(ExecutorUtil.java:289)
at app//org.apache.solr.common.util.ExecutorUtil$MDCAwareThreadPoolExecutor$$Lambda$341/0x00000001005a8c40.run(Unknown Source)
at java.base@11.0.16.1/java.util.concurrent.ThreadPoolExecutor.runWorker(ThreadPoolExecutor.java:1128)
at java.base@11.0.16.1/java.util.concurrent.ThreadPoolExecutor$Worker.run(ThreadPoolExecutor.java:628)
at java.base@11.0.16.1/java.lang.Thread.run(Thread.java:829)
18) Thread[id=1139, name=h2sc-694-thread-2, state=RUNNABLE, group=TGRP-BasicDistributedZk2Test]
at java.base@11.0.16.1/sun.nio.ch.EPoll.wait(Native Method)
at java.base@11.0.16.1/sun.nio.ch.EPollSelectorImpl.doSelect(EPollSelectorImpl.java:120)
at java.base@11.0.16.1/sun.nio.ch.SelectorImpl.lockAndDoSelect(SelectorImpl.java:124)
at java.base@11.0.16.1/sun.nio.ch.SelectorImpl.select(SelectorImpl.java:141)
at app//org.eclipse.jetty.io.ManagedSelector.nioSelect(ManagedSelector.java:180)
at app//org.eclipse.jetty.io.ManagedSelector.select(ManagedSelector.java:187)
at app//org.eclipse.jetty.io.ManagedSelector$SelectorProducer.select(ManagedSelector.java:604)
at app//org.eclipse.jetty.io.ManagedSelector$SelectorProducer.produce(ManagedSelector.java:541)
at app//org.eclipse.jetty.util.thread.strategy.AdaptiveExecutionStrategy.produceTask(AdaptiveExecutionStrategy.java:450)
at app//org.eclipse.jetty.util.thread.strategy.AdaptiveExecutionStrategy.tryProduce(AdaptiveExecutionStrategy.java:243)
at app//org.eclipse.jetty.util.thread.strategy.AdaptiveExecutionStrategy.produce(AdaptiveExecutionStrategy.java:194)
at app//org.eclipse.jetty.io.ManagedSelector$$Lambda$340/0x00000001005a8440.run(Unknown Source)
at app//org.apache.solr.common.util.ExecutorUtil$MDCAwareThreadPoolExecutor.lambda$execute$0(ExecutorUtil.java:289)
at app//org.apache.solr.common.util.ExecutorUtil$MDCAwareThreadPoolExecutor$$Lambda$341/0x00000001005a8c40.run(Unknown Source)
at java.base@11.0.16.1/java.util.concurrent.ThreadPoolExecutor.runWorker(ThreadPoolExecutor.java:1128)
at java.base@11.0.16.1/java.util.concurrent.ThreadPoolExecutor$Worker.run(ThreadPoolExecutor.java:628)
at java.base@11.0.16.1/java.lang.Thread.run(Thread.java:829)
19) Thread[id=1084, name=qtp747167750-1084-acceptor-0@3b879e86-ServerConnector@28b7714f{HTTP/1.1, (http/1.1, h2c)}{127.0.0.1:36185}, state=RUNNABLE, group=TGRP-BasicDistributedZk2Test]
at java.base@11.0.16.1/sun.nio.ch.ServerSocketChannelImpl.accept0(Native Method)
at java.base@11.0.16.1/sun.nio.ch.ServerSocketChannelImpl.accept(ServerSocketChannelImpl.java:533)
at java.base@11.0.16.1/sun.nio.ch.ServerSocketChannelImpl.accept(ServerSocketChannelImpl.java:285)
at app//org.eclipse.jetty.server.ServerConnector.accept(ServerConnector.java:409)
at app//org.eclipse.jetty.server.AbstractConnector$Acceptor.run(AbstractConnector.java:748)
at app//org.eclipse.jetty.util.thread.QueuedThreadPool.runJob(QueuedThreadPool.java:969)
at app//org.eclipse.jetty.util.thread.QueuedThreadPool$Runner.doRunJob(QueuedThreadPool.java:1194)
at app//org.eclipse.jetty.util.thread.QueuedThreadPool$Runner.run(QueuedThreadPool.java:1149)
at java.base@11.0.16.1/java.lang.Thread.run(Thread.java:829)
20) Thread[id=1213, name=h2sc-675-thread-5, state=WAITING, group=TGRP-BasicDistributedZk2Test]
at java.base@11.0.16.1/jdk.internal.misc.Unsafe.park(Native Method)
at java.base@11.0.16.1/java.util.concurrent.locks.LockSupport.park(LockSupport.java:194)
at java.base@11.0.16.1/java.util.concurrent.locks.AbstractQueuedSynchronizer$ConditionObject.await(AbstractQueuedSynchronizer.java:2081)
at app//org.eclipse.jetty.util.BlockingArrayQueue.take(BlockingArrayQueue.java:547)
at java.base@11.0.16.1/java.util.concurrent.ThreadPoolExecutor.getTask(ThreadPoolExecutor.java:1054)
at java.base@11.0.16.1/java.util.concurrent.ThreadPoolExecutor.runWorker(ThreadPoolExecutor.java:1114)
at java.base@11.0.16.1/java.util.concurrent.ThreadPoolExecutor$Worker.run(ThreadPoolExecutor.java:628)
at java.base@11.0.16.1/java.lang.Thread.run(Thread.java:829)
21) Thread[id=1246, name=zkCallback-684-thread-5, state=TIMED_WAITING, group=TGRP-BasicDistributedZk2Test]
at java.base@11.0.16.1/jdk.internal.misc.Unsafe.park(Native Method)
at java.base@11.0.16.1/java.util.concurrent.locks.LockSupport.parkNanos(LockSupport.java:234)
at java.base@11.0.16.1/java.util.concurrent.SynchronousQueue$TransferStack.awaitFulfill(SynchronousQueue.java:462)
at java.base@11.0.16.1/java.util.concurrent.SynchronousQueue$TransferStack.transfer(SynchronousQueue.java:361)
at java.base@11.0.16.1/java.util.concurrent.SynchronousQueue.poll(SynchronousQueue.java:937)
at java.base@11.0.16.1/java.util.concurrent.ThreadPoolExecutor.getTask(ThreadPoolExecutor.java:1053)
at java.base@11.0.16.1/java.util.concurrent.ThreadPoolExecutor.runWorker(ThreadPoolExecutor.java:1114)
at java.base@11.0.16.1/java.util.concurrent.ThreadPoolExecutor$Worker.run(ThreadPoolExecutor.java:628)
at java.base@11.0.16.1/java.lang.Thread.run(Thread.java:829)
22) Thread[id=1161, name=h2sc-708-thread-2, state=RUNNABLE, group=TGRP-BasicDistributedZk2Test]
at java.base@11.0.16.1/sun.nio.ch.EPoll.wait(Native Method)
at java.base@11.0.16.1/sun.nio.ch.EPollSelectorImpl.doSelect(EPollSelectorImpl.java:120)
at java.base@11.0.16.1/sun.nio.ch.SelectorImpl.lockAndDoSelect(SelectorImpl.java:124)
at java.base@11.0.16.1/sun.nio.ch.SelectorImpl.select(SelectorImpl.java:141)
at app//org.eclipse.jetty.io.ManagedSelector.nioSelect(ManagedSelector.java:180)
at app//org.eclipse.jetty.io.ManagedSelector.select(ManagedSelector.java:187)
at app//org.eclipse.jetty.io.ManagedSelector$SelectorProducer.select(ManagedSelector.java:604)
at app//org.eclipse.jetty.io.ManagedSelector$SelectorProducer.produce(ManagedSelector.java:541)
at app//org.eclipse.jetty.util.thread.strategy.AdaptiveExecutionStrategy.produceTask(AdaptiveExecutionStrategy.java:450)
at app//org.eclipse.jetty.util.thread.strategy.AdaptiveExecutionStrategy.tryProduce(AdaptiveExecutionStrategy.java:243)
at app//org.eclipse.jetty.util.thread.strategy.AdaptiveExecutionStrategy.produce(AdaptiveExecutionStrategy.java:194)
at app//org.eclipse.jetty.io.ManagedSelector$$Lambda$340/0x00000001005a8440.run(Unknown Source)
at app//org.apache.solr.common.util.ExecutorUtil$MDCAwareThreadPoolExecutor.lambda$execute$0(ExecutorUtil.java:289)
at app//org.apache.solr.common.util.ExecutorUtil$MDCAwareThreadPoolExecutor$$Lambda$341/0x00000001005a8c40.run(Unknown Source)
at java.base@11.0.16.1/java.util.concurrent.ThreadPoolExecutor.runWorker(ThreadPoolExecutor.java:1128)
at java.base@11.0.16.1/java.util.concurrent.ThreadPoolExecutor$Worker.run(ThreadPoolExecutor.java:628)
at java.base@11.0.16.1/java.lang.Thread.run(Thread.java:829)
23) Thread[id=1070, name=qtp1914490192-1070-acceptor-0@4a1f152e-ServerConnector@762357cb{HTTP/1.1, (http/1.1, h2c)}{127.0.0.1:44693}, state=RUNNABLE, group=TGRP-BasicDistributedZk2Test]
at java.base@11.0.16.1/sun.nio.ch.ServerSocketChannelImpl.accept0(Native Method)
at java.base@11.0.16.1/sun.nio.ch.ServerSocketChannelImpl.accept(ServerSocketChannelImpl.java:533)
at java.base@11.0.16.1/sun.nio.ch.ServerSocketChannelImpl.accept(ServerSocketChannelImpl.java:285)
at app//org.eclipse.jetty.server.ServerConnector.accept(ServerConnector.java:409)
at app//org.eclipse.jetty.server.AbstractConnector$Acceptor.run(AbstractConnector.java:748)
at app//org.eclipse.jetty.util.thread.QueuedThreadPool.runJob(QueuedThreadPool.java:969)
at app//org.eclipse.jetty.util.thread.QueuedThreadPool$Runner.doRunJob(QueuedThreadPool.java:1194)
at app//org.eclipse.jetty.util.thread.QueuedThreadPool$Runner.run(QueuedThreadPool.java:1149)
at java.base@11.0.16.1/java.lang.Thread.run(Thread.java:829)
24) Thread[id=1063, name=qtp792402874-1063, state=TIMED_WAITING, group=TGRP-BasicDistributedZk2Test]
at java.base@11.0.16.1/jdk.internal.misc.Unsafe.park(Native Method)
at java.base@11.0.16.1/java.util.concurrent.locks.LockSupport.parkNanos(LockSupport.java:234)
at java.base@11.0.16.1/java.util.concurrent.locks.AbstractQueuedSynchronizer$ConditionObject.awaitNanos(AbstractQueuedSynchronizer.java:2123)
at app//org.eclipse.jetty.util.BlockingArrayQueue.poll(BlockingArrayQueue.java:219)
at app//org.eclipse.jetty.util.thread.QueuedThreadPool$Runner.idleJobPoll(QueuedThreadPool.java:1124)
at app//org.eclipse.jetty.util.thread.QueuedThreadPool$Runner.run(QueuedThreadPool.java:1141)
at java.base@11.0.16.1/java.lang.Thread.run(Thread.java:829)
25) Thread[id=1253, name=zkCallback-679-thread-6, state=TIMED_WAITING, group=TGRP-BasicDistributedZk2Test]
at java.base@11.0.16.1/jdk.internal.misc.Unsafe.park(Native Method)
at java.base@11.0.16.1/java.util.concurrent.locks.LockSupport.parkNanos(LockSupport.java:234)
at java.base@11.0.16.1/java.util.concurrent.SynchronousQueue$TransferStack.awaitFulfill(SynchronousQueue.java:462)
at java.base@11.0.16.1/java.util.concurrent.SynchronousQueue$TransferStack.transfer(SynchronousQueue.java:361)
at java.base@11.0.16.1/java.util.concurrent.SynchronousQueue.poll(SynchronousQueue.java:937)
at java.base@11.0.16.1/java.util.concurrent.ThreadPoolExecutor.getTask(ThreadPoolExecutor.java:1053)
at java.base@11.0.16.1/java.util.concurrent.ThreadPoolExecutor.runWorker(ThreadPoolExecutor.java:1114)
at java.base@11.0.16.1/java.util.concurrent.ThreadPoolExecutor$Worker.run(ThreadPoolExecutor.java:628)
at java.base@11.0.16.1/java.lang.Thread.run(Thread.java:829)
26) Thread[id=1195, name=Connector-Scheduler-28b7714f-1, state=TIMED_WAITING, group=TGRP-BasicDistributedZk2Test]
at java.base@11.0.16.1/jdk.internal.misc.Unsafe.park(Native Method)
at java.base@11.0.16.1/java.util.concurrent.locks.LockSupport.parkNanos(LockSupport.java:234)
at java.base@11.0.16.1/java.util.concurrent.locks.AbstractQueuedSynchronizer$ConditionObject.awaitNanos(AbstractQueuedSynchronizer.java:2123)
at java.base@11.0.16.1/java.util.concurrent.ScheduledThreadPoolExecutor$DelayedWorkQueue.take(ScheduledThreadPoolExecutor.java:1182)
at java.base@11.0.16.1/java.util.concurrent.ScheduledThreadPoolExecutor$DelayedWorkQueue.take(ScheduledThreadPoolExecutor.java:899)
at java.base@11.0.16.1/java.util.concurrent.ThreadPoolExecutor.getTask(ThreadPoolExecutor.java:1054)
at java.base@11.0.16.1/java.util.concurrent.ThreadPoolExecutor.runWorker(ThreadPoolExecutor.java:1114)
at java.base@11.0.16.1/java.util.concurrent.ThreadPoolExecutor$Worker.run(ThreadPoolExecutor.java:628)
at java.base@11.0.16.1/java.lang.Thread.run(Thread.java:829)
27) Thread[id=1200, name=watches-686-thread-2, state=TIMED_WAITING, group=TGRP-BasicDistributedZk2Test]
at java.base@11.0.16.1/jdk.internal.misc.Unsafe.park(Native Method)
at java.base@11.0.16.1/java.util.concurrent.locks.LockSupport.parkNanos(LockSupport.java:234)
at java.base@11.0.16.1/java.util.concurrent.SynchronousQueue$TransferStack.awaitFulfill(SynchronousQueue.java:462)
at java.base@11.0.16.1/java.util.concurrent.SynchronousQueue$TransferStack.transfer(SynchronousQueue.java:361)
at java.base@11.0.16.1/java.util.concurrent.SynchronousQueue.poll(SynchronousQueue.java:937)
at java.base@11.0.16.1/java.util.concurrent.ThreadPoolExecutor.getTask(ThreadPoolExecutor.java:1053)
at java.base@11.0.16.1/java.util.concurrent.ThreadPoolExecutor.runWorker(ThreadPoolExecutor.java:1114)
at java.base@11.0.16.1/java.util.concurrent.ThreadPoolExecutor$Worker.run(ThreadPoolExecutor.java:628)
at java.base@11.0.16.1/java.lang.Thread.run(Thread.java:829)
28) Thread[id=1075, name=qtp1914490192-1075, state=TIMED_WAITING, group=TGRP-BasicDistributedZk2Test]
at java.base@11.0.16.1/jdk.internal.misc.Unsafe.park(Native Method)
at java.base@11.0.16.1/java.util.concurrent.locks.LockSupport.parkNanos(LockSupport.java:234)
at java.base@11.0.16.1/java.util.concurrent.locks.AbstractQueuedSynchronizer$ConditionObject.awaitNanos(AbstractQueuedSynchronizer.java:2123)
at app//org.eclipse.jetty.util.BlockingArrayQueue.poll(BlockingArrayQueue.java:219)
at app//org.eclipse.jetty.util.thread.QueuedThreadPool$Runner.idleJobPoll(QueuedThreadPool.java:1124)
at app//org.eclipse.jetty.util.thread.QueuedThreadPool$Runner.run(QueuedThreadPool.java:1141)
at java.base@11.0.16.1/java.lang.Thread.run(Thread.java:829)
29) Thread[id=1199, name=zkCallback-679-thread-2, state=TIMED_WAITING, group=TGRP-BasicDistributedZk2Test]
at java.base@11.0.16.1/jdk.internal.misc.Unsafe.park(Native Method)
at java.base@11.0.16.1/java.util.concurrent.locks.LockSupport.parkNanos(LockSupport.java:234)
at java.base@11.0.16.1/java.util.concurrent.SynchronousQueue$TransferStack.awaitFulfill(SynchronousQueue.java:462)
at java.base@11.0.16.1/java.util.concurrent.SynchronousQueue$TransferStack.transfer(SynchronousQueue.java:361)
at java.base@11.0.16.1/java.util.concurrent.SynchronousQueue.poll(SynchronousQueue.java:937)
at java.base@11.0.16.1/java.util.concurrent.ThreadPoolExecutor.getTask(ThreadPoolExecutor.java:1053)
at java.base@11.0.16.1/java.util.concurrent.ThreadPoolExecutor.runWorker(ThreadPoolExecutor.java:1114)
at java.base@11.0.16.1/java.util.concurrent.ThreadPoolExecutor$Worker.run(ThreadPoolExecutor.java:628)
at java.base@11.0.16.1/java.lang.Thread.run(Thread.java:829)
30) Thread[id=1114, name=h2sc-668-thread-2, state=RUNNABLE, group=TGRP-BasicDistributedZk2Test]
at java.base@11.0.16.1/sun.nio.ch.EPoll.wait(Native Method)
at java.base@11.0.16.1/sun.nio.ch.EPollSelectorImpl.doSelect(EPollSelectorImpl.java:120)
at java.base@11.0.16.1/sun.nio.ch.SelectorImpl.lockAndDoSelect(SelectorImpl.java:124)
at java.base@11.0.16.1/sun.nio.ch.SelectorImpl.select(SelectorImpl.java:141)
at app//org.eclipse.jetty.io.ManagedSelector.nioSelect(ManagedSelector.java:180)
at app//org.eclipse.jetty.io.ManagedSelector.select(ManagedSelector.java:187)
at app//org.eclipse.jetty.io.ManagedSelector$SelectorProducer.select(ManagedSelector.java:604)
at app//org.eclipse.jetty.io.ManagedSelector$SelectorProducer.produce(ManagedSelector.java:541)
at app//org.eclipse.jetty.util.thread.strategy.AdaptiveExecutionStrategy.produceTask(AdaptiveExecutionStrategy.java:450)
at app//org.eclipse.jetty.util.thread.strategy.AdaptiveExecutionStrategy.tryProduce(AdaptiveExecutionStrategy.java:243)
at app//org.eclipse.jetty.util.thread.strategy.AdaptiveExecutionStrategy.produce(AdaptiveExecutionStrategy.java:194)
at app//org.eclipse.jetty.io.ManagedSelector$$Lambda$340/0x00000001005a8440.run(Unknown Source)
at app//org.apache.solr.common.util.ExecutorUtil$MDCAwareThreadPoolExecutor.lambda$execute$0(ExecutorUtil.java:289)
at app//org.apache.solr.common.util.ExecutorUtil$MDCAwareThreadPoolExecutor$$Lambda$341/0x00000001005a8c40.run(Unknown Source)
at java.base@11.0.16.1/java.util.concurrent.ThreadPoolExecutor.runWorker(ThreadPoolExecutor.java:1128)
at java.base@11.0.16.1/java.util.concurrent.ThreadPoolExecutor$Worker.run(ThreadPoolExecutor.java:628)
at java.base@11.0.16.1/java.lang.Thread.run(Thread.java:829)
31) Thread[id=1160, name=h2sc-708-thread-1, state=RUNNABLE, group=TGRP-BasicDistributedZk2Test]
at java.base@11.0.16.1/sun.nio.ch.EPoll.wait(Native Method)
at java.base@11.0.16.1/sun.nio.ch.EPollSelectorImpl.doSelect(EPollSelectorImpl.java:120)
at java.base@11.0.16.1/sun.nio.ch.SelectorImpl.lockAndDoSelect(SelectorImpl.java:124)
at java.base@11.0.16.1/sun.nio.ch.SelectorImpl.select(SelectorImpl.java:141)
at app//org.eclipse.jetty.io.ManagedSelector.nioSelect(ManagedSelector.java:180)
at app//org.eclipse.jetty.io.ManagedSelector.select(ManagedSelector.java:187)
at app//org.eclipse.jetty.io.ManagedSelector$SelectorProducer.select(ManagedSelector.java:604)
at app//org.eclipse.jetty.io.ManagedSelector$SelectorProducer.produce(ManagedSelector.java:541)
at app//org.eclipse.jetty.util.thread.strategy.AdaptiveExecutionStrategy.produceTask(AdaptiveExecutionStrategy.java:450)
at app//org.eclipse.jetty.util.thread.strategy.AdaptiveExecutionStrategy.tryProduce(AdaptiveExecutionStrategy.java:243)
at app//org.eclipse.jetty.util.thread.strategy.AdaptiveExecutionStrategy.produce(AdaptiveExecutionStrategy.java:194)
at app//org.eclipse.jetty.io.ManagedSelector$$Lambda$340/0x00000001005a8440.run(Unknown Source)
at app//org.apache.solr.common.util.ExecutorUtil$MDCAwareThreadPoolExecutor.lambda$execute$0(ExecutorUtil.java:289)
at app//org.apache.solr.common.util.ExecutorUtil$MDCAwareThreadPoolExecutor$$Lambda$341/0x00000001005a8c40.run(Unknown Source)
at java.base@11.0.16.1/java.util.concurrent.ThreadPoolExecutor.runWorker(ThreadPoolExecutor.java:1128)
at java.base@11.0.16.1/java.util.concurrent.ThreadPoolExecutor$Worker.run(ThreadPoolExecutor.java:628)
at java.base@11.0.16.1/java.lang.Thread.run(Thread.java:829)
32) Thread[id=1150, name=zkCallback-679-thread-1, state=TIMED_WAITING, group=TGRP-BasicDistributedZk2Test]
at java.base@11.0.16.1/jdk.internal.misc.Unsafe.park(Native Method)
at java.base@11.0.16.1/java.util.concurrent.locks.LockSupport.parkNanos(LockSupport.java:234)
at java.base@11.0.16.1/java.util.concurrent.SynchronousQueue$TransferStack.awaitFulfill(SynchronousQueue.java:462)
at java.base@11.0.16.1/java.util.concurrent.SynchronousQueue$TransferStack.transfer(SynchronousQueue.java:361)
at java.base@11.0.16.1/java.util.concurrent.SynchronousQueue.poll(SynchronousQueue.java:937)
at java.base@11.0.16.1/java.util.concurrent.ThreadPoolExecutor.getTask(ThreadPoolExecutor.java:1053)
at java.base@11.0.16.1/java.util.concurrent.ThreadPoolExecutor.runWorker(ThreadPoolExecutor.java:1114)
at java.base@11.0.16.1/java.util.concurrent.ThreadPoolExecutor$Worker.run(ThreadPoolExecutor.java:628)
at java.base@11.0.16.1/java.lang.Thread.run(Thread.java:829)
33) Thread[id=1196, name=watches-686-thread-1-processing-127.0.0.1:36185_solr collection1_shard2_replica_n5 collection1 shard2 core_node6, state=TIMED_WAITING, group=TGRP-BasicDistributedZk2Test]
at java.base@11.0.16.1/java.lang.Thread.sleep(Native Method)
at app//org.apache.solr.common.cloud.ZkStateReader$CacheCleaner.run(ZkStateReader.java:2315)
at java.base@11.0.16.1/java.util.concurrent.Executors$RunnableAdapter.call(Executors.java:515)
at java.base@11.0.16.1/java.util.concurrent.FutureTask.run(FutureTask.java:264)
at app//org.apache.solr.common.util.ExecutorUtil$MDCAwareThreadPoolExecutor.lambda$execute$0(ExecutorUtil.java:289)
at app//org.apache.solr.common.util.ExecutorUtil$MDCAwareThreadPoolExecutor$$Lambda$341/0x00000001005a8c40.run(Unknown Source)
at java.base@11.0.16.1/java.util.concurrent.ThreadPoolExecutor.runWorker(ThreadPoolExecutor.java:1128)
at java.base@11.0.16.1/java.util.concurrent.ThreadPoolExecutor$Worker.run(ThreadPoolExecutor.java:628)
at java.base@11.0.16.1/java.lang.Thread.run(Thread.java:829)
34) Thread[id=1167, name=zkCallback-699-thread-1, state=TIMED_WAITING, group=TGRP-BasicDistributedZk2Test]
at java.base@11.0.16.1/jdk.internal.misc.Unsafe.park(Native Method)
at java.base@11.0.16.1/java.util.concurrent.locks.LockSupport.parkNanos(LockSupport.java:234)
at java.base@11.0.16.1/java.util.concurrent.SynchronousQueue$TransferStack.awaitFulfill(SynchronousQueue.java:462)
at java.base@11.0.16.1/java.util.concurrent.SynchronousQueue$TransferStack.transfer(SynchronousQueue.java:361)
at java.base@11.0.16.1/java.util.concurrent.SynchronousQueue.poll(SynchronousQueue.java:937)
at java.base@11.0.16.1/java.util.concurrent.ThreadPoolExecutor.getTask(ThreadPoolExecutor.java:1053)
at java.base@11.0.16.1/java.util.concurrent.ThreadPoolExecutor.runWorker(ThreadPoolExecutor.java:1114)
at java.base@11.0.16.1/java.util.concurrent.ThreadPoolExecutor$Worker.run(ThreadPoolExecutor.java:628)
at java.base@11.0.16.1/java.lang.Thread.run(Thread.java:829)
35) Thread[id=1133, name=httpShardExecutor-689-thread-1, state=RUNNABLE, group=TGRP-BasicDistributedZk2Test]
at java.base@11.0.16.1/sun.nio.ch.EPoll.wait(Native Method)
at java.base@11.0.16.1/sun.nio.ch.EPollSelectorImpl.doSelect(EPollSelectorImpl.java:120)
at java.base@11.0.16.1/sun.nio.ch.SelectorImpl.lockAndDoSelect(SelectorImpl.java:124)
at java.base@11.0.16.1/sun.nio.ch.SelectorImpl.select(SelectorImpl.java:141)
at app//org.eclipse.jetty.io.ManagedSelector.nioSelect(ManagedSelector.java:180)
at app//org.eclipse.jetty.io.ManagedSelector.select(ManagedSelector.java:187)
at app//org.eclipse.jetty.io.ManagedSelector$SelectorProducer.select(ManagedSelector.java:604)
at app//org.eclipse.jetty.io.ManagedSelector$SelectorProducer.produce(ManagedSelector.java:541)
at app//org.eclipse.jetty.util.thread.strategy.AdaptiveExecutionStrategy.produceTask(AdaptiveExecutionStrategy.java:450)
at app//org.eclipse.jetty.util.thread.strategy.AdaptiveExecutionStrategy.tryProduce(AdaptiveExecutionStrategy.java:243)
at app//org.eclipse.jetty.util.thread.strategy.AdaptiveExecutionStrategy.produce(AdaptiveExecutionStrategy.java:194)
at app//org.eclipse.jetty.io.ManagedSelector$$Lambda$340/0x00000001005a8440.run(Unknown Source)
at app//org.apache.solr.common.util.ExecutorUtil$MDCAwareThreadPoolExecutor.lambda$execute$0(ExecutorUtil.java:289)
at app//org.apache.solr.common.util.ExecutorUtil$MDCAwareThreadPoolExecutor$$Lambda$341/0x00000001005a8c40.run(Unknown Source)
at java.base@11.0.16.1/java.util.concurrent.ThreadPoolExecutor.runWorker(ThreadPoolExecutor.java:1128)
at java.base@11.0.16.1/java.util.concurrent.ThreadPoolExecutor$Worker.run(ThreadPoolExecutor.java:628)
at java.base@11.0.16.1/java.lang.Thread.run(Thread.java:829)
36) Thread[id=1152, name=CloserThread, state=WAITING, group=TGRP-BasicDistributedZk2Test]
at java.base@11.0.16.1/java.lang.Object.wait(Native Method)
at java.base@11.0.16.1/java.lang.Object.wait(Object.java:328)
at app//org.apache.solr.core.CloserThread.run(CoreContainer.java:2560)
37) Thread[id=1203, name=updateExecutor-667-thread-1, state=TIMED_WAITING, group=TGRP-BasicDistributedZk2Test]
at java.base@11.0.16.1/jdk.internal.misc.Unsafe.park(Native Method)
at java.base@11.0.16.1/java.util.concurrent.locks.LockSupport.parkNanos(LockSupport.java:234)
at java.base@11.0.16.1/java.util.concurrent.SynchronousQueue$TransferStack.awaitFulfill(SynchronousQueue.java:462)
at java.base@11.0.16.1/java.util.concurrent.SynchronousQueue$TransferStack.transfer(SynchronousQueue.java:361)
at java.base@11.0.16.1/java.util.concurrent.SynchronousQueue.poll(SynchronousQueue.java:937)
at java.base@11.0.16.1/java.util.concurrent.ThreadPoolExecutor.getTask(ThreadPoolExecutor.java:1053)
at java.base@11.0.16.1/java.util.concurrent.ThreadPoolExecutor.runWorker(ThreadPoolExecutor.java:1114)
at java.base@11.0.16.1/java.util.concurrent.ThreadPoolExecutor$Worker.run(ThreadPoolExecutor.java:628)
at java.base@11.0.16.1/java.lang.Thread.run(Thread.java:829)
38) Thread[id=1198, name=searcherExecutor-735-thread-1, state=WAITING, group=TGRP-BasicDistributedZk2Test]
at java.base@11.0.16.1/jdk.internal.misc.Unsafe.park(Native Method)
at java.base@11.0.16.1/java.util.concurrent.locks.LockSupport.park(LockSupport.java:194)
at java.base@11.0.16.1/java.util.concurrent.locks.AbstractQueuedSynchronizer$ConditionObject.await(AbstractQueuedSynchronizer.java:2081)
at java.base@11.0.16.1/java.util.concurrent.LinkedBlockingQueue.take(LinkedBlockingQueue.java:433)
at java.base@11.0.16.1/java.util.concurrent.ThreadPoolExecutor.getTask(ThreadPoolExecutor.java:1054)
at java.base@11.0.16.1/java.util.concurrent.ThreadPoolExecutor.runWorker(ThreadPoolExecutor.java:1114)
at java.base@11.0.16.1/java.util.concurrent.ThreadPoolExecutor$Worker.run(ThreadPoolExecutor.java:628)
at java.base@11.0.16.1/java.lang.Thread.run(Thread.java:829)
39) Thread[id=1194, name=zkCallback-684-thread-3, state=WAITING, group=TGRP-BasicDistributedZk2Test]
at java.base@11.0.16.1/java.lang.Object.wait(Native Method)
at java.base@11.0.16.1/java.lang.Object.wait(Object.java:328)
at app//org.apache.zookeeper.ClientCnxn.submitRequest(ClientCnxn.java:1577)
at app//org.apache.zookeeper.ClientCnxn.submitRequest(ClientCnxn.java:1549)
at app//org.apache.zookeeper.ZooKeeper.exists(ZooKeeper.java:1864)
at app//org.apache.solr.common.cloud.SolrZkClient.lambda$exists$3(SolrZkClient.java:387)
at app//org.apache.solr.common.cloud.SolrZkClient$$Lambda$1074/0x0000000100b07040.execute(Unknown Source)
at app//org.apache.solr.common.cloud.ZkCmdExecutor.retryOperation(ZkCmdExecutor.java:70)
at app//org.apache.solr.common.cloud.SolrZkClient.exists(SolrZkClient.java:387)
at app//org.apache.solr.common.cloud.ZkMaintenanceUtils.ensureExists(ZkMaintenanceUtils.java:642)
at app//org.apache.solr.common.cloud.ZkMaintenanceUtils.ensureExists(ZkMaintenanceUtils.java:601)
at app//org.apache.solr.cloud.ZkDistributedQueue.<init>(ZkDistributedQueue.java:138)
at app//org.apache.solr.cloud.ZkDistributedQueue.<init>(ZkDistributedQueue.java:126)
at app//org.apache.solr.cloud.ZkDistributedQueue.<init>(ZkDistributedQueue.java:122)
at app//org.apache.solr.cloud.Overseer.getInternalWorkQueue(Overseer.java:1073)
at app//org.apache.solr.cloud.Overseer$ClusterStateUpdater.<init>(Overseer.java:221)
at app//org.apache.solr.cloud.Overseer.start(Overseer.java:759)
at app//org.apache.solr.cloud.OverseerElectionContext.runLeaderProcess(OverseerElectionContext.java:76)
at app//org.apache.solr.cloud.LeaderElector.runIamLeaderProcess(LeaderElector.java:170)
at app//org.apache.solr.cloud.LeaderElector.checkIfIamLeader(LeaderElector.java:130)
at app//org.apache.solr.cloud.LeaderElector$ElectionWatcher.process(LeaderElector.java:350)
at app//org.apache.solr.common.cloud.SolrZkClient$ProcessWatchWithExecutor.lambda$process$1(SolrZkClient.java:1047)
at app//org.apache.solr.common.cloud.SolrZkClient$ProcessWatchWithExecutor$$Lambda$1124/0x0000000100b3e840.run(Unknown Source)
at java.base@11.0.16.1/java.util.concurrent.Executors$RunnableAdapter.call(Executors.java:515)
at java.base@11.0.16.1/java.util.concurrent.FutureTask.run(FutureTask.java:264)
at app//org.apache.solr.common.util.ExecutorUtil$MDCAwareThreadPoolExecutor.lambda$execute$0(ExecutorUtil.java:289)
at app//org.apache.solr.common.util.ExecutorUtil$MDCAwareThreadPoolExecutor$$Lambda$341/0x00000001005a8c40.run(Unknown Source)
at java.base@11.0.16.1/java.util.concurrent.ThreadPoolExecutor.runWorker(ThreadPoolExecutor.java:1128)
at java.base@11.0.16.1/java.util.concurrent.ThreadPoolExecutor$Worker.run(ThreadPoolExecutor.java:628)
at java.base@11.0.16.1/java.lang.Thread.run(Thread.java:829)
40) Thread[id=1101, name=qtp971043313-1101, state=TIMED_WAITING, group=TGRP-BasicDistributedZk2Test]
at java.base@11.0.16.1/jdk.internal.misc.Unsafe.park(Native Method)
at java.base@11.0.16.1/java.util.concurrent.locks.LockSupport.parkNanos(LockSupport.java:234)
at java.base@11.0.16.1/java.util.concurrent.locks.AbstractQueuedSynchronizer$ConditionObject.awaitNanos(AbstractQueuedSynchronizer.java:2123)
at app//org.eclipse.jetty.util.BlockingArrayQueue.poll(BlockingArrayQueue.java:219)
at app//org.eclipse.jetty.util.thread.QueuedThreadPool$Runner.idleJobPoll(QueuedThreadPool.java:1124)
at app//org.eclipse.jetty.util.thread.QueuedThreadPool$Runner.run(QueuedThreadPool.java:1141)
at java.base@11.0.16.1/java.lang.Thread.run(Thread.java:829)
41) Thread[id=1247, name=zkCallback-712-thread-3, state=TIMED_WAITING, group=TGRP-BasicDistributedZk2Test]
at java.base@11.0.16.1/jdk.internal.misc.Unsafe.park(Native Method)
at java.base@11.0.16.1/java.util.concurrent.locks.LockSupport.parkNanos(LockSupport.java:234)
at java.base@11.0.16.1/java.util.concurrent.SynchronousQueue$TransferStack.awaitFulfill(SynchronousQueue.java:462)
at java.base@11.0.16.1/java.util.concurrent.SynchronousQueue$TransferStack.transfer(SynchronousQueue.java:361)
at java.base@11.0.16.1/java.util.concurrent.SynchronousQueue.poll(SynchronousQueue.java:937)
at java.base@11.0.16.1/java.util.concurrent.ThreadPoolExecutor.getTask(ThreadPoolExecutor.java:1053)
at java.base@11.0.16.1/java.util.concurrent.ThreadPoolExecutor.runWorker(ThreadPoolExecutor.java:1114)
at java.base@11.0.16.1/java.util.concurrent.ThreadPoolExecutor$Worker.run(ThreadPoolExecutor.java:628)
at java.base@11.0.16.1/java.lang.Thread.run(Thread.java:829)
42) Thread[id=1201, name=zkCallback-699-thread-2, state=TIMED_WAITING, group=TGRP-BasicDistributedZk2Test]
at java.base@11.0.16.1/jdk.internal.misc.Unsafe.park(Native Method)
at java.base@11.0.16.1/java.util.concurrent.locks.LockSupport.parkNanos(LockSupport.java:234)
at java.base@11.0.16.1/java.util.concurrent.SynchronousQueue$TransferStack.awaitFulfill(SynchronousQueue.java:462)
at java.base@11.0.16.1/java.util.concurrent.SynchronousQueue$TransferStack.transfer(SynchronousQueue.java:361)
at java.base@11.0.16.1/java.util.concurrent.SynchronousQueue.poll(SynchronousQueue.java:937)
at java.base@11.0.16.1/java.util.concurrent.ThreadPoolExecutor.getTask(ThreadPoolExecutor.java:1053)
at java.base@11.0.16.1/java.util.concurrent.ThreadPoolExecutor.runWorker(ThreadPoolExecutor.java:1114)
at java.base@11.0.16.1/java.util.concurrent.ThreadPoolExecutor$Worker.run(ThreadPoolExecutor.java:628)
at java.base@11.0.16.1/java.lang.Thread.run(Thread.java:829)
43) Thread[id=1076, name=qtp1914490192-1076, state=TIMED_WAITING, group=TGRP-BasicDistributedZk2Test]
at java.base@11.0.16.1/jdk.internal.misc.Unsafe.park(Native Method)
at java.base@11.0.16.1/java.util.concurrent.locks.LockSupport.parkNanos(LockSupport.java:234)
at java.base@11.0.16.1/java.util.concurrent.locks.AbstractQueuedSynchronizer$ConditionObject.awaitNanos(AbstractQueuedSynchronizer.java:2123)
at app//org.eclipse.jetty.util.BlockingArrayQueue.poll(BlockingArrayQueue.java:219)
at app//org.eclipse.jetty.util.thread.QueuedThreadPool$Runner.idleJobPoll(QueuedThreadPool.java:1124)
at app//org.eclipse.jetty.util.thread.QueuedThreadPool$Runner.run(QueuedThreadPool.java:1141)
at java.base@11.0.16.1/java.lang.Thread.run(Thread.java:829)
44) Thread[id=1248, name=zkCallback-699-thread-3, state=TIMED_WAITING, group=TGRP-BasicDistributedZk2Test]
at java.base@11.0.16.1/jdk.internal.misc.Unsafe.park(Native Method)
at java.base@11.0.16.1/java.util.concurrent.locks.LockSupport.parkNanos(LockSupport.java:234)
at java.base@11.0.16.1/java.util.concurrent.SynchronousQueue$TransferStack.awaitFulfill(SynchronousQueue.java:462)
at java.base@11.0.16.1/java.util.concurrent.SynchronousQueue$TransferStack.transfer(SynchronousQueue.java:361)
at java.base@11.0.16.1/java.util.concurrent.SynchronousQueue.poll(SynchronousQueue.java:937)
at java.base@11.0.16.1/java.util.concurrent.ThreadPoolExecutor.getTask(ThreadPoolExecutor.java:1053)
at java.base@11.0.16.1/java.util.concurrent.ThreadPoolExecutor.runWorker(ThreadPoolExecutor.java:1114)
at java.base@11.0.16.1/java.util.concurrent.ThreadPoolExecutor$Worker.run(ThreadPoolExecutor.java:628)
at java.base@11.0.16.1/java.lang.Thread.run(Thread.java:829)
45) Thread[id=1256, name=zkCallback-699-thread-6, state=TIMED_WAITING, group=TGRP-BasicDistributedZk2Test]
at java.base@11.0.16.1/jdk.internal.misc.Unsafe.park(Native Method)
at java.base@11.0.16.1/java.util.concurrent.locks.LockSupport.parkNanos(LockSupport.java:234)
at java.base@11.0.16.1/java.util.concurrent.SynchronousQueue$TransferStack.awaitFulfill(SynchronousQueue.java:462)
at java.base@11.0.16.1/java.util.concurrent.SynchronousQueue$TransferStack.transfer(SynchronousQueue.java:361)
at java.base@11.0.16.1/java.util.concurrent.SynchronousQueue.poll(SynchronousQueue.java:937)
at java.base@11.0.16.1/java.util.concurrent.ThreadPoolExecutor.getTask(ThreadPoolExecutor.java:1053)
at java.base@11.0.16.1/java.util.concurrent.ThreadPoolExecutor.runWorker(ThreadPoolExecutor.java:1114)
at java.base@11.0.16.1/java.util.concurrent.ThreadPoolExecutor$Worker.run(ThreadPoolExecutor.java:628)
at java.base@11.0.16.1/java.lang.Thread.run(Thread.java:829)
46) Thread[id=1090, name=qtp747167750-1090, state=TIMED_WAITING, group=TGRP-BasicDistributedZk2Test]
at java.base@11.0.16.1/jdk.internal.misc.Unsafe.park(Native Method)
at java.base@11.0.16.1/java.util.concurrent.locks.LockSupport.parkNanos(LockSupport.java:234)
at java.base@11.0.16.1/java.util.concurrent.locks.AbstractQueuedSynchronizer$ConditionObject.awaitNanos(AbstractQueuedSynchronizer.java:2123)
at app//org.eclipse.jetty.util.BlockingArrayQueue.poll(BlockingArrayQueue.java:219)
at app//org.eclipse.jetty.util.thread.QueuedThreadPool$Runner.idleJobPoll(QueuedThreadPool.java:1124)
at app//org.eclipse.jetty.util.thread.QueuedThreadPool$Runner.run(QueuedThreadPool.java:1141)
at java.base@11.0.16.1/java.lang.Thread.run(Thread.java:829)
47) Thread[id=1092, name=Session-HouseKeeper-652c60ec-1, state=TIMED_WAITING, group=TGRP-BasicDistributedZk2Test]
at java.base@11.0.16.1/jdk.internal.misc.Unsafe.park(Native Method)
at java.base@11.0.16.1/java.util.concurrent.locks.LockSupport.parkNanos(LockSupport.java:234)
at java.base@11.0.16.1/java.util.concurrent.locks.AbstractQueuedSynchronizer$ConditionObject.awaitNanos(AbstractQueuedSynchronizer.java:2123)
at java.base@11.0.16.1/java.util.concurrent.ScheduledThreadPoolExecutor$DelayedWorkQueue.take(ScheduledThreadPoolExecutor.java:1182)
at java.base@11.0.16.1/java.util.concurrent.ScheduledThreadPoolExecutor$DelayedWorkQueue.take(ScheduledThreadPoolExecutor.java:899)
at java.base@11.0.16.1/java.util.concurrent.ThreadPoolExecutor.getTask(ThreadPoolExecutor.java:1054)
at java.base@11.0.16.1/java.util.concurrent.ThreadPoolExecutor.runWorker(ThreadPoolExecutor.java:1114)
at java.base@11.0.16.1/java.util.concurrent.ThreadPoolExecutor$Worker.run(ThreadPoolExecutor.java:628)
at java.base@11.0.16.1/java.lang.Thread.run(Thread.java:829)
48) Thread[id=1113, name=h2sc-668-thread-1, state=RUNNABLE, group=TGRP-BasicDistributedZk2Test]
at java.base@11.0.16.1/sun.nio.ch.EPoll.wait(Native Method)
at java.base@11.0.16.1/sun.nio.ch.EPollSelectorImpl.doSelect(EPollSelectorImpl.java:120)
at java.base@11.0.16.1/sun.nio.ch.SelectorImpl.lockAndDoSelect(SelectorImpl.java:124)
at java.base@11.0.16.1/sun.nio.ch.SelectorImpl.select(SelectorImpl.java:141)
at app//org.eclipse.jetty.io.ManagedSelector.nioSelect(ManagedSelector.java:180)
at app//org.eclipse.jetty.io.ManagedSelector.select(ManagedSelector.java:187)
at app//org.eclipse.jetty.io.ManagedSelector$SelectorProducer.select(ManagedSelector.java:604)
at app//org.eclipse.jetty.io.ManagedSelector$SelectorProducer.produce(ManagedSelector.java:541)
at app//org.eclipse.jetty.util.thread.strategy.AdaptiveExecutionStrategy.produceTask(AdaptiveExecutionStrategy.java:450)
at app//org.eclipse.jetty.util.thread.strategy.AdaptiveExecutionStrategy.tryProduce(AdaptiveExecutionStrategy.java:243)
at app//org.eclipse.jetty.util.thread.strategy.AdaptiveExecutionStrategy.produce(AdaptiveExecutionStrategy.java:194)
at app//org.eclipse.jetty.io.ManagedSelector$$Lambda$340/0x00000001005a8440.run(Unknown Source)
at app//org.apache.solr.common.util.ExecutorUtil$MDCAwareThreadPoolExecutor.lambda$execute$0(ExecutorUtil.java:289)
at app//org.apache.solr.common.util.ExecutorUtil$MDCAwareThreadPoolExecutor$$Lambda$341/0x00000001005a8c40.run(Unknown Source)
at java.base@11.0.16.1/java.util.concurrent.ThreadPoolExecutor.runWorker(ThreadPoolExecutor.java:1128)
at java.base@11.0.16.1/java.util.concurrent.ThreadPoolExecutor$Worker.run(ThreadPoolExecutor.java:628)
at java.base@11.0.16.1/java.lang.Thread.run(Thread.java:829)
49) Thread[id=1096, name=qtp971043313-1096, state=RUNNABLE, group=TGRP-BasicDistributedZk2Test]
at java.base@11.0.16.1/sun.nio.ch.EPoll.wait(Native Method)
at java.base@11.0.16.1/sun.nio.ch.EPollSelectorImpl.doSelect(EPollSelectorImpl.java:120)
at java.base@11.0.16.1/sun.nio.ch.SelectorImpl.lockAndDoSelect(SelectorImpl.java:124)
at java.base@11.0.16.1/sun.nio.ch.SelectorImpl.select(SelectorImpl.java:141)
at app//org.eclipse.jetty.io.ManagedSelector.nioSelect(ManagedSelector.java:180)
at app//org.eclipse.jetty.io.ManagedSelector.select(ManagedSelector.java:187)
at app//org.eclipse.jetty.io.ManagedSelector$SelectorProducer.select(ManagedSelector.java:604)
at app//org.eclipse.jetty.io.ManagedSelector$SelectorProducer.produce(ManagedSelector.java:541)
at app//org.eclipse.jetty.util.thread.strategy.AdaptiveExecutionStrategy.produceTask(AdaptiveExecutionStrategy.java:450)
at app//org.eclipse.jetty.util.thread.strategy.AdaptiveExecutionStrategy.tryProduce(AdaptiveExecutionStrategy.java:243)
at app//org.eclipse.jetty.util.thread.strategy.AdaptiveExecutionStrategy.produce(AdaptiveExecutionStrategy.java:194)
at app//org.eclipse.jetty.io.ManagedSelector$$Lambda$340/0x00000001005a8440.run(Unknown Source)
at app//org.eclipse.jetty.util.thread.QueuedThreadPool.runJob(QueuedThreadPool.java:969)
at app//org.eclipse.jetty.util.thread.QueuedThreadPool$Runner.doRunJob(QueuedThreadPool.java:1194)
at app//org.eclipse.jetty.util.thread.QueuedThreadPool$Runner.run(QueuedThreadPool.java:1149)
at java.base@11.0.16.1/java.lang.Thread.run(Thread.java:829)
50) Thread[id=1105, name=Session-HouseKeeper-783c1cbd-1, state=TIMED_WAITING, group=TGRP-BasicDistributedZk2Test]
at java.base@11.0.16.1/jdk.internal.misc.Unsafe.park(Native Method)
at java.base@11.0.16.1/java.util.concurrent.locks.LockSupport.parkNanos(LockSupport.java:234)
at java.base@11.0.16.1/java.util.concurrent.locks.AbstractQueuedSynchronizer$ConditionObject.awaitNanos(AbstractQueuedSynchronizer.java:2123)
at java.base@11.0.16.1/java.util.concurrent.ScheduledThreadPoolExecutor$DelayedWorkQueue.take(ScheduledThreadPoolExecutor.java:1182)
at java.base@11.0.16.1/java.util.concurrent.ScheduledThreadPoolExecutor$DelayedWorkQueue.take(ScheduledThreadPoolExecutor.java:899)
at java.base@11.0.16.1/java.util.concurrent.ThreadPoolExecutor.getTask(ThreadPoolExecutor.java:1054)
at java.base@11.0.16.1/java.util.concurrent.ThreadPoolExecutor.runWorker(ThreadPoolExecutor.java:1114)
at java.base@11.0.16.1/java.util.concurrent.ThreadPoolExecutor$Worker.run(ThreadPoolExecutor.java:628)
at java.base@11.0.16.1/java.lang.Thread.run(Thread.java:829)
51) Thread[id=1064, name=qtp792402874-1064, state=TIMED_WAITING, group=TGRP-BasicDistributedZk2Test]
at java.base@11.0.16.1/jdk.internal.misc.Unsafe.park(Native Method)
at java.base@11.0.16.1/java.util.concurrent.locks.LockSupport.parkNanos(LockSupport.java:234)
at java.base@11.0.16.1/java.util.concurrent.locks.AbstractQueuedSynchronizer$ConditionObject.awaitNanos(AbstractQueuedSynchronizer.java:2123)
at app//org.eclipse.jetty.util.BlockingArrayQueue.poll(BlockingArrayQueue.java:219)
at app//org.eclipse.jetty.util.thread.QueuedThreadPool$Runner.idleJobPoll(QueuedThreadPool.java:1124)
at app//org.eclipse.jetty.util.thread.QueuedThreadPool$Runner.run(QueuedThreadPool.java:1141)
at java.base@11.0.16.1/java.lang.Thread.run(Thread.java:829)
52) Thread[id=1062, name=qtp792402874-1062, state=TIMED_WAITING, group=TGRP-BasicDistributedZk2Test]
at java.base@11.0.16.1/jdk.internal.misc.Unsafe.park(Native Method)
at java.base@11.0.16.1/java.util.concurrent.locks.LockSupport.parkNanos(LockSupport.java:234)
at java.base@11.0.16.1/java.util.concurrent.locks.AbstractQueuedSynchronizer$ConditionObject.awaitNanos(AbstractQueuedSynchronizer.java:2123)
at app//org.eclipse.jetty.util.BlockingArrayQueue.poll(BlockingArrayQueue.java:219)
at app//org.eclipse.jetty.util.thread.QueuedThreadPool$Runner.idleJobPoll(QueuedThreadPool.java:1124)
at app//org.eclipse.jetty.util.thread.QueuedThreadPool$Runner.run(QueuedThreadPool.java:1141)
at java.base@11.0.16.1/java.lang.Thread.run(Thread.java:829)
53) Thread[id=1211, name=h2sc-675-thread-4, state=WAITING, group=TGRP-BasicDistributedZk2Test]
at java.base@11.0.16.1/jdk.internal.misc.Unsafe.park(Native Method)
at java.base@11.0.16.1/java.util.concurrent.locks.LockSupport.park(LockSupport.java:194)
at java.base@11.0.16.1/java.util.concurrent.locks.AbstractQueuedSynchronizer$ConditionObject.await(AbstractQueuedSynchronizer.java:2081)
at app//org.eclipse.jetty.util.BlockingArrayQueue.take(BlockingArrayQueue.java:547)
at java.base@11.0.16.1/java.util.concurrent.ThreadPoolExecutor.getTask(ThreadPoolExecutor.java:1054)
at java.base@11.0.16.1/java.util.concurrent.ThreadPoolExecutor.runWorker(ThreadPoolExecutor.java:1114)
at java.base@11.0.16.1/java.util.concurrent.ThreadPoolExecutor$Worker.run(ThreadPoolExecutor.java:628)
at java.base@11.0.16.1/java.lang.Thread.run(Thread.java:829)
54) Thread[id=1255, name=zkCallback-699-thread-5, state=TIMED_WAITING, group=TGRP-BasicDistributedZk2Test]
at java.base@11.0.16.1/jdk.internal.misc.Unsafe.park(Native Method)
at java.base@11.0.16.1/java.util.concurrent.locks.LockSupport.parkNanos(LockSupport.java:234)
at java.base@11.0.16.1/java.util.concurrent.SynchronousQueue$TransferStack.awaitFulfill(SynchronousQueue.java:462)
at java.base@11.0.16.1/java.util.concurrent.SynchronousQueue$TransferStack.transfer(SynchronousQueue.java:361)
at java.base@11.0.16.1/java.util.concurrent.SynchronousQueue.poll(SynchronousQueue.java:937)
at java.base@11.0.16.1/java.util.concurrent.ThreadPoolExecutor.getTask(ThreadPoolExecutor.java:1053)
at java.base@11.0.16.1/java.util.concurrent.ThreadPoolExecutor.runWorker(ThreadPoolExecutor.java:1114)
at java.base@11.0.16.1/java.util.concurrent.ThreadPoolExecutor$Worker.run(ThreadPoolExecutor.java:628)
at java.base@11.0.16.1/java.lang.Thread.run(Thread.java:829)
55) Thread[id=1209, name=HttpClient@1e614b0c-scheduler-1, state=TIMED_WAITING, group=TGRP-BasicDistributedZk2Test]
at java.base@11.0.16.1/jdk.internal.misc.Unsafe.park(Native Method)
at java.base@11.0.16.1/java.util.concurrent.locks.LockSupport.parkNanos(LockSupport.java:234)
at java.base@11.0.16.1/java.util.concurrent.locks.AbstractQueuedSynchronizer$ConditionObject.awaitNanos(AbstractQueuedSynchronizer.java:2123)
at java.base@11.0.16.1/java.util.concurrent.ScheduledThreadPoolExecutor$DelayedWorkQueue.take(ScheduledThreadPoolExecutor.java:1182)
at java.base@11.0.16.1/java.util.concurrent.ScheduledThreadPoolExecutor$DelayedWorkQueue.take(ScheduledThreadPoolExecutor.java:899)
at java.base@11.0.16.1/java.util.concurrent.ThreadPoolExecutor.getTask(ThreadPoolExecutor.java:1054)
at java.base@11.0.16.1/java.util.concurrent.ThreadPoolExecutor.runWorker(ThreadPoolExecutor.java:1114)
at java.base@11.0.16.1/java.util.concurrent.ThreadPoolExecutor$Worker.run(ThreadPoolExecutor.java:628)
at java.base@11.0.16.1/java.lang.Thread.run(Thread.java:829)
56) Thread[id=1214, name=h2sc-675-thread-6, state=WAITING, group=TGRP-BasicDistributedZk2Test]
at java.base@11.0.16.1/jdk.internal.misc.Unsafe.park(Native Method)
at java.base@11.0.16.1/java.util.concurrent.locks.LockSupport.park(LockSupport.java:194)
at java.base@11.0.16.1/java.util.concurrent.locks.AbstractQueuedSynchronizer$ConditionObject.await(AbstractQueuedSynchronizer.java:2081)
at app//org.eclipse.jetty.util.BlockingArrayQueue.take(BlockingArrayQueue.java:547)
at java.base@11.0.16.1/java.util.concurrent.ThreadPoolExecutor.getTask(ThreadPoolExecutor.java:1054)
at java.base@11.0.16.1/java.util.concurrent.ThreadPoolExecutor.runWorker(ThreadPoolExecutor.java:1114)
at java.base@11.0.16.1/java.util.concurrent.ThreadPoolExecutor$Worker.run(ThreadPoolExecutor.java:628)
at java.base@11.0.16.1/java.lang.Thread.run(Thread.java:829)
57) Thread[id=1250, name=zkCallback-684-thread-6, state=TIMED_WAITING, group=TGRP-BasicDistributedZk2Test]
at java.base@11.0.16.1/jdk.internal.misc.Unsafe.park(Native Method)
at java.base@11.0.16.1/java.util.concurrent.locks.LockSupport.parkNanos(LockSupport.java:234)
at java.base@11.0.16.1/java.util.concurrent.SynchronousQueue$TransferStack.awaitFulfill(SynchronousQueue.java:462)
at java.base@11.0.16.1/java.util.concurrent.SynchronousQueue$TransferStack.transfer(SynchronousQueue.java:361)
at java.base@11.0.16.1/java.util.concurrent.SynchronousQueue.poll(SynchronousQueue.java:937)
at java.base@11.0.16.1/java.util.concurrent.ThreadPoolExecutor.getTask(ThreadPoolExecutor.java:1053)
at java.base@11.0.16.1/java.util.concurrent.ThreadPoolExecutor.runWorker(ThreadPoolExecutor.java:1114)
at java.base@11.0.16.1/java.util.concurrent.ThreadPoolExecutor$Worker.run(ThreadPoolExecutor.java:628)
at java.base@11.0.16.1/java.lang.Thread.run(Thread.java:829)
58) Thread[id=1059, name=qtp792402874-1059, state=TIMED_WAITING, group=TGRP-BasicDistributedZk2Test]
at java.base@11.0.16.1/jdk.internal.misc.Unsafe.park(Native Method)
at java.base@11.0.16.1/java.util.concurrent.locks.LockSupport.parkNanos(LockSupport.java:234)
at java.base@11.0.16.1/java.util.concurrent.locks.AbstractQueuedSynchronizer$ConditionObject.awaitNanos(AbstractQueuedSynchronizer.java:2123)
at app//org.eclipse.jetty.util.BlockingArrayQueue.poll(BlockingArrayQueue.java:219)
at app//org.eclipse.jetty.util.thread.QueuedThreadPool$Runner.idleJobPoll(QueuedThreadPool.java:1124)
at app//org.eclipse.jetty.util.thread.QueuedThreadPool$Runner.run(QueuedThreadPool.java:1141)
at java.base@11.0.16.1/java.lang.Thread.run(Thread.java:829)
59) Thread[id=1087, name=qtp747167750-1087, state=TIMED_WAITING, group=TGRP-BasicDistributedZk2Test]
at java.base@11.0.16.1/jdk.internal.misc.Unsafe.park(Native Method)
at java.base@11.0.16.1/java.util.concurrent.locks.LockSupport.parkNanos(LockSupport.java:234)
at java.base@11.0.16.1/java.util.concurrent.locks.AbstractQueuedSynchronizer$ConditionObject.awaitNanos(AbstractQueuedSynchronizer.java:2123)
at app//org.eclipse.jetty.util.BlockingArrayQueue.poll(BlockingArrayQueue.java:219)
at app//org.eclipse.jetty.util.thread.QueuedThreadPool$Runner.idleJobPoll(QueuedThreadPool.java:1124)
at app//org.eclipse.jetty.util.thread.QueuedThreadPool$Runner.run(QueuedThreadPool.java:1141)
at java.base@11.0.16.1/java.lang.Thread.run(Thread.java:829)
60) Thread[id=1103, name=qtp971043313-1103, state=TIMED_WAITING, group=TGRP-BasicDistributedZk2Test]
at java.base@11.0.16.1/jdk.internal.misc.Unsafe.park(Native Method)
at java.base@11.0.16.1/java.util.concurrent.locks.LockSupport.parkNanos(LockSupport.java:234)
at java.base@11.0.16.1/java.util.concurrent.locks.AbstractQueuedSynchronizer$ConditionObject.awaitNanos(AbstractQueuedSynchronizer.java:2123)
at app//org.eclipse.jetty.util.BlockingArrayQueue.poll(BlockingArrayQueue.java:219)
at app//org.eclipse.jetty.util.thread.QueuedThreadPool$Runner.idleJobPoll(QueuedThreadPool.java:1124)
at app//org.eclipse.jetty.util.thread.QueuedThreadPool$Runner.run(QueuedThreadPool.java:1141)
at java.base@11.0.16.1/java.lang.Thread.run(Thread.java:829)
61) Thread[id=1168, name=zkConnectionManagerCallback-713-thread-1, state=WAITING, group=TGRP-BasicDistributedZk2Test]
at java.base@11.0.16.1/jdk.internal.misc.Unsafe.park(Native Method)
at java.base@11.0.16.1/java.util.concurrent.locks.LockSupport.park(LockSupport.java:194)
at java.base@11.0.16.1/java.util.concurrent.locks.AbstractQueuedSynchronizer$ConditionObject.await(AbstractQueuedSynchronizer.java:2081)
at java.base@11.0.16.1/java.util.concurrent.LinkedBlockingQueue.take(LinkedBlockingQueue.java:433)
at java.base@11.0.16.1/java.util.concurrent.ThreadPoolExecutor.getTask(ThreadPoolExecutor.java:1054)
at java.base@11.0.16.1/java.util.concurrent.ThreadPoolExecutor.runWorker(ThreadPoolExecutor.java:1114)
at java.base@11.0.16.1/java.util.concurrent.ThreadPoolExecutor$Worker.run(ThreadPoolExecutor.java:628)
at java.base@11.0.16.1/java.lang.Thread.run(Thread.java:829)
62) Thread[id=1185, name=watches-701-thread-1, state=TIMED_WAITING, group=TGRP-BasicDistributedZk2Test]
at java.base@11.0.16.1/jdk.internal.misc.Unsafe.park(Native Method)
at java.base@11.0.16.1/java.util.concurrent.locks.LockSupport.parkNanos(LockSupport.java:234)
at java.base@11.0.16.1/java.util.concurrent.SynchronousQueue$TransferStack.awaitFulfill(SynchronousQueue.java:462)
at java.base@11.0.16.1/java.util.concurrent.SynchronousQueue$TransferStack.transfer(SynchronousQueue.java:361)
at java.base@11.0.16.1/java.util.concurrent.SynchronousQueue.poll(SynchronousQueue.java:937)
at java.base@11.0.16.1/java.util.concurrent.ThreadPoolExecutor.getTask(ThreadPoolExecutor.java:1053)
at java.base@11.0.16.1/java.util.concurrent.ThreadPoolExecutor.runWorker(ThreadPoolExecutor.java:1114)
at java.base@11.0.16.1/java.util.concurrent.ThreadPoolExecutor$Worker.run(ThreadPoolExecutor.java:628)
at java.base@11.0.16.1/java.lang.Thread.run(Thread.java:829)
63) Thread[id=1123, name=h2sc-675-thread-2, state=RUNNABLE, group=TGRP-BasicDistributedZk2Test]
at java.base@11.0.16.1/sun.nio.ch.EPoll.wait(Native Method)
at java.base@11.0.16.1/sun.nio.ch.EPollSelectorImpl.doSelect(EPollSelectorImpl.java:120)
at java.base@11.0.16.1/sun.nio.ch.SelectorImpl.lockAndDoSelect(SelectorImpl.java:124)
at java.base@11.0.16.1/sun.nio.ch.SelectorImpl.select(SelectorImpl.java:141)
at app//org.eclipse.jetty.io.ManagedSelector.nioSelect(ManagedSelector.java:180)
at app//org.eclipse.jetty.io.ManagedSelector.select(ManagedSelector.java:187)
at app//org.eclipse.jetty.io.ManagedSelector$SelectorProducer.select(ManagedSelector.java:604)
at app//org.eclipse.jetty.io.ManagedSelector$SelectorProducer.produce(ManagedSelector.java:541)
at app//org.eclipse.jetty.util.thread.strategy.AdaptiveExecutionStrategy.produceTask(AdaptiveExecutionStrategy.java:450)
at app//org.eclipse.jetty.util.thread.strategy.AdaptiveExecutionStrategy.tryProduce(AdaptiveExecutionStrategy.java:243)
at app//org.eclipse.jetty.util.thread.strategy.AdaptiveExecutionStrategy.produce(AdaptiveExecutionStrategy.java:194)
at app//org.eclipse.jetty.io.ManagedSelector$$Lambda$340/0x00000001005a8440.run(Unknown Source)
at app//org.apache.solr.common.util.ExecutorUtil$MDCAwareThreadPoolExecutor.lambda$execute$0(ExecutorUtil.java:289)
at app//org.apache.solr.common.util.ExecutorUtil$MDCAwareThreadPoolExecutor$$Lambda$341/0x00000001005a8c40.run(Unknown Source)
at java.base@11.0.16.1/java.util.concurrent.ThreadPoolExecutor.runWorker(ThreadPoolExecutor.java:1128)
at java.base@11.0.16.1/java.util.concurrent.ThreadPoolExecutor$Worker.run(ThreadPoolExecutor.java:628)
at java.base@11.0.16.1/java.lang.Thread.run(Thread.java:829)
64) Thread[id=1065, name=Session-HouseKeeper-28f8dfc0-1, state=TIMED_WAITING, group=TGRP-BasicDistributedZk2Test]
at java.base@11.0.16.1/jdk.internal.misc.Unsafe.park(Native Method)
at java.base@11.0.16.1/java.util.concurrent.locks.LockSupport.parkNanos(LockSupport.java:234)
at java.base@11.0.16.1/java.util.concurrent.locks.AbstractQueuedSynchronizer$ConditionObject.awaitNanos(AbstractQueuedSynchronizer.java:2123)
at java.base@11.0.16.1/java.util.concurrent.ScheduledThreadPoolExecutor$DelayedWorkQueue.take(ScheduledThreadPoolExecutor.java:1182)
at java.base@11.0.16.1/java.util.concurrent.ScheduledThreadPoolExecutor$DelayedWorkQueue.take(ScheduledThreadPoolExecutor.java:899)
at java.base@11.0.16.1/java.util.concurrent.ThreadPoolExecutor.getTask(ThreadPoolExecutor.java:1054)
at java.base@11.0.16.1/java.util.concurrent.ThreadPoolExecutor.runWorker(ThreadPoolExecutor.java:1114)
at java.base@11.0.16.1/java.util.concurrent.ThreadPoolExecutor$Worker.run(ThreadPoolExecutor.java:628)
at java.base@11.0.16.1/java.lang.Thread.run(Thread.java:829)
65) Thread[id=1202, name=zkCallback-684-thread-4, state=TIMED_WAITING, group=TGRP-BasicDistributedZk2Test]
at java.base@11.0.16.1/jdk.internal.misc.Unsafe.park(Native Method)
at java.base@11.0.16.1/java.util.concurrent.locks.LockSupport.parkNanos(LockSupport.java:234)
at java.base@11.0.16.1/java.util.concurrent.SynchronousQueue$TransferStack.awaitFulfill(SynchronousQueue.java:462)
at java.base@11.0.16.1/java.util.concurrent.SynchronousQueue$TransferStack.transfer(SynchronousQueue.java:361)
at java.base@11.0.16.1/java.util.concurrent.SynchronousQueue.poll(SynchronousQueue.java:937)
at java.base@11.0.16.1/java.util.concurrent.ThreadPoolExecutor.getTask(ThreadPoolExecutor.java:1053)
at java.base@11.0.16.1/java.util.concurrent.ThreadPoolExecutor.runWorker(ThreadPoolExecutor.java:1114)
at java.base@11.0.16.1/java.util.concurrent.ThreadPoolExecutor$Worker.run(ThreadPoolExecutor.java:628)
at java.base@11.0.16.1/java.lang.Thread.run(Thread.java:829)
66) Thread[id=1140, name=CloserThread, state=WAITING, group=TGRP-BasicDistributedZk2Test]
at java.base@11.0.16.1/java.lang.Object.wait(Native Method)
at java.base@11.0.16.1/java.lang.Object.wait(Object.java:328)
at app//org.apache.solr.core.CloserThread.run(CoreContainer.java:2560)
67) Thread[id=1122, name=h2sc-675-thread-1, state=RUNNABLE, group=TGRP-BasicDistributedZk2Test]
at java.base@11.0.16.1/sun.nio.ch.EPoll.wait(Native Method)
at java.base@11.0.16.1/sun.nio.ch.EPollSelectorImpl.doSelect(EPollSelectorImpl.java:120)
at java.base@11.0.16.1/sun.nio.ch.SelectorImpl.lockAndDoSelect(SelectorImpl.java:124)
at java.base@11.0.16.1/sun.nio.ch.SelectorImpl.select(SelectorImpl.java:141)
at app//org.eclipse.jetty.io.ManagedSelector.nioSelect(ManagedSelector.java:180)
at app//org.eclipse.jetty.io.ManagedSelector.select(ManagedSelector.java:187)
at app//org.eclipse.jetty.io.ManagedSelector$SelectorProducer.select(ManagedSelector.java:604)
at app//org.eclipse.jetty.io.ManagedSelector$SelectorProducer.produce(ManagedSelector.java:541)
at app//org.eclipse.jetty.util.thread.strategy.AdaptiveExecutionStrategy.produceTask(AdaptiveExecutionStrategy.java:450)
at app//org.eclipse.jetty.util.thread.strategy.AdaptiveExecutionStrategy.tryProduce(AdaptiveExecutionStrategy.java:243)
at app//org.eclipse.jetty.util.thread.strategy.AdaptiveExecutionStrategy.produce(AdaptiveExecutionStrategy.java:194)
at app//org.eclipse.jetty.io.ManagedSelector$$Lambda$340/0x00000001005a8440.run(Unknown Source)
at app//org.apache.solr.common.util.ExecutorUtil$MDCAwareThreadPoolExecutor.lambda$execute$0(ExecutorUtil.java:289)
at app//org.apache.solr.common.util.ExecutorUtil$MDCAwareThreadPoolExecutor$$Lambda$341/0x00000001005a8c40.run(Unknown Source)
at java.base@11.0.16.1/java.util.concurrent.ThreadPoolExecutor.runWorker(ThreadPoolExecutor.java:1128)
at java.base@11.0.16.1/java.util.concurrent.ThreadPoolExecutor$Worker.run(ThreadPoolExecutor.java:628)
at java.base@11.0.16.1/java.lang.Thread.run(Thread.java:829)
68) Thread[id=1078, name=Session-HouseKeeper-3f11d64f-1, state=TIMED_WAITING, group=TGRP-BasicDistributedZk2Test]
at java.base@11.0.16.1/jdk.internal.misc.Unsafe.park(Native Method)
at java.base@11.0.16.1/java.util.concurrent.locks.LockSupport.parkNanos(LockSupport.java:234)
at java.base@11.0.16.1/java.util.concurrent.locks.AbstractQueuedSynchronizer$ConditionObject.awaitNanos(AbstractQueuedSynchronizer.java:2123)
at java.base@11.0.16.1/java.util.concurrent.ScheduledThreadPoolExecutor$DelayedWorkQueue.take(ScheduledThreadPoolExecutor.java:1182)
at java.base@11.0.16.1/java.util.concurrent.ScheduledThreadPoolExecutor$DelayedWorkQueue.take(ScheduledThreadPoolExecutor.java:899)
at java.base@11.0.16.1/java.util.concurrent.ThreadPoolExecutor.getTask(ThreadPoolExecutor.java:1054)
at java.base@11.0.16.1/java.util.concurrent.ThreadPoolExecutor.runWorker(ThreadPoolExecutor.java:1114)
at java.base@11.0.16.1/java.util.concurrent.ThreadPoolExecutor$Worker.run(ThreadPoolExecutor.java:628)
at java.base@11.0.16.1/java.lang.Thread.run(Thread.java:829)
69) Thread[id=1118, name=httpShardExecutor-673-thread-1, state=RUNNABLE, group=TGRP-BasicDistributedZk2Test]
at java.base@11.0.16.1/sun.nio.ch.EPoll.wait(Native Method)
at java.base@11.0.16.1/sun.nio.ch.EPollSelectorImpl.doSelect(EPollSelectorImpl.java:120)
at java.base@11.0.16.1/sun.nio.ch.SelectorImpl.lockAndDoSelect(SelectorImpl.java:124)
at java.base@11.0.16.1/sun.nio.ch.SelectorImpl.select(SelectorImpl.java:141)
at app//org.eclipse.jetty.io.ManagedSelector.nioSelect(ManagedSelector.java:180)
at app//org.eclipse.jetty.io.ManagedSelector.select(ManagedSelector.java:187)
at app//org.eclipse.jetty.io.ManagedSelector$SelectorProducer.select(ManagedSelector.java:604)
at app//org.eclipse.jetty.io.ManagedSelector$SelectorProducer.produce(ManagedSelector.java:541)
at app//org.eclipse.jetty.util.thread.strategy.AdaptiveExecutionStrategy.produceTask(AdaptiveExecutionStrategy.java:450)
at app//org.eclipse.jetty.util.thread.strategy.AdaptiveExecutionStrategy.tryProduce(AdaptiveExecutionStrategy.java:243)
at app//org.eclipse.jetty.util.thread.strategy.AdaptiveExecutionStrategy.produce(AdaptiveExecutionStrategy.java:194)
at app//org.eclipse.jetty.io.ManagedSelector$$Lambda$340/0x00000001005a8440.run(Unknown Source)
at app//org.apache.solr.common.util.ExecutorUtil$MDCAwareThreadPoolExecutor.lambda$execute$0(ExecutorUtil.java:289)
at app//org.apache.solr.common.util.ExecutorUtil$MDCAwareThreadPoolExecutor$$Lambda$341/0x00000001005a8c40.run(Unknown Source)
at java.base@11.0.16.1/java.util.concurrent.ThreadPoolExecutor.runWorker(ThreadPoolExecutor.java:1128)
at java.base@11.0.16.1/java.util.concurrent.ThreadPoolExecutor$Worker.run(ThreadPoolExecutor.java:628)
at java.base@11.0.16.1/java.lang.Thread.run(Thread.java:829)
70) Thread[id=1156, name=httpShardExecutor-706-thread-1, state=RUNNABLE, group=TGRP-BasicDistributedZk2Test]
at java.base@11.0.16.1/sun.nio.ch.EPoll.wait(Native Method)
at java.base@11.0.16.1/sun.nio.ch.EPollSelectorImpl.doSelect(EPollSelectorImpl.java:120)
at java.base@11.0.16.1/sun.nio.ch.SelectorImpl.lockAndDoSelect(SelectorImpl.java:124)
at java.base@11.0.16.1/sun.nio.ch.SelectorImpl.select(SelectorImpl.java:141)
at app//org.eclipse.jetty.io.ManagedSelector.nioSelect(ManagedSelector.java:180)
at app//org.eclipse.jetty.io.ManagedSelector.select(ManagedSelector.java:187)
at app//org.eclipse.jetty.io.ManagedSelector$SelectorProducer.select(ManagedSelector.java:604)
at app//org.eclipse.jetty.io.ManagedSelector$SelectorProducer.produce(ManagedSelector.java:541)
at app//org.eclipse.jetty.util.thread.strategy.AdaptiveExecutionStrategy.produceTask(AdaptiveExecutionStrategy.java:450)
at app//org.eclipse.jetty.util.thread.strategy.AdaptiveExecutionStrategy.tryProduce(AdaptiveExecutionStrategy.java:243)
at app//org.eclipse.jetty.util.thread.strategy.AdaptiveExecutionStrategy.produce(AdaptiveExecutionStrategy.java:194)
at app//org.eclipse.jetty.io.ManagedSelector$$Lambda$340/0x00000001005a8440.run(Unknown Source)
at app//org.apache.solr.common.util.ExecutorUtil$MDCAwareThreadPoolExecutor.lambda$execute$0(ExecutorUtil.java:289)
at app//org.apache.solr.common.util.ExecutorUtil$MDCAwareThreadPoolExecutor$$Lambda$341/0x00000001005a8c40.run(Unknown Source)
at java.base@11.0.16.1/java.util.concurrent.ThreadPoolExecutor.runWorker(ThreadPoolExecutor.java:1128)
at java.base@11.0.16.1/java.util.concurrent.ThreadPoolExecutor$Worker.run(ThreadPoolExecutor.java:628)
at java.base@11.0.16.1/java.lang.Thread.run(Thread.java:829)
71) Thread[id=1254, name=zkCallback-699-thread-4, state=TIMED_WAITING, group=TGRP-BasicDistributedZk2Test]
at java.base@11.0.16.1/jdk.internal.misc.Unsafe.park(Native Method)
at java.base@11.0.16.1/java.util.concurrent.locks.LockSupport.parkNanos(LockSupport.java:234)
at java.base@11.0.16.1/java.util.concurrent.SynchronousQueue$TransferStack.awaitFulfill(SynchronousQueue.java:462)
at java.base@11.0.16.1/java.util.concurrent.SynchronousQueue$TransferStack.transfer(SynchronousQueue.java:361)
at java.base@11.0.16.1/java.util.concurrent.SynchronousQueue.poll(SynchronousQueue.java:937)
at java.base@11.0.16.1/java.util.concurrent.ThreadPoolExecutor.getTask(ThreadPoolExecutor.java:1053)
at java.base@11.0.16.1/java.util.concurrent.ThreadPoolExecutor.runWorker(ThreadPoolExecutor.java:1114)
at java.base@11.0.16.1/java.util.concurrent.ThreadPoolExecutor$Worker.run(ThreadPoolExecutor.java:628)
at java.base@11.0.16.1/java.lang.Thread.run(Thread.java:829)
72) Thread[id=1058, name=qtp792402874-1058-acceptor-0@1839d49a-ServerConnector@2b048a85{HTTP/1.1, (http/1.1, h2c)}{127.0.0.1:37561}, state=RUNNABLE, group=TGRP-BasicDistributedZk2Test]
at java.base@11.0.16.1/sun.nio.ch.ServerSocketChannelImpl.accept0(Native Method)
at java.base@11.0.16.1/sun.nio.ch.ServerSocketChannelImpl.accept(ServerSocketChannelImpl.java:533)
at java.base@11.0.16.1/sun.nio.ch.ServerSocketChannelImpl.accept(ServerSocketChannelImpl.java:285)
at app//org.eclipse.jetty.server.ServerConnector.accept(ServerConnector.java:409)
at app//org.eclipse.jetty.server.AbstractConnector$Acceptor.run(AbstractConnector.java:748)
at app//org.eclipse.jetty.util.thread.QueuedThreadPool.runJob(QueuedThreadPool.java:969)
at app//org.eclipse.jetty.util.thread.QueuedThreadPool$Runner.doRunJob(QueuedThreadPool.java:1194)
at app//org.eclipse.jetty.util.thread.QueuedThreadPool$Runner.run(QueuedThreadPool.java:1149)
at java.base@11.0.16.1/java.lang.Thread.run(Thread.java:829)
73) Thread[id=1110, name=httpShardExecutor-666-thread-2, state=RUNNABLE, group=TGRP-BasicDistributedZk2Test]
at java.base@11.0.16.1/sun.nio.ch.EPoll.wait(Native Method)
at java.base@11.0.16.1/sun.nio.ch.EPollSelectorImpl.doSelect(EPollSelectorImpl.java:120)
at java.base@11.0.16.1/sun.nio.ch.SelectorImpl.lockAndDoSelect(SelectorImpl.java:124)
at java.base@11.0.16.1/sun.nio.ch.SelectorImpl.select(SelectorImpl.java:141)
at app//org.eclipse.jetty.io.ManagedSelector.nioSelect(ManagedSelector.java:180)
at app//org.eclipse.jetty.io.ManagedSelector.select(ManagedSelector.java:187)
at app//org.eclipse.jetty.io.ManagedSelector$SelectorProducer.select(ManagedSelector.java:604)
at app//org.eclipse.jetty.io.ManagedSelector$SelectorProducer.produce(ManagedSelector.java:541)
at app//org.eclipse.jetty.util.thread.strategy.AdaptiveExecutionStrategy.produceTask(AdaptiveExecutionStrategy.java:450)
at app//org.eclipse.jetty.util.thread.strategy.AdaptiveExecutionStrategy.tryProduce(AdaptiveExecutionStrategy.java:243)
at app//org.eclipse.jetty.util.thread.strategy.AdaptiveExecutionStrategy.produce(AdaptiveExecutionStrategy.java:194)
at app//org.eclipse.jetty.io.ManagedSelector$$Lambda$340/0x00000001005a8440.run(Unknown Source)
at app//org.apache.solr.common.util.ExecutorUtil$MDCAwareThreadPoolExecutor.lambda$execute$0(ExecutorUtil.java:289)
at app//org.apache.solr.common.util.ExecutorUtil$MDCAwareThreadPoolExecutor$$Lambda$341/0x00000001005a8c40.run(Unknown Source)
at java.base@11.0.16.1/java.util.concurrent.ThreadPoolExecutor.runWorker(ThreadPoolExecutor.java:1128)
at java.base@11.0.16.1/java.util.concurrent.ThreadPoolExecutor$Worker.run(ThreadPoolExecutor.java:628)
at java.base@11.0.16.1/java.lang.Thread.run(Thread.java:829)
74) Thread[id=1071, name=qtp1914490192-1071, state=TIMED_WAITING, group=TGRP-BasicDistributedZk2Test]
at java.base@11.0.16.1/jdk.internal.misc.Unsafe.park(Native Method)
at java.
[...truncated too long message...]
eCacheSize=120m" -Ptests.seed=4215AD43910254A7 -Ptests.multiplier=2 -Ptests.badapples=false -Ptests.file.encoding=UTF-8
- org.apache.solr.cloud.overseer.ZkStateReaderTest.testNodeVersion (:solr:core)
Test output: /home/jenkins/jenkins-home/712657a4/workspace/Solr/Solr-Check-main-s390x/solr/core/build/test-results/test/outputs/OUTPUT-org.apache.solr.cloud.overseer.ZkStateReaderTest.txt
Reproduce with: gradlew :solr:core:test --tests "org.apache.solr.cloud.overseer.ZkStateReaderTest.testNodeVersion" -Ptests.jvms=4 -Ptests.haltonfailure=false "-Ptests.jvmargs=-XX:TieredStopAtLevel=1 -XX:+UseParallelGC -XX:ActiveProcessorCount=1 -XX:ReservedCodeCacheSize=120m" -Ptests.seed=4215AD43910254A7 -Ptests.multiplier=2 -Ptests.badapples=false -Ptests.file.encoding=UTF-8
- org.apache.solr.search.TestCoordinatorRole.testConcurrentAccess (:solr:core)
Test output: /home/jenkins/jenkins-home/712657a4/workspace/Solr/Solr-Check-main-s390x/solr/core/build/test-results/test/outputs/OUTPUT-org.apache.solr.search.TestCoordinatorRole.txt
Reproduce with: gradlew :solr:core:test --tests "org.apache.solr.search.TestCoordinatorRole.testConcurrentAccess" -Ptests.jvms=4 -Ptests.haltonfailure=false "-Ptests.jvmargs=-XX:TieredStopAtLevel=1 -XX:+UseParallelGC -XX:ActiveProcessorCount=1 -XX:ReservedCodeCacheSize=120m" -Ptests.seed=4215AD43910254A7 -Ptests.multiplier=2 -Ptests.badapples=false -Ptests.file.encoding=UTF-8
- org.apache.solr.search.TestCoordinatorRole.testNRTRestart (:solr:core)
Test output: /home/jenkins/jenkins-home/712657a4/workspace/Solr/Solr-Check-main-s390x/solr/core/build/test-results/test/outputs/OUTPUT-org.apache.solr.search.TestCoordinatorRole.txt
Reproduce with: gradlew :solr:core:test --tests "org.apache.solr.search.TestCoordinatorRole.testNRTRestart" -Ptests.jvms=4 -Ptests.haltonfailure=false "-Ptests.jvmargs=-XX:TieredStopAtLevel=1 -XX:+UseParallelGC -XX:ActiveProcessorCount=1 -XX:ReservedCodeCacheSize=120m" -Ptests.seed=4215AD43910254A7 -Ptests.multiplier=2 -Ptests.badapples=false -Ptests.file.encoding=UTF-8
- org.apache.solr.search.TestCoordinatorRole.classMethod (:solr:core)
Test output: /home/jenkins/jenkins-home/712657a4/workspace/Solr/Solr-Check-main-s390x/solr/core/build/test-results/test/outputs/OUTPUT-org.apache.solr.search.TestCoordinatorRole.txt
Reproduce with: gradlew :solr:core:test --tests "org.apache.solr.search.TestCoordinatorRole.classMethod" -Ptests.jvms=4 -Ptests.haltonfailure=false "-Ptests.jvmargs=-XX:TieredStopAtLevel=1 -XX:+UseParallelGC -XX:ActiveProcessorCount=1 -XX:ReservedCodeCacheSize=120m" -Ptests.seed=4215AD43910254A7 -Ptests.multiplier=2 -Ptests.badapples=false -Ptests.file.encoding=UTF-8
- org.apache.solr.search.TestCoordinatorRole.classMethod (:solr:core)
Test output: /home/jenkins/jenkins-home/712657a4/workspace/Solr/Solr-Check-main-s390x/solr/core/build/test-results/test/outputs/OUTPUT-org.apache.solr.search.TestCoordinatorRole.txt
Reproduce with: gradlew :solr:core:test --tests "org.apache.solr.search.TestCoordinatorRole.classMethod" -Ptests.jvms=4 -Ptests.haltonfailure=false "-Ptests.jvmargs=-XX:TieredStopAtLevel=1 -XX:+UseParallelGC -XX:ActiveProcessorCount=1 -XX:ReservedCodeCacheSize=120m" -Ptests.seed=4215AD43910254A7 -Ptests.multiplier=2 -Ptests.badapples=false -Ptests.file.encoding=UTF-8
Deprecated Gradle features were used in this build, making it incompatible with Gradle 8.0.
You can use '--warning-mode all' to show the individual deprecation warnings and determine if they come from your own scripts or plugins.
See https://docs.gradle.org/7.6/userguide/command_line_interface.html#sec:command_line_warnings
BUILD SUCCESSFUL in 7h 36m 31s
584 actionable tasks: 584 executed
Publishing build scan...
https://ge.apache.org/s/6qvk3ihic7o56
Build step 'Invoke Gradle script' changed build result to SUCCESS
Archiving artifacts
hudson.FilePath$ValidateAntFileMask$1Cancel
at hudson.FilePath$ValidateAntFileMask$1.isCaseSensitive(FilePath.java:3300)
at org.apache.tools.ant.DirectoryScanner.lambda$isIncluded$3(DirectoryScanner.java:1374)
at java.base/java.util.stream.MatchOps$1MatchSink.accept(MatchOps.java:90)
at java.base/java.util.Spliterators$ArraySpliterator.tryAdvance(Spliterators.java:958)
at java.base/java.util.stream.ReferencePipeline.forEachWithCancel(ReferencePipeline.java:127)
at java.base/java.util.stream.AbstractPipeline.copyIntoWithCancel(AbstractPipeline.java:502)
at java.base/java.util.stream.AbstractPipeline.copyInto(AbstractPipeline.java:488)
at java.base/java.util.stream.AbstractPipeline.wrapAndCopyInto(AbstractPipeline.java:474)
at java.base/java.util.stream.MatchOps$MatchOp.evaluateSequential(MatchOps.java:230)
at java.base/java.util.stream.MatchOps$MatchOp.evaluateSequential(MatchOps.java:196)
at java.base/java.util.stream.AbstractPipeline.evaluate(AbstractPipeline.java:234)
at java.base/java.util.stream.ReferencePipeline.anyMatch(ReferencePipeline.java:528)
at org.apache.tools.ant.DirectoryScanner.isIncluded(DirectoryScanner.java:1374)
at org.apache.tools.ant.DirectoryScanner.scandir(DirectoryScanner.java:1241)
at org.apache.tools.ant.DirectoryScanner.scandir(DirectoryScanner.java:1267)
at org.apache.tools.ant.DirectoryScanner.scandir(DirectoryScanner.java:1267)
at org.apache.tools.ant.DirectoryScanner.scandir(DirectoryScanner.java:1267)
at org.apache.tools.ant.DirectoryScanner.scandir(DirectoryScanner.java:1267)
at org.apache.tools.ant.DirectoryScanner.scandir(DirectoryScanner.java:1267)
at org.apache.tools.ant.DirectoryScanner.scandir(DirectoryScanner.java:1267)
at org.apache.tools.ant.DirectoryScanner.scandir(DirectoryScanner.java:1267)
at org.apache.tools.ant.DirectoryScanner.scandir(DirectoryScanner.java:1267)
at org.apache.tools.ant.DirectoryScanner.scandir(DirectoryScanner.java:1267)
at org.apache.tools.ant.DirectoryScanner.scandir(DirectoryScanner.java:1267)
at org.apache.tools.ant.DirectoryScanner.scandir(DirectoryScanner.java:1194)
at org.apache.tools.ant.DirectoryScanner.scandir(DirectoryScanner.java:1156)
at org.apache.tools.ant.DirectoryScanner.checkIncludePatterns(DirectoryScanner.java:954)
at org.apache.tools.ant.DirectoryScanner.scan(DirectoryScanner.java:912)
at hudson.FilePath$ValidateAntFileMask.hasMatch(FilePath.java:3313)
Caused: hudson.FilePath$FileMaskNoMatchesFoundException: no matches found within 10000
at hudson.FilePath$ValidateAntFileMask.hasMatch(FilePath.java:3318)
at hudson.FilePath$ValidateAntFileMask.invoke(FilePath.java:3196)
at hudson.FilePath$ValidateAntFileMask.invoke(FilePath.java:3174)
at hudson.FilePath$FileCallableWrapper.call(FilePath.java:3578)
Also: hudson.remoting.Channel$CallSiteStackTrace: Remote call to jenkins-s390x-1
at hudson.remoting.Channel.attachCallSiteStackTrace(Channel.java:1784)
at hudson.remoting.UserRequest$ExceptionResponse.retrieve(UserRequest.java:356)
at hudson.remoting.Channel.call(Channel.java:1000)
at hudson.FilePath.act(FilePath.java:1192)
at hudson.FilePath.act(FilePath.java:1181)
at hudson.FilePath.validateAntFileMask(FilePath.java:3171)
at hudson.tasks.ArtifactArchiver.perform(ArtifactArchiver.java:271)
at hudson.tasks.BuildStepCompatibilityLayer.perform(BuildStepCompatibilityLayer.java:80)
at hudson.tasks.BuildStepMonitor$1.perform(BuildStepMonitor.java:20)
at hudson.model.AbstractBuild$AbstractBuildExecution.perform(AbstractBuild.java:818)
at hudson.model.AbstractBuild$AbstractBuildExecution.performAllBuildSteps(AbstractBuild.java:767)
at hudson.model.Build$BuildExecution.post2(Build.java:179)
at hudson.model.AbstractBuild$AbstractBuildExecution.post(AbstractBuild.java:711)
at hudson.model.Run.execute(Run.java:1925)
at hudson.model.FreeStyleBuild.run(FreeStyleBuild.java:44)
at hudson.model.ResourceController.execute(ResourceController.java:101)
at hudson.model.Executor.run(Executor.java:442)
Caused: hudson.FilePath$TunneledInterruptedException
at hudson.FilePath$FileCallableWrapper.call(FilePath.java:3580)
at hudson.remoting.UserRequest.perform(UserRequest.java:211)
at hudson.remoting.UserRequest.perform(UserRequest.java:54)
at hudson.remoting.Request$2.run(Request.java:377)
at hudson.remoting.InterceptingExecutorService.lambda$wrap$0(InterceptingExecutorService.java:78)
at java.base/java.util.concurrent.FutureTask.run(FutureTask.java:264)
at java.base/java.util.concurrent.ThreadPoolExecutor.runWorker(ThreadPoolExecutor.java:1128)
at java.base/java.util.concurrent.ThreadPoolExecutor$Worker.run(ThreadPoolExecutor.java:628)
at java.base/java.lang.Thread.run(Thread.java:829)
Caused: java.lang.InterruptedException: hudson.FilePath$FileMaskNoMatchesFoundException: no matches found within 10000
at hudson.FilePath.act(FilePath.java:1194)
at hudson.FilePath.act(FilePath.java:1181)
at hudson.FilePath.validateAntFileMask(FilePath.java:3171)
at hudson.tasks.ArtifactArchiver.perform(ArtifactArchiver.java:271)
at hudson.tasks.BuildStepCompatibilityLayer.perform(BuildStepCompatibilityLayer.java:80)
at hudson.tasks.BuildStepMonitor$1.perform(BuildStepMonitor.java:20)
at hudson.model.AbstractBuild$AbstractBuildExecution.perform(AbstractBuild.java:818)
at hudson.model.AbstractBuild$AbstractBuildExecution.performAllBuildSteps(AbstractBuild.java:767)
at hudson.model.Build$BuildExecution.post2(Build.java:179)
at hudson.model.AbstractBuild$AbstractBuildExecution.post(AbstractBuild.java:711)
at hudson.model.Run.execute(Run.java:1925)
at hudson.model.FreeStyleBuild.run(FreeStyleBuild.java:44)
at hudson.model.ResourceController.execute(ResourceController.java:101)
at hudson.model.Executor.run(Executor.java:442)
No artifacts found that match the file pattern "**/*.events,heapdumps/**,**/hs_err_pid*". Configuration error?
Recording test results
[Checks API] No suitable checks publisher found.
Build step 'Publish JUnit test result report' changed build result to UNSTABLE
Email was triggered for: Unstable (Test Failures)
Sending email for trigger: Unstable (Test Failures)
[JENKINS] Solr » Solr-Check-main-s390x - Build # 338 - Still unstable!
Posted by Apache Jenkins Server <je...@builds.apache.org>.
Build: https://ci-builds.apache.org/job/Solr/job/Solr-Check-main-s390x/338/
3 tests failed.
FAILED: org.apache.solr.cloud.HttpPartitionOnCommitTest.test
Error Message:
org.apache.solr.client.solrj.impl.BaseHttpSolrClient$RemoteSolrException: Error from server at http://127.0.0.1:41937/solr: Underlying core creation failed while creating collection: c8n_1x3_commits
Stack Trace:
org.apache.solr.client.solrj.impl.BaseHttpSolrClient$RemoteSolrException: Error from server at http://127.0.0.1:41937/solr: Underlying core creation failed while creating collection: c8n_1x3_commits
at __randomizedtesting.SeedInfo.seed([4CACA1131DA9A93D:C4F89EC9B355C4C5]:0)
at app//org.apache.solr.client.solrj.impl.HttpSolrClient.executeMethod(HttpSolrClient.java:738)
at app//org.apache.solr.client.solrj.impl.HttpSolrClient.request(HttpSolrClient.java:254)
at app//org.apache.solr.client.solrj.impl.HttpSolrClient.request(HttpSolrClient.java:235)
at app//org.apache.solr.client.solrj.SolrClient.request(SolrClient.java:1192)
at app//org.apache.solr.cloud.AbstractBasicDistributedZkTestBase.createCollection(AbstractBasicDistributedZkTestBase.java:1172)
at app//org.apache.solr.cloud.AbstractFullDistribZkTestBase.createCollection(AbstractFullDistribZkTestBase.java:2023)
at app//org.apache.solr.cloud.HttpPartitionOnCommitTest.oneShardTest(HttpPartitionOnCommitTest.java:130)
at app//org.apache.solr.cloud.HttpPartitionOnCommitTest.test(HttpPartitionOnCommitTest.java:66)
at java.base@11.0.16.1/jdk.internal.reflect.NativeMethodAccessorImpl.invoke0(Native Method)
at java.base@11.0.16.1/jdk.internal.reflect.NativeMethodAccessorImpl.invoke(NativeMethodAccessorImpl.java:62)
at java.base@11.0.16.1/jdk.internal.reflect.DelegatingMethodAccessorImpl.invoke(DelegatingMethodAccessorImpl.java:43)
at java.base@11.0.16.1/java.lang.reflect.Method.invoke(Method.java:566)
at app//com.carrotsearch.randomizedtesting.RandomizedRunner.invoke(RandomizedRunner.java:1758)
at app//com.carrotsearch.randomizedtesting.RandomizedRunner$8.evaluate(RandomizedRunner.java:946)
at app//com.carrotsearch.randomizedtesting.RandomizedRunner$9.evaluate(RandomizedRunner.java:982)
at app//com.carrotsearch.randomizedtesting.RandomizedRunner$10.evaluate(RandomizedRunner.java:996)
at app//org.apache.solr.BaseDistributedSearchTestCase$ShardsRepeatRule$ShardsFixedStatement.callStatement(BaseDistributedSearchTestCase.java:1079)
at app//org.apache.solr.BaseDistributedSearchTestCase$ShardsRepeatRule$ShardsStatement.evaluate(BaseDistributedSearchTestCase.java:1050)
at app//com.carrotsearch.randomizedtesting.rules.SystemPropertiesRestoreRule$1.evaluate(SystemPropertiesRestoreRule.java:80)
at app//org.junit.rules.RunRules.evaluate(RunRules.java:20)
at app//org.apache.lucene.tests.util.TestRuleSetupTeardownChained$1.evaluate(TestRuleSetupTeardownChained.java:48)
at app//org.apache.lucene.tests.util.AbstractBeforeAfterRule$1.evaluate(AbstractBeforeAfterRule.java:43)
at app//org.apache.lucene.tests.util.TestRuleThreadAndTestName$1.evaluate(TestRuleThreadAndTestName.java:45)
at app//org.apache.lucene.tests.util.TestRuleIgnoreAfterMaxFailures$1.evaluate(TestRuleIgnoreAfterMaxFailures.java:60)
at app//org.apache.lucene.tests.util.TestRuleMarkFailure$1.evaluate(TestRuleMarkFailure.java:44)
at app//org.junit.rules.RunRules.evaluate(RunRules.java:20)
at app//com.carrotsearch.randomizedtesting.rules.StatementAdapter.evaluate(StatementAdapter.java:36)
at app//com.carrotsearch.randomizedtesting.ThreadLeakControl$StatementRunner.run(ThreadLeakControl.java:390)
at app//com.carrotsearch.randomizedtesting.ThreadLeakControl.forkTimeoutingTask(ThreadLeakControl.java:843)
at app//com.carrotsearch.randomizedtesting.ThreadLeakControl$3.evaluate(ThreadLeakControl.java:490)
at app//com.carrotsearch.randomizedtesting.RandomizedRunner.runSingleTest(RandomizedRunner.java:955)
at app//com.carrotsearch.randomizedtesting.RandomizedRunner$5.evaluate(RandomizedRunner.java:840)
at app//com.carrotsearch.randomizedtesting.RandomizedRunner$6.evaluate(RandomizedRunner.java:891)
at app//com.carrotsearch.randomizedtesting.RandomizedRunner$7.evaluate(RandomizedRunner.java:902)
at app//com.carrotsearch.randomizedtesting.rules.StatementAdapter.evaluate(StatementAdapter.java:36)
at app//com.carrotsearch.randomizedtesting.rules.StatementAdapter.evaluate(StatementAdapter.java:36)
at app//org.apache.lucene.tests.util.AbstractBeforeAfterRule$1.evaluate(AbstractBeforeAfterRule.java:43)
at app//com.carrotsearch.randomizedtesting.rules.SystemPropertiesRestoreRule$1.evaluate(SystemPropertiesRestoreRule.java:80)
at app//org.junit.rules.RunRules.evaluate(RunRules.java:20)
at app//org.apache.lucene.tests.util.AbstractBeforeAfterRule$1.evaluate(AbstractBeforeAfterRule.java:43)
at app//com.carrotsearch.randomizedtesting.rules.StatementAdapter.evaluate(StatementAdapter.java:36)
at app//org.apache.lucene.tests.util.TestRuleStoreClassName$1.evaluate(TestRuleStoreClassName.java:38)
at app//com.carrotsearch.randomizedtesting.rules.NoShadowingOrOverridesOnMethodsRule$1.evaluate(NoShadowingOrOverridesOnMethodsRule.java:40)
at app//com.carrotsearch.randomizedtesting.rules.NoShadowingOrOverridesOnMethodsRule$1.evaluate(NoShadowingOrOverridesOnMethodsRule.java:40)
at app//com.carrotsearch.randomizedtesting.rules.StatementAdapter.evaluate(StatementAdapter.java:36)
at app//com.carrotsearch.randomizedtesting.rules.StatementAdapter.evaluate(StatementAdapter.java:36)
at app//org.apache.lucene.tests.util.TestRuleAssertionsRequired$1.evaluate(TestRuleAssertionsRequired.java:53)
at app//org.apache.lucene.tests.util.AbstractBeforeAfterRule$1.evaluate(AbstractBeforeAfterRule.java:43)
at app//org.apache.lucene.tests.util.TestRuleMarkFailure$1.evaluate(TestRuleMarkFailure.java:44)
at app//org.apache.lucene.tests.util.TestRuleIgnoreAfterMaxFailures$1.evaluate(TestRuleIgnoreAfterMaxFailures.java:60)
at app//org.apache.lucene.tests.util.TestRuleIgnoreTestSuites$1.evaluate(TestRuleIgnoreTestSuites.java:47)
at app//org.junit.rules.RunRules.evaluate(RunRules.java:20)
at app//com.carrotsearch.randomizedtesting.rules.StatementAdapter.evaluate(StatementAdapter.java:36)
at app//com.carrotsearch.randomizedtesting.ThreadLeakControl$StatementRunner.run(ThreadLeakControl.java:390)
at app//com.carrotsearch.randomizedtesting.ThreadLeakControl.lambda$forkTimeoutingTask$0(ThreadLeakControl.java:850)
at java.base@11.0.16.1/java.lang.Thread.run(Thread.java:829)
FAILED: org.apache.solr.cloud.TestPullReplicaErrorHandling.testCloseHooksDeletedOnReconnect
Error Message:
java.lang.AssertionError: expected:<5> but was:<3>
Stack Trace:
java.lang.AssertionError: expected:<5> but was:<3>
at __randomizedtesting.SeedInfo.seed([4CACA1131DA9A93D:3D6B25705BAA2789]:0)
at org.junit.Assert.fail(Assert.java:89)
at org.junit.Assert.failNotEquals(Assert.java:835)
at org.junit.Assert.assertEquals(Assert.java:647)
at org.junit.Assert.assertEquals(Assert.java:633)
at org.apache.solr.cloud.TestPullReplicaErrorHandling.testCloseHooksDeletedOnReconnect(TestPullReplicaErrorHandling.java:263)
at java.base/jdk.internal.reflect.NativeMethodAccessorImpl.invoke0(Native Method)
at java.base/jdk.internal.reflect.NativeMethodAccessorImpl.invoke(NativeMethodAccessorImpl.java:62)
at java.base/jdk.internal.reflect.DelegatingMethodAccessorImpl.invoke(DelegatingMethodAccessorImpl.java:43)
at java.base/java.lang.reflect.Method.invoke(Method.java:566)
at com.carrotsearch.randomizedtesting.RandomizedRunner.invoke(RandomizedRunner.java:1758)
at com.carrotsearch.randomizedtesting.RandomizedRunner$8.evaluate(RandomizedRunner.java:946)
at com.carrotsearch.randomizedtesting.RandomizedRunner$9.evaluate(RandomizedRunner.java:982)
at com.carrotsearch.randomizedtesting.RandomizedRunner$10.evaluate(RandomizedRunner.java:996)
at com.carrotsearch.randomizedtesting.rules.SystemPropertiesRestoreRule$1.evaluate(SystemPropertiesRestoreRule.java:80)
at org.junit.rules.RunRules.evaluate(RunRules.java:20)
at org.apache.lucene.tests.util.TestRuleSetupTeardownChained$1.evaluate(TestRuleSetupTeardownChained.java:48)
at org.apache.lucene.tests.util.AbstractBeforeAfterRule$1.evaluate(AbstractBeforeAfterRule.java:43)
at org.apache.lucene.tests.util.TestRuleThreadAndTestName$1.evaluate(TestRuleThreadAndTestName.java:45)
at org.apache.lucene.tests.util.TestRuleIgnoreAfterMaxFailures$1.evaluate(TestRuleIgnoreAfterMaxFailures.java:60)
at org.apache.lucene.tests.util.TestRuleMarkFailure$1.evaluate(TestRuleMarkFailure.java:44)
at org.junit.rules.RunRules.evaluate(RunRules.java:20)
at com.carrotsearch.randomizedtesting.rules.StatementAdapter.evaluate(StatementAdapter.java:36)
at com.carrotsearch.randomizedtesting.ThreadLeakControl$StatementRunner.run(ThreadLeakControl.java:390)
at com.carrotsearch.randomizedtesting.ThreadLeakControl.forkTimeoutingTask(ThreadLeakControl.java:843)
at com.carrotsearch.randomizedtesting.ThreadLeakControl$3.evaluate(ThreadLeakControl.java:490)
at com.carrotsearch.randomizedtesting.RandomizedRunner.runSingleTest(RandomizedRunner.java:955)
at com.carrotsearch.randomizedtesting.RandomizedRunner$5.evaluate(RandomizedRunner.java:840)
at com.carrotsearch.randomizedtesting.RandomizedRunner$6.evaluate(RandomizedRunner.java:891)
at com.carrotsearch.randomizedtesting.RandomizedRunner$7.evaluate(RandomizedRunner.java:902)
at com.carrotsearch.randomizedtesting.rules.StatementAdapter.evaluate(StatementAdapter.java:36)
at com.carrotsearch.randomizedtesting.rules.StatementAdapter.evaluate(StatementAdapter.java:36)
at org.apache.lucene.tests.util.AbstractBeforeAfterRule$1.evaluate(AbstractBeforeAfterRule.java:43)
at com.carrotsearch.randomizedtesting.rules.SystemPropertiesRestoreRule$1.evaluate(SystemPropertiesRestoreRule.java:80)
at org.junit.rules.RunRules.evaluate(RunRules.java:20)
at org.apache.lucene.tests.util.AbstractBeforeAfterRule$1.evaluate(AbstractBeforeAfterRule.java:43)
at com.carrotsearch.randomizedtesting.rules.StatementAdapter.evaluate(StatementAdapter.java:36)
at org.apache.lucene.tests.util.TestRuleStoreClassName$1.evaluate(TestRuleStoreClassName.java:38)
at com.carrotsearch.randomizedtesting.rules.NoShadowingOrOverridesOnMethodsRule$1.evaluate(NoShadowingOrOverridesOnMethodsRule.java:40)
at com.carrotsearch.randomizedtesting.rules.NoShadowingOrOverridesOnMethodsRule$1.evaluate(NoShadowingOrOverridesOnMethodsRule.java:40)
at com.carrotsearch.randomizedtesting.rules.StatementAdapter.evaluate(StatementAdapter.java:36)
at com.carrotsearch.randomizedtesting.rules.StatementAdapter.evaluate(StatementAdapter.java:36)
at org.apache.lucene.tests.util.TestRuleAssertionsRequired$1.evaluate(TestRuleAssertionsRequired.java:53)
at org.apache.lucene.tests.util.AbstractBeforeAfterRule$1.evaluate(AbstractBeforeAfterRule.java:43)
at org.apache.lucene.tests.util.TestRuleMarkFailure$1.evaluate(TestRuleMarkFailure.java:44)
at org.apache.lucene.tests.util.TestRuleIgnoreAfterMaxFailures$1.evaluate(TestRuleIgnoreAfterMaxFailures.java:60)
at org.apache.lucene.tests.util.TestRuleIgnoreTestSuites$1.evaluate(TestRuleIgnoreTestSuites.java:47)
at org.junit.rules.RunRules.evaluate(RunRules.java:20)
at com.carrotsearch.randomizedtesting.rules.StatementAdapter.evaluate(StatementAdapter.java:36)
at com.carrotsearch.randomizedtesting.ThreadLeakControl$StatementRunner.run(ThreadLeakControl.java:390)
at com.carrotsearch.randomizedtesting.ThreadLeakControl.lambda$forkTimeoutingTask$0(ThreadLeakControl.java:850)
at java.base/java.lang.Thread.run(Thread.java:829)
FAILED: org.apache.solr.cluster.placement.impl.PlacementPluginIntegrationTest.testDynamicReconfiguration
Error Message:
java.lang.AssertionError
Stack Trace:
java.lang.AssertionError
at __randomizedtesting.SeedInfo.seed([4CACA1131DA9A93D:B6C9E6B453043B06]:0)
at org.junit.Assert.fail(Assert.java:87)
at org.junit.Assert.assertTrue(Assert.java:42)
at org.junit.Assert.assertNotNull(Assert.java:713)
at org.junit.Assert.assertNotNull(Assert.java:723)
at org.apache.solr.cluster.placement.impl.PlacementPluginIntegrationTest.testDynamicReconfiguration(PlacementPluginIntegrationTest.java:169)
at java.base/jdk.internal.reflect.NativeMethodAccessorImpl.invoke0(Native Method)
at java.base/jdk.internal.reflect.NativeMethodAccessorImpl.invoke(NativeMethodAccessorImpl.java:62)
at java.base/jdk.internal.reflect.DelegatingMethodAccessorImpl.invoke(DelegatingMethodAccessorImpl.java:43)
at java.base/java.lang.reflect.Method.invoke(Method.java:566)
at com.carrotsearch.randomizedtesting.RandomizedRunner.invoke(RandomizedRunner.java:1758)
at com.carrotsearch.randomizedtesting.RandomizedRunner$8.evaluate(RandomizedRunner.java:946)
at com.carrotsearch.randomizedtesting.RandomizedRunner$9.evaluate(RandomizedRunner.java:982)
at com.carrotsearch.randomizedtesting.RandomizedRunner$10.evaluate(RandomizedRunner.java:996)
at com.carrotsearch.randomizedtesting.rules.SystemPropertiesRestoreRule$1.evaluate(SystemPropertiesRestoreRule.java:80)
at org.junit.rules.RunRules.evaluate(RunRules.java:20)
at org.apache.lucene.tests.util.TestRuleSetupTeardownChained$1.evaluate(TestRuleSetupTeardownChained.java:48)
at org.apache.lucene.tests.util.AbstractBeforeAfterRule$1.evaluate(AbstractBeforeAfterRule.java:43)
at org.apache.lucene.tests.util.TestRuleThreadAndTestName$1.evaluate(TestRuleThreadAndTestName.java:45)
at org.apache.lucene.tests.util.TestRuleIgnoreAfterMaxFailures$1.evaluate(TestRuleIgnoreAfterMaxFailures.java:60)
at org.apache.lucene.tests.util.TestRuleMarkFailure$1.evaluate(TestRuleMarkFailure.java:44)
at org.junit.rules.RunRules.evaluate(RunRules.java:20)
at com.carrotsearch.randomizedtesting.rules.StatementAdapter.evaluate(StatementAdapter.java:36)
at com.carrotsearch.randomizedtesting.ThreadLeakControl$StatementRunner.run(ThreadLeakControl.java:390)
at com.carrotsearch.randomizedtesting.ThreadLeakControl.forkTimeoutingTask(ThreadLeakControl.java:843)
at com.carrotsearch.randomizedtesting.ThreadLeakControl$3.evaluate(ThreadLeakControl.java:490)
at com.carrotsearch.randomizedtesting.RandomizedRunner.runSingleTest(RandomizedRunner.java:955)
at com.carrotsearch.randomizedtesting.RandomizedRunner$5.evaluate(RandomizedRunner.java:840)
at com.carrotsearch.randomizedtesting.RandomizedRunner$6.evaluate(RandomizedRunner.java:891)
at com.carrotsearch.randomizedtesting.RandomizedRunner$7.evaluate(RandomizedRunner.java:902)
at com.carrotsearch.randomizedtesting.rules.StatementAdapter.evaluate(StatementAdapter.java:36)
at com.carrotsearch.randomizedtesting.rules.StatementAdapter.evaluate(StatementAdapter.java:36)
at org.apache.lucene.tests.util.AbstractBeforeAfterRule$1.evaluate(AbstractBeforeAfterRule.java:43)
at com.carrotsearch.randomizedtesting.rules.SystemPropertiesRestoreRule$1.evaluate(SystemPropertiesRestoreRule.java:80)
at org.junit.rules.RunRules.evaluate(RunRules.java:20)
at org.apache.lucene.tests.util.AbstractBeforeAfterRule$1.evaluate(AbstractBeforeAfterRule.java:43)
at com.carrotsearch.randomizedtesting.rules.StatementAdapter.evaluate(StatementAdapter.java:36)
at org.apache.lucene.tests.util.TestRuleStoreClassName$1.evaluate(TestRuleStoreClassName.java:38)
at com.carrotsearch.randomizedtesting.rules.NoShadowingOrOverridesOnMethodsRule$1.evaluate(NoShadowingOrOverridesOnMethodsRule.java:40)
at com.carrotsearch.randomizedtesting.rules.NoShadowingOrOverridesOnMethodsRule$1.evaluate(NoShadowingOrOverridesOnMethodsRule.java:40)
at com.carrotsearch.randomizedtesting.rules.StatementAdapter.evaluate(StatementAdapter.java:36)
at com.carrotsearch.randomizedtesting.rules.StatementAdapter.evaluate(StatementAdapter.java:36)
at org.apache.lucene.tests.util.TestRuleAssertionsRequired$1.evaluate(TestRuleAssertionsRequired.java:53)
at org.apache.lucene.tests.util.AbstractBeforeAfterRule$1.evaluate(AbstractBeforeAfterRule.java:43)
at org.apache.lucene.tests.util.TestRuleMarkFailure$1.evaluate(TestRuleMarkFailure.java:44)
at org.apache.lucene.tests.util.TestRuleIgnoreAfterMaxFailures$1.evaluate(TestRuleIgnoreAfterMaxFailures.java:60)
at org.apache.lucene.tests.util.TestRuleIgnoreTestSuites$1.evaluate(TestRuleIgnoreTestSuites.java:47)
at org.junit.rules.RunRules.evaluate(RunRules.java:20)
at com.carrotsearch.randomizedtesting.rules.StatementAdapter.evaluate(StatementAdapter.java:36)
at com.carrotsearch.randomizedtesting.ThreadLeakControl$StatementRunner.run(ThreadLeakControl.java:390)
at com.carrotsearch.randomizedtesting.ThreadLeakControl.lambda$forkTimeoutingTask$0(ThreadLeakControl.java:850)
at java.base/java.lang.Thread.run(Thread.java:829)
Build Log:
[...truncated 6679 lines...]
ERROR: The following test(s) have failed:
- org.apache.solr.cloud.HttpPartitionOnCommitTest.test (:solr:core)
Test output: /home/jenkins/jenkins-home/712657a4/workspace/Solr/Solr-Check-main-s390x/solr/core/build/test-results/test/outputs/OUTPUT-org.apache.solr.cloud.HttpPartitionOnCommitTest.txt
Reproduce with: gradlew :solr:core:test --tests "org.apache.solr.cloud.HttpPartitionOnCommitTest.test" -Ptests.jvms=4 -Ptests.haltonfailure=false "-Ptests.jvmargs=-XX:TieredStopAtLevel=1 -XX:+UseParallelGC -XX:ActiveProcessorCount=1 -XX:ReservedCodeCacheSize=120m" -Ptests.seed=4CACA1131DA9A93D -Ptests.multiplier=2 -Ptests.badapples=false -Ptests.file.encoding=US-ASCII
- org.apache.solr.cloud.TestPullReplicaErrorHandling.testCloseHooksDeletedOnReconnect (:solr:core)
Test output: /home/jenkins/jenkins-home/712657a4/workspace/Solr/Solr-Check-main-s390x/solr/core/build/test-results/test/outputs/OUTPUT-org.apache.solr.cloud.TestPullReplicaErrorHandling.txt
Reproduce with: gradlew :solr:core:test --tests "org.apache.solr.cloud.TestPullReplicaErrorHandling.testCloseHooksDeletedOnReconnect" -Ptests.jvms=4 -Ptests.haltonfailure=false "-Ptests.jvmargs=-XX:TieredStopAtLevel=1 -XX:+UseParallelGC -XX:ActiveProcessorCount=1 -XX:ReservedCodeCacheSize=120m" -Ptests.seed=4CACA1131DA9A93D -Ptests.multiplier=2 -Ptests.badapples=false -Ptests.file.encoding=US-ASCII
- org.apache.solr.cluster.placement.impl.PlacementPluginIntegrationTest.testDynamicReconfiguration (:solr:core)
Test output: /home/jenkins/jenkins-home/712657a4/workspace/Solr/Solr-Check-main-s390x/solr/core/build/test-results/test/outputs/OUTPUT-org.apache.solr.cluster.placement.impl.PlacementPluginIntegrationTest.txt
Reproduce with: gradlew :solr:core:test --tests "org.apache.solr.cluster.placement.impl.PlacementPluginIntegrationTest.testDynamicReconfiguration" -Ptests.jvms=4 -Ptests.haltonfailure=false "-Ptests.jvmargs=-XX:TieredStopAtLevel=1 -XX:+UseParallelGC -XX:ActiveProcessorCount=1 -XX:ReservedCodeCacheSize=120m" -Ptests.seed=4CACA1131DA9A93D -Ptests.multiplier=2 -Ptests.badapples=false -Ptests.file.encoding=US-ASCII
Deprecated Gradle features were used in this build, making it incompatible with Gradle 8.0.
You can use '--warning-mode all' to show the individual deprecation warnings and determine if they come from your own scripts or plugins.
See https://docs.gradle.org/7.6/userguide/command_line_interface.html#sec:command_line_warnings
BUILD SUCCESSFUL in 1h 58m 16s
584 actionable tasks: 584 executed
Publishing build scan...
https://ge.apache.org/s/hkakplnalstsa
Build step 'Invoke Gradle script' changed build result to SUCCESS
Archiving artifacts
hudson.FilePath$ValidateAntFileMask$1Cancel
at hudson.FilePath$ValidateAntFileMask$1.isCaseSensitive(FilePath.java:3300)
at org.apache.tools.ant.DirectoryScanner.lambda$isIncluded$3(DirectoryScanner.java:1374)
at java.base/java.util.stream.MatchOps$1MatchSink.accept(MatchOps.java:90)
at java.base/java.util.Spliterators$ArraySpliterator.tryAdvance(Spliterators.java:958)
at java.base/java.util.stream.ReferencePipeline.forEachWithCancel(ReferencePipeline.java:127)
at java.base/java.util.stream.AbstractPipeline.copyIntoWithCancel(AbstractPipeline.java:502)
at java.base/java.util.stream.AbstractPipeline.copyInto(AbstractPipeline.java:488)
at java.base/java.util.stream.AbstractPipeline.wrapAndCopyInto(AbstractPipeline.java:474)
at java.base/java.util.stream.MatchOps$MatchOp.evaluateSequential(MatchOps.java:230)
at java.base/java.util.stream.MatchOps$MatchOp.evaluateSequential(MatchOps.java:196)
at java.base/java.util.stream.AbstractPipeline.evaluate(AbstractPipeline.java:234)
at java.base/java.util.stream.ReferencePipeline.anyMatch(ReferencePipeline.java:528)
at org.apache.tools.ant.DirectoryScanner.isIncluded(DirectoryScanner.java:1374)
at org.apache.tools.ant.DirectoryScanner.scandir(DirectoryScanner.java:1241)
at org.apache.tools.ant.DirectoryScanner.scandir(DirectoryScanner.java:1267)
at org.apache.tools.ant.DirectoryScanner.scandir(DirectoryScanner.java:1267)
at org.apache.tools.ant.DirectoryScanner.scandir(DirectoryScanner.java:1267)
at org.apache.tools.ant.DirectoryScanner.scandir(DirectoryScanner.java:1267)
at org.apache.tools.ant.DirectoryScanner.scandir(DirectoryScanner.java:1267)
at org.apache.tools.ant.DirectoryScanner.scandir(DirectoryScanner.java:1267)
at org.apache.tools.ant.DirectoryScanner.scandir(DirectoryScanner.java:1267)
at org.apache.tools.ant.DirectoryScanner.scandir(DirectoryScanner.java:1267)
at org.apache.tools.ant.DirectoryScanner.scandir(DirectoryScanner.java:1267)
at org.apache.tools.ant.DirectoryScanner.scandir(DirectoryScanner.java:1194)
at org.apache.tools.ant.DirectoryScanner.scandir(DirectoryScanner.java:1156)
at org.apache.tools.ant.DirectoryScanner.checkIncludePatterns(DirectoryScanner.java:954)
at org.apache.tools.ant.DirectoryScanner.scan(DirectoryScanner.java:912)
at hudson.FilePath$ValidateAntFileMask.hasMatch(FilePath.java:3313)
Caused: hudson.FilePath$FileMaskNoMatchesFoundException: no matches found within 10000
at hudson.FilePath$ValidateAntFileMask.hasMatch(FilePath.java:3318)
at hudson.FilePath$ValidateAntFileMask.invoke(FilePath.java:3196)
at hudson.FilePath$ValidateAntFileMask.invoke(FilePath.java:3174)
at hudson.FilePath$FileCallableWrapper.call(FilePath.java:3578)
Also: hudson.remoting.Channel$CallSiteStackTrace: Remote call to jenkins-s390x-3
at hudson.remoting.Channel.attachCallSiteStackTrace(Channel.java:1784)
at hudson.remoting.UserRequest$ExceptionResponse.retrieve(UserRequest.java:356)
at hudson.remoting.Channel.call(Channel.java:1000)
at hudson.FilePath.act(FilePath.java:1192)
at hudson.FilePath.act(FilePath.java:1181)
at hudson.FilePath.validateAntFileMask(FilePath.java:3171)
at hudson.tasks.ArtifactArchiver.perform(ArtifactArchiver.java:271)
at hudson.tasks.BuildStepCompatibilityLayer.perform(BuildStepCompatibilityLayer.java:80)
at hudson.tasks.BuildStepMonitor$1.perform(BuildStepMonitor.java:20)
at hudson.model.AbstractBuild$AbstractBuildExecution.perform(AbstractBuild.java:818)
at hudson.model.AbstractBuild$AbstractBuildExecution.performAllBuildSteps(AbstractBuild.java:767)
at hudson.model.Build$BuildExecution.post2(Build.java:179)
at hudson.model.AbstractBuild$AbstractBuildExecution.post(AbstractBuild.java:711)
at hudson.model.Run.execute(Run.java:1925)
at hudson.model.FreeStyleBuild.run(FreeStyleBuild.java:44)
at hudson.model.ResourceController.execute(ResourceController.java:101)
at hudson.model.Executor.run(Executor.java:442)
Caused: hudson.FilePath$TunneledInterruptedException
at hudson.FilePath$FileCallableWrapper.call(FilePath.java:3580)
at hudson.remoting.UserRequest.perform(UserRequest.java:211)
at hudson.remoting.UserRequest.perform(UserRequest.java:54)
at hudson.remoting.Request$2.run(Request.java:377)
at hudson.remoting.InterceptingExecutorService.lambda$wrap$0(InterceptingExecutorService.java:78)
at java.base/java.util.concurrent.FutureTask.run(FutureTask.java:264)
at java.base/java.util.concurrent.ThreadPoolExecutor.runWorker(ThreadPoolExecutor.java:1128)
at java.base/java.util.concurrent.ThreadPoolExecutor$Worker.run(ThreadPoolExecutor.java:628)
at java.base/java.lang.Thread.run(Thread.java:829)
Caused: java.lang.InterruptedException: hudson.FilePath$FileMaskNoMatchesFoundException: no matches found within 10000
at hudson.FilePath.act(FilePath.java:1194)
at hudson.FilePath.act(FilePath.java:1181)
at hudson.FilePath.validateAntFileMask(FilePath.java:3171)
at hudson.tasks.ArtifactArchiver.perform(ArtifactArchiver.java:271)
at hudson.tasks.BuildStepCompatibilityLayer.perform(BuildStepCompatibilityLayer.java:80)
at hudson.tasks.BuildStepMonitor$1.perform(BuildStepMonitor.java:20)
at hudson.model.AbstractBuild$AbstractBuildExecution.perform(AbstractBuild.java:818)
at hudson.model.AbstractBuild$AbstractBuildExecution.performAllBuildSteps(AbstractBuild.java:767)
at hudson.model.Build$BuildExecution.post2(Build.java:179)
at hudson.model.AbstractBuild$AbstractBuildExecution.post(AbstractBuild.java:711)
at hudson.model.Run.execute(Run.java:1925)
at hudson.model.FreeStyleBuild.run(FreeStyleBuild.java:44)
at hudson.model.ResourceController.execute(ResourceController.java:101)
at hudson.model.Executor.run(Executor.java:442)
No artifacts found that match the file pattern "**/*.events,heapdumps/**,**/hs_err_pid*". Configuration error?
Recording test results
[Checks API] No suitable checks publisher found.
Build step 'Publish JUnit test result report' changed build result to UNSTABLE
Email was triggered for: Unstable (Test Failures)
Sending email for trigger: Unstable (Test Failures)