You are viewing a plain text version of this content. The canonical link for it is here.
Posted to builds@beam.apache.org by Apache Jenkins Server <je...@builds.apache.org> on 2023/11/01 06:04:03 UTC
Build failed in Jenkins: beam_PostCommit_Java_PVR_Spark3_Streaming #3698
See <https://ci-beam.apache.org/job/beam_PostCommit_Java_PVR_Spark3_Streaming/3698/display/redirect>
Changes:
------------------------------------------
Started by timer
Running as SYSTEM
[EnvInject] - Loading node environment variables.
Building remotely on apache-beam-jenkins-5 (beam) in workspace <https://ci-beam.apache.org/job/beam_PostCommit_Java_PVR_Spark3_Streaming/ws/>
The recommended git tool is: NONE
No credentials specified
Wiping out workspace first.
Cloning the remote Git repository
Using shallow clone with depth 1
Avoid fetching tags
Cloning repository https://github.com/apache/beam.git
> git init <https://ci-beam.apache.org/job/beam_PostCommit_Java_PVR_Spark3_Streaming/ws/src> # timeout=10
Fetching upstream changes from https://github.com/apache/beam.git
> git --version # timeout=10
> git --version # 'git version 2.25.1'
> git fetch --no-tags --force --progress --depth=1 -- https://github.com/apache/beam.git +refs/heads/*:refs/remotes/origin/* # timeout=10
> git config remote.origin.url https://github.com/apache/beam.git # timeout=10
> git config --add remote.origin.fetch +refs/heads/*:refs/remotes/origin/* # timeout=10
> git config remote.origin.url https://github.com/apache/beam.git # timeout=10
Using shallow fetch with depth 1
Fetching upstream changes from https://github.com/apache/beam.git
> git fetch --no-tags --force --progress --depth=1 -- https://github.com/apache/beam.git +refs/heads/*:refs/remotes/origin/* +refs/pull/${ghprbPullId}/*:refs/remotes/origin/pr/${ghprbPullId}/* # timeout=10
> git rev-parse origin/master^{commit} # timeout=10
Checking out Revision d00303ab32673193a20eab37df6f57601e03125a (origin/master)
> git config core.sparsecheckout # timeout=10
> git checkout -f d00303ab32673193a20eab37df6f57601e03125a # timeout=10
Commit message: "add self to java reviewers to be able to merge and review streaming worker code (#29235)"
> git rev-list --no-walk 96d6f2d07e8afb7eaabab2fe415b54f93b15da18 # timeout=10
First time build. Skipping changelog.
No emails were triggered.
[EnvInject] - Executing scripts and injecting environment variables after the SCM step.
[EnvInject] - Injecting as environment variables the properties content
SETUPTOOLS_USE_DISTUTILS=stdlib
SPARK_LOCAL_IP=127.0.0.1
[EnvInject] - Variables injected successfully.
[Gradle] - Launching build.
[src] $ <https://ci-beam.apache.org/job/beam_PostCommit_Java_PVR_Spark3_Streaming/ws/src/gradlew> --continue --max-workers=8 -Dorg.gradle.jvmargs=-Xms2g -Dorg.gradle.jvmargs=-Xmx6g -Dorg.gradle.vfs.watch=false -Pdocker-pull-licenses :runners:spark:3:job-server:validatesPortableRunnerStreaming
To honour the JVM settings for this build a single-use Daemon process will be forked. For more on this, please refer to https://docs.gradle.org/8.4/userguide/gradle_daemon.html#sec:disabling_the_daemon in the Gradle documentation.
Daemon will be stopped at the end of the build
Configuration on demand is an incubating feature.
Gradle Enterprise plugins resolution: https://plugins.gradle.org/m2
Enforcing Gradle Enterprise: https://ge.apache.org, allowUntrustedServer: false
> Task :buildSrc:compileJava NO-SOURCE
> Task :buildSrc:compileGroovy FROM-CACHE
> Task :buildSrc:pluginDescriptors
> Task :buildSrc:processResources
> Task :buildSrc:classes
> Task :buildSrc:jar
> Task :model:pipeline:createCheckerFrameworkManifest
> Task :sdks:java:transform-service:launcher:createCheckerFrameworkManifest
> Task :sdks:java:core:createCheckerFrameworkManifest
> Task :runners:core-construction-java:createCheckerFrameworkManifest
> Task :model:fn-execution:createCheckerFrameworkManifest
> Task :model:job-management:createCheckerFrameworkManifest
> Task :sdks:java:fn-execution:createCheckerFrameworkManifest
> Task :sdks:java:extensions:avro:createCheckerFrameworkManifest
> Task :runners:core-construction-java:processResources NO-SOURCE
> Task :sdks:java:fn-execution:processResources NO-SOURCE
> Task :sdks:java:extensions:avro:generateAvroProtocol NO-SOURCE
> Task :sdks:java:extensions:avro:generateAvroJava NO-SOURCE
> Task :sdks:java:extensions:avro:processResources NO-SOURCE
> Task :runners:core-construction-java:processTestResources NO-SOURCE
> Task :model:job-management:extractProto
> Task :model:fn-execution:extractProto
> Task :runners:core-java:createCheckerFrameworkManifest
> Task :runners:direct-java:createCheckerFrameworkManifest
> Task :sdks:java:core:generateGrammarSource FROM-CACHE
> Task :runners:java-fn-execution:createCheckerFrameworkManifest
> Task :runners:core-java:processResources NO-SOURCE
> Task :runners:core-java:processTestResources NO-SOURCE
> Task :runners:java-fn-execution:processResources NO-SOURCE
> Task :runners:local-java:createCheckerFrameworkManifest
> Task :sdks:java:harness:createCheckerFrameworkManifest
> Task :runners:direct-java:processResources NO-SOURCE
> Task :runners:local-java:processResources NO-SOURCE
> Task :sdks:java:harness:processResources NO-SOURCE
> Task :model:job-management:processResources
> Task :runners:java-job-service:createCheckerFrameworkManifest
> Task :model:fn-execution:processResources
> Task :runners:java-job-service:processResources NO-SOURCE
> Task :sdks:java:extensions:avro:generateTestAvroProtocol NO-SOURCE
> Task :sdks:java:extensions:avro:generateTestAvroJava FROM-CACHE
> Task :sdks:java:extensions:avro:processTestResources NO-SOURCE
> Task :runners:spark:3:createCheckerFrameworkManifest
> Task :sdks:java:extensions:google-cloud-platform-core:createCheckerFrameworkManifest
> Task :sdks:java:expansion-service:createCheckerFrameworkManifest
> Task :runners:portability:java:createCheckerFrameworkManifest
> Task :sdks:java:expansion-service:processResources NO-SOURCE
> Task :runners:portability:java:processResources NO-SOURCE
> Task :sdks:java:extensions:google-cloud-platform-core:processResources NO-SOURCE
> Task :sdks:java:core:processResources
> Task :runners:portability:java:processTestResources NO-SOURCE
> Task :sdks:java:core:generateTestGrammarSource NO-SOURCE
> Task :runners:spark:3:processResources
> Task :sdks:java:io:kafka:createCheckerFrameworkManifest
> Task :sdks:java:io:kafka:processResources NO-SOURCE
> Task :sdks:java:core:processTestResources
> Task :runners:spark:3:processTestResources
> Task :sdks:java:transform-service:launcher:compileJava FROM-CACHE
> Task :sdks:java:transform-service:launcher:processResources
> Task :sdks:java:transform-service:launcher:classes
> Task :sdks:java:transform-service:launcher:jar
> Task :sdks:java:transform-service:launcher:shadowJar FROM-CACHE
> Task :model:pipeline:extractIncludeProto
> Task :model:pipeline:extractProto
> Task :model:pipeline:generateProto FROM-CACHE
> Task :model:pipeline:compileJava FROM-CACHE
> Task :model:pipeline:processResources
> Task :model:pipeline:classes
> Task :model:pipeline:jar
> Task :model:pipeline:shadowJar FROM-CACHE
> Task :model:job-management:extractIncludeProto
> Task :model:fn-execution:extractIncludeProto
> Task :model:job-management:generateProto FROM-CACHE
> Task :model:fn-execution:generateProto FROM-CACHE
> Task :model:job-management:compileJava FROM-CACHE
> Task :model:job-management:classes
> Task :model:fn-execution:compileJava FROM-CACHE
> Task :model:fn-execution:classes
> Task :model:job-management:shadowJar FROM-CACHE
> Task :model:fn-execution:shadowJar FROM-CACHE
> Task :sdks:java:core:compileJava FROM-CACHE
> Task :sdks:java:core:classes
> Task :sdks:java:core:shadowJar FROM-CACHE
> Task :runners:local-java:compileJava FROM-CACHE
> Task :runners:local-java:classes UP-TO-DATE
> Task :runners:local-java:jar
> Task :sdks:java:extensions:avro:compileJava FROM-CACHE
> Task :sdks:java:extensions:avro:classes UP-TO-DATE
> Task :sdks:java:fn-execution:compileJava FROM-CACHE
> Task :sdks:java:fn-execution:classes UP-TO-DATE
> Task :sdks:java:extensions:avro:jar
> Task :sdks:java:fn-execution:jar
> Task :sdks:java:core:jar
> Task :runners:core-construction-java:compileJava FROM-CACHE
> Task :runners:core-construction-java:classes UP-TO-DATE
> Task :runners:core-construction-java:jar
> Task :runners:core-java:compileJava FROM-CACHE
> Task :runners:core-java:classes UP-TO-DATE
> Task :runners:core-java:jar
> Task :sdks:java:extensions:google-cloud-platform-core:compileJava FROM-CACHE
> Task :sdks:java:extensions:google-cloud-platform-core:classes UP-TO-DATE
> Task :sdks:java:extensions:google-cloud-platform-core:jar
> Task :sdks:java:harness:compileJava FROM-CACHE
> Task :sdks:java:harness:classes UP-TO-DATE
> Task :sdks:java:harness:jar
> Task :sdks:java:core:compileTestJava FROM-CACHE
> Task :sdks:java:core:testClasses
> Task :runners:java-fn-execution:compileJava FROM-CACHE
> Task :runners:java-fn-execution:classes UP-TO-DATE
> Task :runners:java-fn-execution:jar
> Task :sdks:java:core:shadowTestJar FROM-CACHE
> Task :sdks:java:expansion-service:compileJava FROM-CACHE
> Task :sdks:java:expansion-service:classes UP-TO-DATE
> Task :sdks:java:expansion-service:jar
> Task :runners:java-job-service:compileJava FROM-CACHE
> Task :runners:java-job-service:classes UP-TO-DATE
> Task :runners:direct-java:compileJava FROM-CACHE
> Task :runners:direct-java:classes UP-TO-DATE
> Task :runners:java-job-service:jar
> Task :sdks:java:io:kafka:compileJava FROM-CACHE
> Task :sdks:java:io:kafka:classes UP-TO-DATE
> Task :runners:direct-java:shadowJar FROM-CACHE
> Task :sdks:java:harness:shadowJar FROM-CACHE
> Task :sdks:java:io:kafka:jar
> Task :sdks:java:extensions:avro:compileTestJava FROM-CACHE
> Task :sdks:java:extensions:avro:testClasses UP-TO-DATE
> Task :sdks:java:extensions:avro:testJar
> Task :runners:spark:3:compileJava FROM-CACHE
> Task :runners:spark:3:classes
> Task :runners:core-java:compileTestJava FROM-CACHE
> Task :runners:core-java:testClasses UP-TO-DATE
> Task :runners:core-java:testJar
> Task :runners:spark:3:jar
> Task :runners:core-construction-java:compileTestJava FROM-CACHE
> Task :runners:core-construction-java:testClasses UP-TO-DATE
> Task :runners:core-construction-java:testJar
> Task :runners:spark:3:compileTestJava FROM-CACHE
> Task :runners:spark:3:testClasses
> Task :runners:spark:3:testJar
> Task :runners:portability:java:compileJava FROM-CACHE
> Task :runners:portability:java:classes UP-TO-DATE
> Task :runners:portability:java:jar
> Task :runners:portability:java:compileTestJava FROM-CACHE
> Task :runners:portability:java:testClasses UP-TO-DATE
> Task :runners:portability:java:testJar
> Task :runners:spark:3:job-server:validatesPortableRunnerStreaming
org.apache.beam.sdk.transforms.ParDoTest$BasicTests > testPipelineOptionsParameter FAILED
java.lang.RuntimeException at ParDoTest.java:646
org.apache.beam.sdk.transforms.ParDoTest$LifecycleTests > testWindowingInStartAndFinishBundle FAILED
java.lang.RuntimeException at ParDoTest.java:1800
[shutdown-hook-0] INFO org.apache.spark.util.ShutdownHookManager - Shutdown hook called
[shutdown-hook-0] INFO org.apache.spark.util.ShutdownHookManager - Deleting directory /tmp/spark-88038ce9-0aa3-48e6-8acc-d096d8fd24b4
[shutdown-hook-0] INFO org.apache.spark.util.ShutdownHookManager - Shutdown hook called
[shutdown-hook-0] INFO org.apache.spark.util.ShutdownHookManager - Deleting directory /tmp/spark-12afe144-f951-4eed-80dd-3383a5e61986
[shutdown-hook-0] INFO org.apache.spark.util.ShutdownHookManager - Shutdown hook called
[shutdown-hook-0] INFO org.apache.spark.util.ShutdownHookManager - Deleting directory /tmp/spark-2bb11cbd-afb1-46dd-a053-8b252dbf7268
[shutdown-hook-0] INFO org.apache.spark.util.ShutdownHookManager - Shutdown hook called
[shutdown-hook-0] INFO org.apache.spark.util.ShutdownHookManager - Deleting directory /tmp/spark-d69f7176-e40d-4433-b28d-7e3369bae90d
> Task :runners:spark:3:job-server:validatesPortableRunnerStreaming
111 tests completed, 2 failed, 1 skipped
> Task :runners:spark:3:job-server:validatesPortableRunnerStreaming FAILED
FAILURE: Build failed with an exception.
* What went wrong:
Execution failed for task ':runners:spark:3:job-server:validatesPortableRunnerStreaming'.
> There were failing tests. See the report at: file://<https://ci-beam.apache.org/job/beam_PostCommit_Java_PVR_Spark3_Streaming/ws/src/runners/spark/3/job-server/build/reports/tests/validatesPortableRunnerStreaming/index.html>
Deprecated Gradle features were used in this build, making it incompatible with Gradle 9.0.
You can use '--warning-mode all' to show the individual deprecation warnings and determine if they come from your own scripts or plugins.
For more on this, please refer to https://docs.gradle.org/8.4/userguide/command_line_interface.html#sec:command_line_warnings in the Gradle documentation.
BUILD FAILED in 1h 27m 16s
97 actionable tasks: 58 executed, 39 from cache
Publishing build scan...
https://ge.apache.org/s/vlzo2n4vbz5lm
Build step 'Invoke Gradle script' changed build result to FAILURE
Build step 'Invoke Gradle script' marked build as failure
---------------------------------------------------------------------
To unsubscribe, e-mail: builds-unsubscribe@beam.apache.org
For additional commands, e-mail: builds-help@beam.apache.org
Jenkins build is back to normal : beam_PostCommit_Java_PVR_Spark3_Streaming #3700
Posted by Apache Jenkins Server <je...@builds.apache.org>.
See <https://ci-beam.apache.org/job/beam_PostCommit_Java_PVR_Spark3_Streaming/3700/display/redirect?page=changes>
---------------------------------------------------------------------
To unsubscribe, e-mail: builds-unsubscribe@beam.apache.org
For additional commands, e-mail: builds-help@beam.apache.org
Build failed in Jenkins: beam_PostCommit_Java_PVR_Spark3_Streaming #3699
Posted by Apache Jenkins Server <je...@builds.apache.org>.
See <https://ci-beam.apache.org/job/beam_PostCommit_Java_PVR_Spark3_Streaming/3699/display/redirect>
Changes:
------------------------------------------
[...truncated 1.42 MB...]
at java.util.concurrent.locks.LockSupport.park(LockSupport.java:175)
at java.util.concurrent.locks.AbstractQueuedSynchronizer$ConditionObject.await(AbstractQueuedSynchronizer.java:2039)
at org.apache.beam.sdk.fn.CancellableQueue.take(CancellableQueue.java:95)
at org.apache.beam.sdk.fn.data.BeamFnDataInboundObserver.awaitCompletion(BeamFnDataInboundObserver.java:122)
at org.apache.beam.fn.harness.control.ProcessBundleHandler.processBundle(ProcessBundleHandler.java:550)
at org.apache.beam.fn.harness.FnHarness$$Lambda$1806/391861999.apply(Unknown Source)
at org.apache.beam.fn.harness.control.BeamFnControlClient.delegateOnInstructionRequestType(BeamFnControlClient.java:150)
at org.apache.beam.fn.harness.control.BeamFnControlClient$InboundObserver.lambda$onNext$0(BeamFnControlClient.java:115)
at org.apache.beam.fn.harness.control.BeamFnControlClient$InboundObserver$$Lambda$1834/500796093.run(Unknown Source)
at java.util.concurrent.Executors$RunnableAdapter.call(Executors.java:511)
at java.util.concurrent.FutureTask.run(FutureTask.java:266)
at org.apache.beam.sdk.util.UnboundedScheduledExecutorService$ScheduledFutureTask.run(UnboundedScheduledExecutorService.java:163)
at java.util.concurrent.ThreadPoolExecutor.runWorker(ThreadPoolExecutor.java:1149)
at java.util.concurrent.ThreadPoolExecutor$Worker.run(ThreadPoolExecutor.java:624)
at java.lang.Thread.run(Thread.java:750)
[pool-438-thread-2] WARN org.apache.beam.fn.harness.control.ExecutionStateSampler - Operation ongoing in bundle 5 for at least 22m46s without outputting or completing:
at sun.misc.Unsafe.park(Native Method)
at java.util.concurrent.locks.LockSupport.park(LockSupport.java:175)
at java.util.concurrent.locks.AbstractQueuedSynchronizer$ConditionObject.await(AbstractQueuedSynchronizer.java:2039)
at org.apache.beam.sdk.fn.CancellableQueue.take(CancellableQueue.java:95)
at org.apache.beam.sdk.fn.data.BeamFnDataInboundObserver.awaitCompletion(BeamFnDataInboundObserver.java:122)
at org.apache.beam.fn.harness.control.ProcessBundleHandler.processBundle(ProcessBundleHandler.java:550)
at org.apache.beam.fn.harness.FnHarness$$Lambda$1806/391861999.apply(Unknown Source)
at org.apache.beam.fn.harness.control.BeamFnControlClient.delegateOnInstructionRequestType(BeamFnControlClient.java:150)
at org.apache.beam.fn.harness.control.BeamFnControlClient$InboundObserver.lambda$onNext$0(BeamFnControlClient.java:115)
at org.apache.beam.fn.harness.control.BeamFnControlClient$InboundObserver$$Lambda$1834/500796093.run(Unknown Source)
at java.util.concurrent.Executors$RunnableAdapter.call(Executors.java:511)
at java.util.concurrent.FutureTask.run(FutureTask.java:266)
at org.apache.beam.sdk.util.UnboundedScheduledExecutorService$ScheduledFutureTask.run(UnboundedScheduledExecutorService.java:163)
at java.util.concurrent.ThreadPoolExecutor.runWorker(ThreadPoolExecutor.java:1149)
at java.util.concurrent.ThreadPoolExecutor$Worker.run(ThreadPoolExecutor.java:624)
at java.lang.Thread.run(Thread.java:750)
[pool-438-thread-2] WARN org.apache.beam.fn.harness.control.ExecutionStateSampler - Operation ongoing in bundle 4 for at least 22m46s without outputting or completing:
at sun.misc.Unsafe.park(Native Method)
at java.util.concurrent.locks.LockSupport.park(LockSupport.java:175)
at java.util.concurrent.locks.AbstractQueuedSynchronizer$ConditionObject.await(AbstractQueuedSynchronizer.java:2039)
at org.apache.beam.sdk.fn.CancellableQueue.take(CancellableQueue.java:95)
at org.apache.beam.sdk.fn.data.BeamFnDataInboundObserver.awaitCompletion(BeamFnDataInboundObserver.java:122)
at org.apache.beam.fn.harness.control.ProcessBundleHandler.processBundle(ProcessBundleHandler.java:550)
at org.apache.beam.fn.harness.FnHarness$$Lambda$1806/391861999.apply(Unknown Source)
at org.apache.beam.fn.harness.control.BeamFnControlClient.delegateOnInstructionRequestType(BeamFnControlClient.java:150)
at org.apache.beam.fn.harness.control.BeamFnControlClient$InboundObserver.lambda$onNext$0(BeamFnControlClient.java:115)
at org.apache.beam.fn.harness.control.BeamFnControlClient$InboundObserver$$Lambda$1834/500796093.run(Unknown Source)
at java.util.concurrent.Executors$RunnableAdapter.call(Executors.java:511)
at java.util.concurrent.FutureTask.run(FutureTask.java:266)
at org.apache.beam.sdk.util.UnboundedScheduledExecutorService$ScheduledFutureTask.run(UnboundedScheduledExecutorService.java:163)
at java.util.concurrent.ThreadPoolExecutor.runWorker(ThreadPoolExecutor.java:1149)
at java.util.concurrent.ThreadPoolExecutor$Worker.run(ThreadPoolExecutor.java:624)
at java.lang.Thread.run(Thread.java:750)
[pool-438-thread-2] WARN org.apache.beam.fn.harness.control.ExecutionStateSampler - Operation ongoing in bundle 5 for at least 22m46s without outputting or completing:
at sun.misc.Unsafe.park(Native Method)
at java.util.concurrent.locks.LockSupport.park(LockSupport.java:175)
at java.util.concurrent.locks.AbstractQueuedSynchronizer$ConditionObject.await(AbstractQueuedSynchronizer.java:2039)
at org.apache.beam.sdk.fn.CancellableQueue.take(CancellableQueue.java:95)
at org.apache.beam.sdk.fn.data.BeamFnDataInboundObserver.awaitCompletion(BeamFnDataInboundObserver.java:122)
at org.apache.beam.fn.harness.control.ProcessBundleHandler.processBundle(ProcessBundleHandler.java:550)
at org.apache.beam.fn.harness.FnHarness$$Lambda$1806/391861999.apply(Unknown Source)
at org.apache.beam.fn.harness.control.BeamFnControlClient.delegateOnInstructionRequestType(BeamFnControlClient.java:150)
at org.apache.beam.fn.harness.control.BeamFnControlClient$InboundObserver.lambda$onNext$0(BeamFnControlClient.java:115)
at org.apache.beam.fn.harness.control.BeamFnControlClient$InboundObserver$$Lambda$1834/500796093.run(Unknown Source)
at java.util.concurrent.Executors$RunnableAdapter.call(Executors.java:511)
at java.util.concurrent.FutureTask.run(FutureTask.java:266)
at org.apache.beam.sdk.util.UnboundedScheduledExecutorService$ScheduledFutureTask.run(UnboundedScheduledExecutorService.java:163)
at java.util.concurrent.ThreadPoolExecutor.runWorker(ThreadPoolExecutor.java:1149)
at java.util.concurrent.ThreadPoolExecutor$Worker.run(ThreadPoolExecutor.java:624)
at java.lang.Thread.run(Thread.java:750)
[pool-438-thread-2] WARN org.apache.beam.fn.harness.control.ExecutionStateSampler - Operation ongoing in bundle 4 for at least 22m46s without outputting or completing:
at sun.misc.Unsafe.park(Native Method)
at java.util.concurrent.locks.LockSupport.park(LockSupport.java:175)
at java.util.concurrent.locks.AbstractQueuedSynchronizer$ConditionObject.await(AbstractQueuedSynchronizer.java:2039)
at org.apache.beam.sdk.fn.CancellableQueue.take(CancellableQueue.java:95)
at org.apache.beam.sdk.fn.data.BeamFnDataInboundObserver.awaitCompletion(BeamFnDataInboundObserver.java:122)
at org.apache.beam.fn.harness.control.ProcessBundleHandler.processBundle(ProcessBundleHandler.java:550)
at org.apache.beam.fn.harness.FnHarness$$Lambda$1806/391861999.apply(Unknown Source)
at org.apache.beam.fn.harness.control.BeamFnControlClient.delegateOnInstructionRequestType(BeamFnControlClient.java:150)
at org.apache.beam.fn.harness.control.BeamFnControlClient$InboundObserver.lambda$onNext$0(BeamFnControlClient.java:115)
at org.apache.beam.fn.harness.control.BeamFnControlClient$InboundObserver$$Lambda$1834/500796093.run(Unknown Source)
at java.util.concurrent.Executors$RunnableAdapter.call(Executors.java:511)
at java.util.concurrent.FutureTask.run(FutureTask.java:266)
at org.apache.beam.sdk.util.UnboundedScheduledExecutorService$ScheduledFutureTask.run(UnboundedScheduledExecutorService.java:163)
at java.util.concurrent.ThreadPoolExecutor.runWorker(ThreadPoolExecutor.java:1149)
at java.util.concurrent.ThreadPoolExecutor$Worker.run(ThreadPoolExecutor.java:624)
at java.lang.Thread.run(Thread.java:750)
[pool-438-thread-2] WARN org.apache.beam.fn.harness.control.ExecutionStateSampler - Operation ongoing in bundle 5 for at least 22m46s without outputting or completing:
at sun.misc.Unsafe.park(Native Method)
at java.util.concurrent.locks.LockSupport.park(LockSupport.java:175)
at java.util.concurrent.locks.AbstractQueuedSynchronizer$ConditionObject.await(AbstractQueuedSynchronizer.java:2039)
at org.apache.beam.sdk.fn.CancellableQueue.take(CancellableQueue.java:95)
at org.apache.beam.sdk.fn.data.BeamFnDataInboundObserver.awaitCompletion(BeamFnDataInboundObserver.java:122)
at org.apache.beam.fn.harness.control.ProcessBundleHandler.processBundle(ProcessBundleHandler.java:550)
at org.apache.beam.fn.harness.FnHarness$$Lambda$1806/391861999.apply(Unknown Source)
at org.apache.beam.fn.harness.control.BeamFnControlClient.delegateOnInstructionRequestType(BeamFnControlClient.java:150)
at org.apache.beam.fn.harness.control.BeamFnControlClient$InboundObserver.lambda$onNext$0(BeamFnControlClient.java:115)
at org.apache.beam.fn.harness.control.BeamFnControlClient$InboundObserver$$Lambda$1834/500796093.run(Unknown Source)
at java.util.concurrent.Executors$RunnableAdapter.call(Executors.java:511)
at java.util.concurrent.FutureTask.run(FutureTask.java:266)
at org.apache.beam.sdk.util.UnboundedScheduledExecutorService$ScheduledFutureTask.run(UnboundedScheduledExecutorService.java:163)
at java.util.concurrent.ThreadPoolExecutor.runWorker(ThreadPoolExecutor.java:1149)
at java.util.concurrent.ThreadPoolExecutor$Worker.run(ThreadPoolExecutor.java:624)
at java.lang.Thread.run(Thread.java:750)
[pool-438-thread-2] WARN org.apache.beam.fn.harness.control.ExecutionStateSampler - Operation ongoing in bundle 4 for at least 22m46s without outputting or completing:
at sun.misc.Unsafe.park(Native Method)
at java.util.concurrent.locks.LockSupport.park(LockSupport.java:175)
at java.util.concurrent.locks.AbstractQueuedSynchronizer$ConditionObject.await(AbstractQueuedSynchronizer.java:2039)
at org.apache.beam.sdk.fn.CancellableQueue.take(CancellableQueue.java:95)
at org.apache.beam.sdk.fn.data.BeamFnDataInboundObserver.awaitCompletion(BeamFnDataInboundObserver.java:122)
at org.apache.beam.fn.harness.control.ProcessBundleHandler.processBundle(ProcessBundleHandler.java:550)
at org.apache.beam.fn.harness.FnHarness$$Lambda$1806/391861999.apply(Unknown Source)
at org.apache.beam.fn.harness.control.BeamFnControlClient.delegateOnInstructionRequestType(BeamFnControlClient.java:150)
at org.apache.beam.fn.harness.control.BeamFnControlClient$InboundObserver.lambda$onNext$0(BeamFnControlClient.java:115)
at org.apache.beam.fn.harness.control.BeamFnControlClient$InboundObserver$$Lambda$1834/500796093.run(Unknown Source)
at java.util.concurrent.Executors$RunnableAdapter.call(Executors.java:511)
at java.util.concurrent.FutureTask.run(FutureTask.java:266)
at org.apache.beam.sdk.util.UnboundedScheduledExecutorService$ScheduledFutureTask.run(UnboundedScheduledExecutorService.java:163)
at java.util.concurrent.ThreadPoolExecutor.runWorker(ThreadPoolExecutor.java:1149)
at java.util.concurrent.ThreadPoolExecutor$Worker.run(ThreadPoolExecutor.java:624)
at java.lang.Thread.run(Thread.java:750)
[pool-438-thread-2] WARN org.apache.beam.fn.harness.control.ExecutionStateSampler - Operation ongoing in bundle 5 for at least 22m46s without outputting or completing:
at sun.misc.Unsafe.park(Native Method)
at java.util.concurrent.locks.LockSupport.park(LockSupport.java:175)
at java.util.concurrent.locks.AbstractQueuedSynchronizer$ConditionObject.await(AbstractQueuedSynchronizer.java:2039)
at org.apache.beam.sdk.fn.CancellableQueue.take(CancellableQueue.java:95)
at org.apache.beam.sdk.fn.data.BeamFnDataInboundObserver.awaitCompletion(BeamFnDataInboundObserver.java:122)
at org.apache.beam.fn.harness.control.ProcessBundleHandler.processBundle(ProcessBundleHandler.java:550)
at org.apache.beam.fn.harness.FnHarness$$Lambda$1806/391861999.apply(Unknown Source)
at org.apache.beam.fn.harness.control.BeamFnControlClient.delegateOnInstructionRequestType(BeamFnControlClient.java:150)
at org.apache.beam.fn.harness.control.BeamFnControlClient$InboundObserver.lambda$onNext$0(BeamFnControlClient.java:115)
at org.apache.beam.fn.harness.control.BeamFnControlClient$InboundObserver$$Lambda$1834/500796093.run(Unknown Source)
at java.util.concurrent.Executors$RunnableAdapter.call(Executors.java:511)
at java.util.concurrent.FutureTask.run(FutureTask.java:266)
at org.apache.beam.sdk.util.UnboundedScheduledExecutorService$ScheduledFutureTask.run(UnboundedScheduledExecutorService.java:163)
at java.util.concurrent.ThreadPoolExecutor.runWorker(ThreadPoolExecutor.java:1149)
at java.util.concurrent.ThreadPoolExecutor$Worker.run(ThreadPoolExecutor.java:624)
at java.lang.Thread.run(Thread.java:750)
[pool-438-thread-2] WARN org.apache.beam.fn.harness.control.ExecutionStateSampler - Operation ongoing in bundle 4 for at least 22m46s without outputting or completing:
at sun.misc.Unsafe.park(Native Method)
at java.util.concurrent.locks.LockSupport.park(LockSupport.java:175)
at java.util.concurrent.locks.AbstractQueuedSynchronizer$ConditionObject.await(AbstractQueuedSynchronizer.java:2039)
at org.apache.beam.sdk.fn.CancellableQueue.take(CancellableQueue.java:95)
at org.apache.beam.sdk.fn.data.BeamFnDataInboundObserver.awaitCompletion(BeamFnDataInboundObserver.java:122)
at org.apache.beam.fn.harness.control.ProcessBundleHandler.processBundle(ProcessBundleHandler.java:550)
at org.apache.beam.fn.harness.FnHarness$$Lambda$1806/391861999.apply(Unknown Source)
at org.apache.beam.fn.harness.control.BeamFnControlClient.delegateOnInstructionRequestType(BeamFnControlClient.java:150)
at org.apache.beam.fn.harness.control.BeamFnControlClient$InboundObserver.lambda$onNext$0(BeamFnControlClient.java:115)
at org.apache.beam.fn.harness.control.BeamFnControlClient$InboundObserver$$Lambda$1834/500796093.run(Unknown Source)
at java.util.concurrent.Executors$RunnableAdapter.call(Executors.java:511)
at java.util.concurrent.FutureTask.run(FutureTask.java:266)
at org.apache.beam.sdk.util.UnboundedScheduledExecutorService$ScheduledFutureTask.run(UnboundedScheduledExecutorService.java:163)
at java.util.concurrent.ThreadPoolExecutor.runWorker(ThreadPoolExecutor.java:1149)
at java.util.concurrent.ThreadPoolExecutor$Worker.run(ThreadPoolExecutor.java:624)
at java.lang.Thread.run(Thread.java:750)
[pool-438-thread-2] WARN org.apache.beam.fn.harness.control.ExecutionStateSampler - Operation ongoing in bundle 5 for at least 22m46s without outputting or completing:
at sun.misc.Unsafe.park(Native Method)
at java.util.concurrent.locks.LockSupport.park(LockSupport.java:175)
at java.util.concurrent.locks.AbstractQueuedSynchronizer$ConditionObject.await(AbstractQueuedSynchronizer.java:2039)
at org.apache.beam.sdk.fn.CancellableQueue.take(CancellableQueue.java:95)
at org.apache.beam.sdk.fn.data.BeamFnDataInboundObserver.awaitCompletion(BeamFnDataInboundObserver.java:122)
at org.apache.beam.fn.harness.control.ProcessBundleHandler.processBundle(ProcessBundleHandler.java:550)
at org.apache.beam.fn.harness.FnHarness$$Lambda$1806/391861999.apply(Unknown Source)
at org.apache.beam.fn.harness.control.BeamFnControlClient.delegateOnInstructionRequestType(BeamFnControlClient.java:150)
at org.apache.beam.fn.harness.control.BeamFnControlClient$InboundObserver.lambda$onNext$0(BeamFnControlClient.java:115)
at org.apache.beam.fn.harness.control.BeamFnControlClient$InboundObserver$$Lambda$1834/500796093.run(Unknown Source)
at java.util.concurrent.Executors$RunnableAdapter.call(Executors.java:511)
at java.util.concurrent.FutureTask.run(FutureTask.java:266)
at org.apache.beam.sdk.util.UnboundedScheduledExecutorService$ScheduledFutureTask.run(UnboundedScheduledExecutorService.java:163)
at java.util.concurrent.ThreadPoolExecutor.runWorker(ThreadPoolExecutor.java:1149)
at java.util.concurrent.ThreadPoolExecutor$Worker.run(ThreadPoolExecutor.java:624)
at java.lang.Thread.run(Thread.java:750)
[pool-438-thread-2] WARN org.apache.beam.fn.harness.control.ExecutionStateSampler - Operation ongoing in bundle 4 for at least 22m46s without outputting or completing:
at sun.misc.Unsafe.park(Native Method)
at java.util.concurrent.locks.LockSupport.park(LockSupport.java:175)
at java.util.concurrent.locks.AbstractQueuedSynchronizer$ConditionObject.await(AbstractQueuedSynchronizer.java:2039)
at org.apache.beam.sdk.fn.CancellableQueue.take(CancellableQueue.java:95)
at org.apache.beam.sdk.fn.data.BeamFnDataInboundObserver.awaitCompletion(BeamFnDataInboundObserver.java:122)
at org.apache.beam.fn.harness.control.ProcessBundleHandler.processBundle(ProcessBundleHandler.java:550)
at org.apache.beam.fn.harness.FnHarness$$Lambda$1806/391861999.apply(Unknown Source)
at org.apache.beam.fn.harness.control.BeamFnControlClient.delegateOnInstructionRequestType(BeamFnControlClient.java:150)
at org.apache.beam.fn.harness.control.BeamFnControlClient$InboundObserver.lambda$onNext$0(BeamFnControlClient.java:115)
at org.apache.beam.fn.harness.control.BeamFnControlClient$InboundObserver$$Lambda$1834/500796093.run(Unknown Source)
at java.util.concurrent.Executors$RunnableAdapter.call(Executors.java:511)
at java.util.concurrent.FutureTask.run(FutureTask.java:266)
at org.apache.beam.sdk.util.UnboundedScheduledExecutorService$ScheduledFutureTask.run(UnboundedScheduledExecutorService.java:163)
at java.util.concurrent.ThreadPoolExecutor.runWorker(ThreadPoolExecutor.java:1149)
at java.util.concurrent.ThreadPoolExecutor$Worker.run(ThreadPoolExecutor.java:624)
at java.lang.Thread.run(Thread.java:750)
[pool-438-thread-2] WARN org.apache.beam.fn.harness.control.ExecutionStateSampler - Operation ongoing in bundle 5 for at least 22m47s without outputting or completing:
at sun.misc.Unsafe.park(Native Method)
at java.util.concurrent.locks.LockSupport.park(LockSupport.java:175)
at java.util.concurrent.locks.AbstractQueuedSynchronizer$ConditionObject.await(AbstractQueuedSynchronizer.java:2039)
at org.apache.beam.sdk.fn.CancellableQueue.take(CancellableQueue.java:95)
at org.apache.beam.sdk.fn.data.BeamFnDataInboundObserver.awaitCompletion(BeamFnDataInboundObserver.java:122)
at org.apache.beam.fn.harness.control.ProcessBundleHandler.processBundle(ProcessBundleHandler.java:550)
at org.apache.beam.fn.harness.FnHarness$$Lambda$1806/391861999.apply(Unknown Source)
at org.apache.beam.fn.harness.control.BeamFnControlClient.delegateOnInstructionRequestType(BeamFnControlClient.java:150)
at org.apache.beam.fn.harness.control.BeamFnControlClient$InboundObserver.lambda$onNext$0(BeamFnControlClient.java:115)
at org.apache.beam.fn.harness.control.BeamFnControlClient$InboundObserver$$Lambda$1834/500796093.run(Unknown Source)
at java.util.concurrent.Executors$RunnableAdapter.call(Executors.java:511)
at java.util.concurrent.FutureTask.run(FutureTask.java:266)
at org.apache.beam.sdk.util.UnboundedScheduledExecutorService$ScheduledFutureTask.run(UnboundedScheduledExecutorService.java:163)
at java.util.concurrent.ThreadPoolExecutor.runWorker(ThreadPoolExecutor.java:1149)
at java.util.concurrent.ThreadPoolExecutor$Worker.run(ThreadPoolExecutor.java:624)
at java.lang.Thread.run(Thread.java:750)
[pool-438-thread-2] WARN org.apache.beam.fn.harness.control.ExecutionStateSampler - Operation ongoing in bundle 4 for at least 22m47s without outputting or completing:
at sun.misc.Unsafe.park(Native Method)
at java.util.concurrent.locks.LockSupport.park(LockSupport.java:175)
at java.util.concurrent.locks.AbstractQueuedSynchronizer$ConditionObject.await(AbstractQueuedSynchronizer.java:2039)
at org.apache.beam.sdk.fn.CancellableQueue.take(CancellableQueue.java:95)
at org.apache.beam.sdk.fn.data.BeamFnDataInboundObserver.awaitCompletion(BeamFnDataInboundObserver.java:122)
at org.apache.beam.fn.harness.control.ProcessBundleHandler.processBundle(ProcessBundleHandler.java:550)
at org.apache.beam.fn.harness.FnHarness$$Lambda$1806/391861999.apply(Unknown Source)
at org.apache.beam.fn.harness.control.BeamFnControlClient.delegateOnInstructionRequestType(BeamFnControlClient.java:150)
at org.apache.beam.fn.harness.control.BeamFnControlClient$InboundObserver.lambda$onNext$0(BeamFnControlClient.java:115)
at org.apache.beam.fn.harness.control.BeamFnControlClient$InboundObserver$$Lambda$1834/500796093.run(Unknown Source)
at java.util.concurrent.Executors$RunnableAdapter.call(Executors.java:511)
at java.util.concurrent.FutureTask.run(FutureTask.java:266)
at org.apache.beam.sdk.util.UnboundedScheduledExecutorService$ScheduledFutureTask.run(UnboundedScheduledExecutorService.java:163)
at java.util.concurrent.ThreadPoolExecutor.runWorker(ThreadPoolExecutor.java:1149)
at java.util.concurrent.ThreadPoolExecutor$Worker.run(ThreadPoolExecutor.java:624)
at java.lang.Thread.run(Thread.java:750)
[Thread-5] ERROR org.apache.hadoop.util.ShutdownHookManager - ShutdownHookManager shutdown forcefully after 30 seconds.
[shutdown-hook-0] INFO org.apache.spark.util.ShutdownHookManager - Shutdown hook called
[shutdown-hook-0] INFO org.apache.spark.util.ShutdownHookManager - Deleting directory /tmp/spark-22123177-ad7d-4c53-8ca5-2bae2dd4e27b
> Task :runners:spark:3:job-server:validatesPortableRunnerStreaming
111 tests completed, 16 failed, 1 skipped
> Task :runners:spark:3:job-server:validatesPortableRunnerStreaming FAILED
FAILURE: Build failed with an exception.
* What went wrong:
Execution failed for task ':runners:spark:3:job-server:validatesPortableRunnerStreaming'.
> There were failing tests. See the report at: file://<https://ci-beam.apache.org/job/beam_PostCommit_Java_PVR_Spark3_Streaming/ws/src/runners/spark/3/job-server/build/reports/tests/validatesPortableRunnerStreaming/index.html>
Deprecated Gradle features were used in this build, making it incompatible with Gradle 9.0.
You can use '--warning-mode all' to show the individual deprecation warnings and determine if they come from your own scripts or plugins.
For more on this, please refer to https://docs.gradle.org/8.4/userguide/command_line_interface.html#sec:command_line_warnings in the Gradle documentation.
BUILD FAILED in 1h 25m 9s
97 actionable tasks: 58 executed, 39 from cache
Publishing build scan...
https://ge.apache.org/s/huefaeoykiyuq
Build step 'Invoke Gradle script' changed build result to FAILURE
Build step 'Invoke Gradle script' marked build as failure
---------------------------------------------------------------------
To unsubscribe, e-mail: builds-unsubscribe@beam.apache.org
For additional commands, e-mail: builds-help@beam.apache.org