You are viewing a plain text version of this content. The canonical link for it is here.
Posted to commits@sling.apache.org by Apache Jenkins Server <je...@builds.apache.org> on 2018/09/15 12:53:14 UTC
Jenkins build is still unstable:
sling-org-apache-sling-launchpad-testing-10 #170
See <https://builds.apache.org/job/sling-org-apache-sling-launchpad-testing-10/170/display/redirect>
Jenkins build is back to stable :
sling-org-apache-sling-launchpad-testing-10 #178
Posted by Apache Jenkins Server <je...@builds.apache.org>.
See <https://builds.apache.org/job/sling-org-apache-sling-launchpad-testing-10/178/display/redirect>
Jenkins build is still unstable:
sling-org-apache-sling-launchpad-testing-10 #177
Posted by Apache Jenkins Server <je...@builds.apache.org>.
See <https://builds.apache.org/job/sling-org-apache-sling-launchpad-testing-10/177/display/redirect>
Jenkins build is still unstable:
sling-org-apache-sling-launchpad-testing-10 #176
Posted by Apache Jenkins Server <je...@builds.apache.org>.
See <https://builds.apache.org/job/sling-org-apache-sling-launchpad-testing-10/176/display/redirect>
Jenkins build is still unstable:
sling-org-apache-sling-launchpad-testing-10 #175
Posted by Apache Jenkins Server <je...@builds.apache.org>.
See <https://builds.apache.org/job/sling-org-apache-sling-launchpad-testing-10/175/display/redirect?page=changes>
Jenkins build is unstable:
sling-org-apache-sling-launchpad-testing-10 #174
Posted by Apache Jenkins Server <je...@builds.apache.org>.
See <https://builds.apache.org/job/sling-org-apache-sling-launchpad-testing-10/174/display/redirect?page=changes>
Build failed in Jenkins:
sling-org-apache-sling-launchpad-testing-10 #173
Posted by Apache Jenkins Server <je...@builds.apache.org>.
See <https://builds.apache.org/job/sling-org-apache-sling-launchpad-testing-10/173/display/redirect?page=changes>
Changes:
[radu] SLING-7215 - [nice-to-have] Add a CONTRIBUTING file to every module
------------------------------------------
[...truncated 236.46 KB...]
[INFO] Tests run: 1, Failures: 0, Errors: 0, Skipped: 0, Time elapsed: 1.576 s - in org.apache.sling.launchpad.webapp.integrationtest.VersionParameterTest
[INFO] Running org.apache.sling.launchpad.webapp.integrationtest.RedirectTest
[INFO] Tests run: 6, Failures: 0, Errors: 0, Skipped: 0, Time elapsed: 0.283 s - in org.apache.sling.launchpad.webapp.integrationtest.RedirectTest
[INFO] Running org.apache.sling.launchpad.webapp.integrationtest.NodeTypeBasedRenderingTest
[INFO] Tests run: 7, Failures: 0, Errors: 0, Skipped: 0, Time elapsed: 2.401 s - in org.apache.sling.launchpad.webapp.integrationtest.NodeTypeBasedRenderingTest
[INFO] Running org.apache.sling.launchpad.webapp.integrationtest.ScriptBindingsValuesProviderTest
[INFO] Tests run: 3, Failures: 0, Errors: 0, Skipped: 0, Time elapsed: 0.929 s - in org.apache.sling.launchpad.webapp.integrationtest.ScriptBindingsValuesProviderTest
[INFO] Running org.apache.sling.launchpad.webapp.integrationtest.userManager.CreateGroupTest
[INFO] Tests run: 8, Failures: 0, Errors: 0, Skipped: 0, Time elapsed: 0.73 s - in org.apache.sling.launchpad.webapp.integrationtest.userManager.CreateGroupTest
[INFO] Running org.apache.sling.launchpad.webapp.integrationtest.userManager.UpdateGroupTest
[INFO] Tests run: 8, Failures: 0, Errors: 0, Skipped: 0, Time elapsed: 2.441 s - in org.apache.sling.launchpad.webapp.integrationtest.userManager.UpdateGroupTest
[INFO] Running org.apache.sling.launchpad.webapp.integrationtest.userManager.CreateUserTest
[INFO] Tests run: 11, Failures: 0, Errors: 0, Skipped: 0, Time elapsed: 0.631 s - in org.apache.sling.launchpad.webapp.integrationtest.userManager.CreateUserTest
[INFO] Running org.apache.sling.launchpad.webapp.integrationtest.userManager.UserPrivilegesInfoTest
[INFO] Tests run: 7, Failures: 0, Errors: 0, Skipped: 0, Time elapsed: 3.033 s - in org.apache.sling.launchpad.webapp.integrationtest.userManager.UserPrivilegesInfoTest
[INFO] Running org.apache.sling.launchpad.webapp.integrationtest.userManager.UpdateUserTest
[INFO] Tests run: 12, Failures: 0, Errors: 0, Skipped: 0, Time elapsed: 1.653 s - in org.apache.sling.launchpad.webapp.integrationtest.userManager.UpdateUserTest
[INFO] Running org.apache.sling.launchpad.webapp.integrationtest.userManager.RemoveAuthorizablesTest
[INFO] Tests run: 11, Failures: 0, Errors: 0, Skipped: 0, Time elapsed: 1.288 s - in org.apache.sling.launchpad.webapp.integrationtest.userManager.RemoveAuthorizablesTest
[INFO] Running org.apache.sling.launchpad.webapp.integrationtest.EspLoadTest
[INFO] Tests run: 2, Failures: 0, Errors: 0, Skipped: 0, Time elapsed: 0.446 s - in org.apache.sling.launchpad.webapp.integrationtest.EspLoadTest
[INFO] Running org.apache.sling.launchpad.webapp.integrationtest.RequestAttributeTest
[INFO] Tests run: 1, Failures: 0, Errors: 0, Skipped: 0, Time elapsed: 0.274 s - in org.apache.sling.launchpad.webapp.integrationtest.RequestAttributeTest
[INFO] Running org.apache.sling.launchpad.webapp.integrationtest.WebdavUploadTest
[INFO] Tests run: 4, Failures: 0, Errors: 0, Skipped: 0, Time elapsed: 1.055 s - in org.apache.sling.launchpad.webapp.integrationtest.WebdavUploadTest
[INFO] Running org.apache.sling.launchpad.webapp.integrationtest.GetWithSuffixTest
[INFO] Tests run: 4, Failures: 0, Errors: 0, Skipped: 0, Time elapsed: 0.735 s - in org.apache.sling.launchpad.webapp.integrationtest.GetWithSuffixTest
[INFO] Running org.apache.sling.launchpad.webapp.integrationtest.EventsCounterTest
[INFO] Tests run: 1, Failures: 0, Errors: 0, Skipped: 0, Time elapsed: 0.06 s - in org.apache.sling.launchpad.webapp.integrationtest.EventsCounterTest
[INFO] Running org.apache.sling.launchpad.webapp.integrationtest.xml.SaxTest
[INFO] Tests run: 1, Failures: 0, Errors: 0, Skipped: 0, Time elapsed: 0 s - in org.apache.sling.launchpad.webapp.integrationtest.xml.SaxTest
[INFO] Running org.apache.sling.launchpad.webapp.integrationtest.xml.XPathTest
[INFO] Tests run: 1, Failures: 0, Errors: 0, Skipped: 0, Time elapsed: 0.035 s - in org.apache.sling.launchpad.webapp.integrationtest.xml.XPathTest
[INFO] Running org.apache.sling.launchpad.webapp.integrationtest.xml.DomTest
[INFO] Tests run: 1, Failures: 0, Errors: 0, Skipped: 0, Time elapsed: 0.001 s - in org.apache.sling.launchpad.webapp.integrationtest.xml.DomTest
[INFO] Running org.apache.sling.launchpad.webapp.integrationtest.ResourceDecoratorTest
[INFO] Tests run: 1, Failures: 0, Errors: 0, Skipped: 0, Time elapsed: 0.083 s - in org.apache.sling.launchpad.webapp.integrationtest.ResourceDecoratorTest
[INFO] Running org.apache.sling.launchpad.webapp.integrationtest.login.AnonymousAccessTest
[INFO] Tests run: 4, Failures: 0, Errors: 0, Skipped: 0, Time elapsed: 0.277 s - in org.apache.sling.launchpad.webapp.integrationtest.login.AnonymousAccessTest
[INFO] Running org.apache.sling.launchpad.webapp.integrationtest.login.RedirectOnLoginErrorTest
[INFO] Tests run: 2, Failures: 0, Errors: 0, Skipped: 0, Time elapsed: 0 s - in org.apache.sling.launchpad.webapp.integrationtest.login.RedirectOnLoginErrorTest
[INFO] Running org.apache.sling.launchpad.webapp.integrationtest.login.AuthRequestLoginTest
[INFO] Tests run: 1, Failures: 0, Errors: 0, Skipped: 0, Time elapsed: 0.069 s - in org.apache.sling.launchpad.webapp.integrationtest.login.AuthRequestLoginTest
[INFO] Running org.apache.sling.launchpad.webapp.integrationtest.login.RedirectOnLogoutTest
[INFO] Tests run: 1, Failures: 0, Errors: 0, Skipped: 0, Time elapsed: 0.047 s - in org.apache.sling.launchpad.webapp.integrationtest.login.RedirectOnLogoutTest
[INFO] Running org.apache.sling.launchpad.webapp.integrationtest.JspScriptingTest
[INFO] Tests run: 7, Failures: 0, Errors: 0, Skipped: 0, Time elapsed: 3.661 s - in org.apache.sling.launchpad.webapp.integrationtest.JspScriptingTest
[INFO] Running org.apache.sling.launchpad.webapp.integrationtest.jaxb.JaxbMarshallingTest
[INFO] Tests run: 1, Failures: 0, Errors: 0, Skipped: 0, Time elapsed: 0.29 s - in org.apache.sling.launchpad.webapp.integrationtest.jaxb.JaxbMarshallingTest
[INFO] Running org.apache.sling.launchpad.webapp.integrationtest.WebdavDeleteTest
[INFO] Tests run: 1, Failures: 0, Errors: 0, Skipped: 0, Time elapsed: 0.276 s - in org.apache.sling.launchpad.webapp.integrationtest.WebdavDeleteTest
[INFO] Running org.apache.sling.launchpad.webapp.integrationtest.ForwardTest
[INFO] Tests run: 5, Failures: 0, Errors: 0, Skipped: 0, Time elapsed: 3.957 s - in org.apache.sling.launchpad.webapp.integrationtest.ForwardTest
[INFO] Running org.apache.sling.launchpad.webapp.integrationtest.indexing.FullTextIndexingTest
[INFO] Tests run: 3, Failures: 0, Errors: 0, Skipped: 0, Time elapsed: 15.047 s - in org.apache.sling.launchpad.webapp.integrationtest.indexing.FullTextIndexingTest
[INFO] Running org.apache.sling.launchpad.webapp.integrationtest.GetStarTest
[INFO] Tests run: 2, Failures: 0, Errors: 0, Skipped: 0, Time elapsed: 0.088 s - in org.apache.sling.launchpad.webapp.integrationtest.GetStarTest
[INFO] Running org.apache.sling.launchpad.webapp.integrationtest.InitialContentTest
[INFO] Tests run: 5, Failures: 0, Errors: 0, Skipped: 0, Time elapsed: 0.036 s - in org.apache.sling.launchpad.webapp.integrationtest.InitialContentTest
[INFO] Running org.apache.sling.launchpad.webapp.integrationtest.JspIncludeTest
[INFO] Tests run: 9, Failures: 0, Errors: 0, Skipped: 0, Time elapsed: 10.924 s - in org.apache.sling.launchpad.webapp.integrationtest.JspIncludeTest
[INFO] Running org.apache.sling.launchpad.webapp.integrationtest.StreamServletTest
[INFO] Tests run: 4, Failures: 0, Errors: 0, Skipped: 0, Time elapsed: 0.357 s - in org.apache.sling.launchpad.webapp.integrationtest.StreamServletTest
[INFO] Running org.apache.sling.launchpad.webapp.integrationtest.ServletResolverConfigTest
[INFO] Tests run: 1, Failures: 0, Errors: 0, Skipped: 0, Time elapsed: 0.001 s - in org.apache.sling.launchpad.webapp.integrationtest.ServletResolverConfigTest
[INFO] Running org.apache.sling.launchpad.webapp.integrationtest.ContentLoaderMiscPropertyTest
[INFO] Tests run: 1, Failures: 0, Errors: 0, Skipped: 0, Time elapsed: 0.001 s - in org.apache.sling.launchpad.webapp.integrationtest.ContentLoaderMiscPropertyTest
[INFO] Running org.apache.sling.launchpad.webapp.integrationtest.ValueFromTest
[INFO] Tests run: 3, Failures: 0, Errors: 0, Skipped: 0, Time elapsed: 0.068 s - in org.apache.sling.launchpad.webapp.integrationtest.ValueFromTest
[INFO] Running org.apache.sling.launchpad.webapp.integrationtest.JspForwardTest
[INFO] Tests run: 6, Failures: 0, Errors: 0, Skipped: 0, Time elapsed: 2.237 s - in org.apache.sling.launchpad.webapp.integrationtest.JspForwardTest
[INFO] Running org.apache.sling.launchpad.webapp.integrationtest.WebDavDoubleSlashTest
[INFO] Tests run: 2, Failures: 0, Errors: 0, Skipped: 0, Time elapsed: 0.248 s - in org.apache.sling.launchpad.webapp.integrationtest.WebDavDoubleSlashTest
[INFO] Running org.apache.sling.launchpad.webapp.integrationtest.teleporter.LdapFilterTeleporterTest
[INFO] Tests run: 2, Failures: 0, Errors: 0, Skipped: 0, Time elapsed: 0.53 s - in org.apache.sling.launchpad.webapp.integrationtest.teleporter.LdapFilterTeleporterTest
[INFO] Running org.apache.sling.launchpad.webapp.integrationtest.teleporter.TeleportedResourcesFolderTest
[INFO] Tests run: 3, Failures: 0, Errors: 0, Skipped: 0, Time elapsed: 0.742 s - in org.apache.sling.launchpad.webapp.integrationtest.teleporter.TeleportedResourcesFolderTest
[INFO] Running org.apache.sling.launchpad.webapp.integrationtest.teleporter.BasicTeleporterTest
[INFO] Tests run: 2, Failures: 0, Errors: 0, Skipped: 0, Time elapsed: 0.558 s - in org.apache.sling.launchpad.webapp.integrationtest.teleporter.BasicTeleporterTest
[INFO] Running org.apache.sling.launchpad.webapp.integrationtest.teleporter.TeleportedResourcesSingleTest
[INFO] Tests run: 3, Failures: 0, Errors: 0, Skipped: 0, Time elapsed: 0.449 s - in org.apache.sling.launchpad.webapp.integrationtest.teleporter.TeleportedResourcesSingleTest
[INFO] Running org.apache.sling.launchpad.webapp.integrationtest.teleporter.TeleporterOptionsTest
[INFO] Tests run: 1, Failures: 0, Errors: 0, Skipped: 0, Time elapsed: 0 s - in org.apache.sling.launchpad.webapp.integrationtest.teleporter.TeleporterOptionsTest
[INFO] Running org.apache.sling.launchpad.webapp.integrationtest.teleporter.LocalServiceTeleporterTest
[INFO] Tests run: 1, Failures: 0, Errors: 0, Skipped: 0, Time elapsed: 0.372 s - in org.apache.sling.launchpad.webapp.integrationtest.teleporter.LocalServiceTeleporterTest
[INFO] Running org.apache.sling.launchpad.webapp.integrationtest.teleporter.ServicesPresentTest
[INFO] Tests run: 1, Failures: 0, Errors: 0, Skipped: 0, Time elapsed: 0.163 s - in org.apache.sling.launchpad.webapp.integrationtest.teleporter.ServicesPresentTest
[INFO] Running org.apache.sling.launchpad.webapp.integrationtest.teleporter.EmbeddedDependenciesTeleporterTest
[INFO] Tests run: 2, Failures: 0, Errors: 0, Skipped: 0, Time elapsed: 0.244 s - in org.apache.sling.launchpad.webapp.integrationtest.teleporter.EmbeddedDependenciesTeleporterTest
[INFO] Running org.apache.sling.launchpad.webapp.integrationtest.teleporter.MultipleRulesTeleporterTest
[INFO] Tests run: 2, Failures: 0, Errors: 0, Skipped: 0, Time elapsed: 0.337 s - in org.apache.sling.launchpad.webapp.integrationtest.teleporter.MultipleRulesTeleporterTest
[INFO] Running org.apache.sling.launchpad.webapp.integrationtest.JavascriptWrappersTest
[INFO] Tests run: 1, Failures: 0, Errors: 0, Skipped: 0, Time elapsed: 0.155 s - in org.apache.sling.launchpad.webapp.integrationtest.JavascriptWrappersTest
[INFO] Running org.apache.sling.launchpad.webapp.integrationtest.DavExDisabledAnonAccessTest
[INFO] Tests run: 2, Failures: 0, Errors: 0, Skipped: 0, Time elapsed: 1.284 s - in org.apache.sling.launchpad.webapp.integrationtest.DavExDisabledAnonAccessTest
[INFO] Running org.apache.sling.launchpad.webapp.integrationtest.PropertyRenderingTest
[INFO] Tests run: 10, Failures: 0, Errors: 0, Skipped: 0, Time elapsed: 0.348 s - in org.apache.sling.launchpad.webapp.integrationtest.PropertyRenderingTest
[INFO] Running org.apache.sling.launchpad.webapp.integrationtest.crud.CrudTest
[INFO] Tests run: 1, Failures: 0, Errors: 0, Skipped: 0, Time elapsed: 0.219 s - in org.apache.sling.launchpad.webapp.integrationtest.crud.CrudTest
[INFO] Running org.apache.sling.launchpad.webapp.integrationtest.WriteableResourcesProxyTest
[INFO] Tests run: 1, Failures: 0, Errors: 0, Skipped: 0, Time elapsed: 0.025 s - in org.apache.sling.launchpad.webapp.integrationtest.WriteableResourcesProxyTest
[INFO] Running org.apache.sling.launchpad.webapp.integrationtest.WebdavOptionsTest
[INFO] Tests run: 2, Failures: 0, Errors: 0, Skipped: 0, Time elapsed: 0.003 s - in org.apache.sling.launchpad.webapp.integrationtest.WebdavOptionsTest
[INFO] Running org.apache.sling.launchpad.webapp.integrationtest.MappingEventsProxyTest
[INFO] Tests run: 1, Failures: 0, Errors: 0, Skipped: 0, Time elapsed: 8.55 s - in org.apache.sling.launchpad.webapp.integrationtest.MappingEventsProxyTest
[INFO] Running org.apache.sling.launchpad.webapp.integrationtest.ScriptBuiltinObjectsTest
[INFO] Tests run: 1, Failures: 0, Errors: 0, Skipped: 0, Time elapsed: 0.105 s - in org.apache.sling.launchpad.webapp.integrationtest.ScriptBuiltinObjectsTest
[INFO] Running org.apache.sling.launchpad.webapp.integrationtest.VersionInfoServletTest
[ERROR] Tests run: 3, Failures: 1, Errors: 0, Skipped: 0, Time elapsed: 3.312 s <<< FAILURE! - in org.apache.sling.launchpad.webapp.integrationtest.VersionInfoServletTest
[ERROR] testStandardVersionsList(org.apache.sling.launchpad.webapp.integrationtest.VersionInfoServletTest) Time elapsed: 1.07 s <<< FAILURE!
junit.framework.AssertionFailedError: Expecting true baseVersion expected:<true> but was:<false>
at org.apache.sling.launchpad.webapp.integrationtest.VersionInfoServletTest.testStandardVersionsList(VersionInfoServletTest.java:77)
[INFO] Running org.apache.sling.launchpad.webapp.integrationtest.accessManager.RemoveAcesTest
[INFO] Tests run: 4, Failures: 0, Errors: 0, Skipped: 0, Time elapsed: 0.631 s - in org.apache.sling.launchpad.webapp.integrationtest.accessManager.RemoveAcesTest
[INFO] Running org.apache.sling.launchpad.webapp.integrationtest.accessManager.AccessPrivilegesInfoTest
[INFO] Tests run: 7, Failures: 0, Errors: 0, Skipped: 0, Time elapsed: 1.769 s - in org.apache.sling.launchpad.webapp.integrationtest.accessManager.AccessPrivilegesInfoTest
[INFO] Running org.apache.sling.launchpad.webapp.integrationtest.accessManager.ModifyAceTest
[INFO] Tests run: 16, Failures: 0, Errors: 0, Skipped: 0, Time elapsed: 2.352 s - in org.apache.sling.launchpad.webapp.integrationtest.accessManager.ModifyAceTest
[INFO] Running org.apache.sling.launchpad.webapp.integrationtest.accessManager.GetAclTest
[INFO] Tests run: 7, Failures: 0, Errors: 0, Skipped: 0, Time elapsed: 1.144 s - in org.apache.sling.launchpad.webapp.integrationtest.accessManager.GetAclTest
[INFO] Running org.apache.sling.launchpad.webapp.integrationtest.resourceresolver.ResourceResolverGeneralTest
[INFO] Tests run: 62, Failures: 0, Errors: 0, Skipped: 0, Time elapsed: 41.153 s - in org.apache.sling.launchpad.webapp.integrationtest.resourceresolver.ResourceResolverGeneralTest
[INFO] Running org.apache.sling.launchpad.webapp.integrationtest.resourceresolver.ResourceResolverApiTest
[INFO] Tests run: 8, Failures: 0, Errors: 0, Skipped: 0, Time elapsed: 1.315 s - in org.apache.sling.launchpad.webapp.integrationtest.resourceresolver.ResourceResolverApiTest
[INFO] Running org.apache.sling.launchpad.webapp.integrationtest.ExportedPackagesTest
[INFO] Tests run: 3, Failures: 0, Errors: 0, Skipped: 0, Time elapsed: 0.014 s - in org.apache.sling.launchpad.webapp.integrationtest.ExportedPackagesTest
[INFO] Running org.apache.sling.launchpad.webapp.integrationtest.VanityPathTest
[INFO] Tests run: 5, Failures: 0, Errors: 0, Skipped: 0, Time elapsed: 0.214 s - in org.apache.sling.launchpad.webapp.integrationtest.VanityPathTest
[INFO] Running org.apache.sling.launchpad.webapp.integrationtest.scripting.htl.HtlTest
[INFO] Tests run: 3, Failures: 0, Errors: 0, Skipped: 0, Time elapsed: 1.408 s - in org.apache.sling.launchpad.webapp.integrationtest.scripting.htl.HtlTest
[INFO] Running org.apache.sling.launchpad.webapp.integrationtest.scripting.StandaloneScriptExecutionTest
[INFO] Tests run: 1, Failures: 0, Errors: 0, Skipped: 0, Time elapsed: 0.068 s - in org.apache.sling.launchpad.webapp.integrationtest.scripting.StandaloneScriptExecutionTest
[INFO] Running org.apache.sling.launchpad.webapp.integrationtest.scripting.SlingJSPTaglibTest
System property [org.owasp.esapi.opsteam] is not set
System property [org.owasp.esapi.devteam] is not set
Attempting to load ESAPI.properties via file I/O.
Attempting to load ESAPI.properties as resource file via file I/O.
Not found in 'org.owasp.esapi.resources' directory or file not readable: <https://builds.apache.org/job/sling-org-apache-sling-launchpad-testing-10/ws/target/_-41000/ESAPI.properties>
Not found in SystemResource Directory/resourceDirectory: .esapi/ESAPI.properties
Not found in 'user.home' (/home/jenkins) directory: /home/jenkins/esapi/ESAPI.properties
Loading ESAPI.properties via file I/O failed. Exception was: java.io.FileNotFoundException
Attempting to load ESAPI.properties via the classpath.
SUCCESSFULLY LOADED ESAPI.properties via the CLASSPATH from '/ (root)' using class loader for DefaultSecurityConfiguration class!
SecurityConfiguration for Validator.ConfigurationFile.MultiValued not found in ESAPI.properties. Using default: false
Attempting to load validation.properties via file I/O.
Attempting to load validation.properties as resource file via file I/O.
Not found in 'org.owasp.esapi.resources' directory or file not readable: <https://builds.apache.org/job/sling-org-apache-sling-launchpad-testing-10/ws/target/_-41000/validation.properties>
Not found in SystemResource Directory/resourceDirectory: .esapi/validation.properties
Not found in 'user.home' (/home/jenkins) directory: /home/jenkins/esapi/validation.properties
Loading validation.properties via file I/O failed.
Attempting to load validation.properties via the classpath.
SUCCESSFULLY LOADED validation.properties via the CLASSPATH from '/ (root)' using class loader for DefaultSecurityConfiguration class!
[INFO] Tests run: 1, Failures: 0, Errors: 0, Skipped: 0, Time elapsed: 1.152 s - in org.apache.sling.launchpad.webapp.integrationtest.scripting.SlingJSPTaglibTest
[INFO] Running org.apache.sling.launchpad.webapp.integrationtest.IncludeTest
[INFO] Tests run: 5, Failures: 0, Errors: 0, Skipped: 0, Time elapsed: 2.085 s - in org.apache.sling.launchpad.webapp.integrationtest.IncludeTest
[INFO] Running org.apache.sling.launchpad.webapp.integrationtest.DavExIntegrationTest
[INFO] Tests run: 2, Failures: 0, Errors: 0, Skipped: 0, Time elapsed: 0.203 s - in org.apache.sling.launchpad.webapp.integrationtest.DavExIntegrationTest
[INFO] Running org.apache.sling.launchpad.webapp.integrationtest.auth.AuthenticationResponseCodeTest
[INFO] Tests run: 10, Failures: 0, Errors: 0, Skipped: 0, Time elapsed: 0.044 s - in org.apache.sling.launchpad.webapp.integrationtest.auth.AuthenticationResponseCodeTest
[INFO] Running org.apache.sling.launchpad.webapp.integrationtest.NodetypeRenderingTest
[INFO] Tests run: 7, Failures: 0, Errors: 0, Skipped: 0, Time elapsed: 0.587 s - in org.apache.sling.launchpad.webapp.integrationtest.NodetypeRenderingTest
[INFO] Running org.apache.sling.launchpad.webapp.integrationtest.GeneratedNodeNameTest
[INFO] Tests run: 6, Failures: 0, Errors: 0, Skipped: 0, Time elapsed: 0.187 s - in org.apache.sling.launchpad.webapp.integrationtest.GeneratedNodeNameTest
[INFO] Running org.apache.sling.launchpad.webapp.integrationtest.HttpPingTest
[INFO] Tests run: 2, Failures: 0, Errors: 0, Skipped: 0, Time elapsed: 0.002 s - in org.apache.sling.launchpad.webapp.integrationtest.HttpPingTest
[INFO] Running org.apache.sling.launchpad.webapp.integrationtest.ImmediateScriptActivationTest
[INFO] Tests run: 2, Failures: 0, Errors: 0, Skipped: 0, Time elapsed: 1.642 s - in org.apache.sling.launchpad.webapp.integrationtest.ImmediateScriptActivationTest
[INFO] Running org.apache.sling.launchpad.webapp.integrationtest.RangeStreamingTest
[INFO] Tests run: 4, Failures: 0, Errors: 0, Skipped: 0, Time elapsed: 0.334 s - in org.apache.sling.launchpad.webapp.integrationtest.RangeStreamingTest
[INFO] Running org.apache.sling.launchpad.webapp.integrationtest.StaticContentTest
[INFO] Tests run: 2, Failures: 0, Errors: 0, Skipped: 0, Time elapsed: 0.006 s - in org.apache.sling.launchpad.webapp.integrationtest.StaticContentTest
[INFO] Running org.apache.sling.launchpad.webapp.integrationtest.ResourceSuperTypeTest
[INFO] Tests run: 2, Failures: 0, Errors: 0, Skipped: 0, Time elapsed: 0.421 s - in org.apache.sling.launchpad.webapp.integrationtest.ResourceSuperTypeTest
[INFO] Running org.apache.sling.launchpad.webapp.integrationtest.FileUploadTest
[INFO] Tests run: 1, Failures: 0, Errors: 0, Skipped: 0, Time elapsed: 0.028 s - in org.apache.sling.launchpad.webapp.integrationtest.FileUploadTest
[INFO] Running org.apache.sling.launchpad.webapp.integrationtest.SlingWebDavServletTest
[INFO] Tests run: 2, Failures: 0, Errors: 0, Skipped: 0, Time elapsed: 0.16 s - in org.apache.sling.launchpad.webapp.integrationtest.SlingWebDavServletTest
[INFO] Running org.apache.sling.launchpad.webapp.integrationtest.SlingResourceTypeRenderingTest
[INFO] Tests run: 9, Failures: 0, Errors: 0, Skipped: 0, Time elapsed: 1.066 s - in org.apache.sling.launchpad.webapp.integrationtest.SlingResourceTypeRenderingTest
[INFO] Running org.apache.sling.launchpad.webapp.integrationtest.runmodes.InactiveRunModeTest
[INFO] Tests run: 2, Failures: 0, Errors: 0, Skipped: 0, Time elapsed: 0.011 s - in org.apache.sling.launchpad.webapp.integrationtest.runmodes.InactiveRunModeTest
[INFO]
[INFO] Results:
[INFO]
[ERROR] Failures:
[ERROR] VersionInfoServletTest.testStandardVersionsList:77 Expecting true baseVersion expected:<true> but was:<false>
[INFO]
[ERROR] Tests run: 655, Failures: 1, Errors: 0, Skipped: 1
[INFO]
[JENKINS] Recording test results
WARNING: An illegal reflective access operation has occurred
WARNING: Illegal reflective access by org.dom4j.io.SAXContentHandler to method com.sun.org.apache.xerces.internal.parsers.AbstractSAXParser$LocatorProxy.getEncoding()
WARNING: Please consider reporting this to the maintainers of org.dom4j.io.SAXContentHandler
WARNING: Use --illegal-access=warn to enable warnings of further illegal reflective access operations
WARNING: All illegal access operations will be denied in a future release
[WARNING] Attempt to (de-)serialize anonymous class hudson.maven.reporters.SurefireArchiver$2; see: https://jenkins.io/redirect/serialization-of-anonymous-classes/
[INFO]
[INFO] --- slingstart-maven-plugin:1.7.16:stop (stop-container) @ org.apache.sling.launchpad.testing ---
[INFO] Stopping 1 Launchpad instances
[INFO] Stopping Launchpad '_-41000'
19.09.2018 17:00:03.770 *INFO * [Apache Sling Terminator] Java VM is shutting down
19.09.2018 17:00:03.770 *INFO * [Apache Sling Terminator] Stopping Apache Sling
19.09.2018 17:00:05.649 *INFO * [Sling Notifier] Apache Sling has been stopped
[INFO]
[INFO] --- ianal-maven-plugin:1.0-alpha-1:verify-legal-files (default) @ org.apache.sling.launchpad.testing ---
[INFO] Checking legal files in: org.apache.sling.launchpad.testing-11-SNAPSHOT.jar
[INFO] Checking legal files in: org.apache.sling.launchpad.testing-11-SNAPSHOT-sources.jar
[INFO]
[INFO] --- apache-rat-plugin:0.11:check (default) @ org.apache.sling.launchpad.testing ---
[INFO] 51 implicit excludes (use -debug for more details).
[INFO] Exclude: DEPENDENCIES
[INFO] Exclude: src/main/appended-resources/META-INF/*
[INFO] Exclude: velocity.log
[INFO] Exclude: target/*
[INFO] Exclude: README.md
[INFO] Exclude: maven-eclipse.xml
[INFO] Exclude: .*
[INFO] Exclude: .*/**
[INFO] Exclude: **/*.json
[INFO] Exclude: DEPENDENCIES
[INFO] Exclude: **/*.rej
[INFO] Exclude: hs_err_*.log
[INFO] Exclude: **/repository/index/*/index-details.txt
[INFO] Exclude: bnd.bnd
[INFO] 6 resources included (use -debug for more details)
[INFO] Rat check: Summary of files. Unapproved: 2 unknown: 2 generated: 0 approved: 3 licence.
[WARNING] Attempt to (de-)serialize anonymous class hudson.maven.reporters.MavenArtifactArchiver$2; see: https://jenkins.io/redirect/serialization-of-anonymous-classes/
[JENKINS] Archiving disabled
[WARNING] Attempt to (de-)serialize anonymous class hudson.maven.reporters.MavenFingerprinter$1; see: https://jenkins.io/redirect/serialization-of-anonymous-classes/
[JENKINS] Archiving disabled
[INFO] ------------------------------------------------------------------------
[INFO] BUILD FAILURE
[INFO] ------------------------------------------------------------------------
[INFO] Total time: 07:00 min
[INFO] Finished at: 2018-09-19T17:00:16+00:00
[INFO] Final Memory: 52M/4096M
[INFO] ------------------------------------------------------------------------
Waiting for Jenkins to finish collecting data
[ERROR] Failed to execute goal org.apache.rat:apache-rat-plugin:0.11:check (default) on project org.apache.sling.launchpad.testing: Too many files with unapproved license: 2 See RAT report in: <https://builds.apache.org/job/sling-org-apache-sling-launchpad-testing-10/ws/target/rat.txt> -> [Help 1]
[ERROR]
[ERROR] To see the full stack trace of the errors, re-run Maven with the -e switch.
[ERROR] Re-run Maven using the -X switch to enable full debug logging.
[ERROR]
[ERROR] For more information about the errors and possible solutions, please read the following articles:
[ERROR] [Help 1] http://cwiki.apache.org/confluence/display/MAVEN/MojoFailureException
channel stopped
Archiving artifacts
Recording test results
Build failed in Jenkins:
sling-org-apache-sling-launchpad-testing-10 #172
Posted by Apache Jenkins Server <je...@builds.apache.org>.
See <https://builds.apache.org/job/sling-org-apache-sling-launchpad-testing-10/172/display/redirect?page=changes>
Changes:
[radu] SLING-7216 - [nice-to-have] Add a CODE_OF_CONDUCT file to every module
------------------------------------------
[...truncated 67.02 KB...]
[INFO] Tests run: 1, Failures: 0, Errors: 0, Skipped: 0, Time elapsed: 1.136 s - in org.apache.sling.launchpad.webapp.integrationtest.VersionParameterTest
[INFO] Running org.apache.sling.launchpad.webapp.integrationtest.RedirectTest
[INFO] Tests run: 6, Failures: 0, Errors: 0, Skipped: 0, Time elapsed: 0.17 s - in org.apache.sling.launchpad.webapp.integrationtest.RedirectTest
[INFO] Running org.apache.sling.launchpad.webapp.integrationtest.NodeTypeBasedRenderingTest
[INFO] Tests run: 7, Failures: 0, Errors: 0, Skipped: 0, Time elapsed: 1.106 s - in org.apache.sling.launchpad.webapp.integrationtest.NodeTypeBasedRenderingTest
[INFO] Running org.apache.sling.launchpad.webapp.integrationtest.ScriptBindingsValuesProviderTest
[INFO] Tests run: 3, Failures: 0, Errors: 0, Skipped: 0, Time elapsed: 0.566 s - in org.apache.sling.launchpad.webapp.integrationtest.ScriptBindingsValuesProviderTest
[INFO] Running org.apache.sling.launchpad.webapp.integrationtest.userManager.CreateGroupTest
[INFO] Tests run: 8, Failures: 0, Errors: 0, Skipped: 0, Time elapsed: 0.378 s - in org.apache.sling.launchpad.webapp.integrationtest.userManager.CreateGroupTest
[INFO] Running org.apache.sling.launchpad.webapp.integrationtest.userManager.UpdateGroupTest
[INFO] Tests run: 8, Failures: 0, Errors: 0, Skipped: 0, Time elapsed: 1.129 s - in org.apache.sling.launchpad.webapp.integrationtest.userManager.UpdateGroupTest
[INFO] Running org.apache.sling.launchpad.webapp.integrationtest.userManager.CreateUserTest
[INFO] Tests run: 11, Failures: 0, Errors: 0, Skipped: 0, Time elapsed: 0.386 s - in org.apache.sling.launchpad.webapp.integrationtest.userManager.CreateUserTest
[INFO] Running org.apache.sling.launchpad.webapp.integrationtest.userManager.UserPrivilegesInfoTest
[INFO] Tests run: 7, Failures: 0, Errors: 0, Skipped: 0, Time elapsed: 1.84 s - in org.apache.sling.launchpad.webapp.integrationtest.userManager.UserPrivilegesInfoTest
[INFO] Running org.apache.sling.launchpad.webapp.integrationtest.userManager.UpdateUserTest
[INFO] Tests run: 12, Failures: 0, Errors: 0, Skipped: 0, Time elapsed: 0.807 s - in org.apache.sling.launchpad.webapp.integrationtest.userManager.UpdateUserTest
[INFO] Running org.apache.sling.launchpad.webapp.integrationtest.userManager.RemoveAuthorizablesTest
[INFO] Tests run: 11, Failures: 0, Errors: 0, Skipped: 0, Time elapsed: 0.822 s - in org.apache.sling.launchpad.webapp.integrationtest.userManager.RemoveAuthorizablesTest
[INFO] Running org.apache.sling.launchpad.webapp.integrationtest.EspLoadTest
[INFO] Tests run: 2, Failures: 0, Errors: 0, Skipped: 0, Time elapsed: 0.291 s - in org.apache.sling.launchpad.webapp.integrationtest.EspLoadTest
[INFO] Running org.apache.sling.launchpad.webapp.integrationtest.RequestAttributeTest
[INFO] Tests run: 1, Failures: 0, Errors: 0, Skipped: 0, Time elapsed: 0.17 s - in org.apache.sling.launchpad.webapp.integrationtest.RequestAttributeTest
[INFO] Running org.apache.sling.launchpad.webapp.integrationtest.WebdavUploadTest
[INFO] Tests run: 4, Failures: 0, Errors: 0, Skipped: 0, Time elapsed: 0.306 s - in org.apache.sling.launchpad.webapp.integrationtest.WebdavUploadTest
[INFO] Running org.apache.sling.launchpad.webapp.integrationtest.GetWithSuffixTest
[INFO] Tests run: 4, Failures: 0, Errors: 0, Skipped: 0, Time elapsed: 0.346 s - in org.apache.sling.launchpad.webapp.integrationtest.GetWithSuffixTest
[INFO] Running org.apache.sling.launchpad.webapp.integrationtest.EventsCounterTest
[INFO] Tests run: 1, Failures: 0, Errors: 0, Skipped: 0, Time elapsed: 0.026 s - in org.apache.sling.launchpad.webapp.integrationtest.EventsCounterTest
[INFO] Running org.apache.sling.launchpad.webapp.integrationtest.xml.SaxTest
[INFO] Tests run: 1, Failures: 0, Errors: 0, Skipped: 0, Time elapsed: 0 s - in org.apache.sling.launchpad.webapp.integrationtest.xml.SaxTest
[INFO] Running org.apache.sling.launchpad.webapp.integrationtest.xml.XPathTest
[INFO] Tests run: 1, Failures: 0, Errors: 0, Skipped: 0, Time elapsed: 0.106 s - in org.apache.sling.launchpad.webapp.integrationtest.xml.XPathTest
[INFO] Running org.apache.sling.launchpad.webapp.integrationtest.xml.DomTest
[INFO] Tests run: 1, Failures: 0, Errors: 0, Skipped: 0, Time elapsed: 0 s - in org.apache.sling.launchpad.webapp.integrationtest.xml.DomTest
[INFO] Running org.apache.sling.launchpad.webapp.integrationtest.ResourceDecoratorTest
[INFO] Tests run: 1, Failures: 0, Errors: 0, Skipped: 0, Time elapsed: 0.035 s - in org.apache.sling.launchpad.webapp.integrationtest.ResourceDecoratorTest
[INFO] Running org.apache.sling.launchpad.webapp.integrationtest.login.AnonymousAccessTest
[INFO] Tests run: 4, Failures: 0, Errors: 0, Skipped: 0, Time elapsed: 0.102 s - in org.apache.sling.launchpad.webapp.integrationtest.login.AnonymousAccessTest
[INFO] Running org.apache.sling.launchpad.webapp.integrationtest.login.RedirectOnLoginErrorTest
[INFO] Tests run: 2, Failures: 0, Errors: 0, Skipped: 0, Time elapsed: 0 s - in org.apache.sling.launchpad.webapp.integrationtest.login.RedirectOnLoginErrorTest
[INFO] Running org.apache.sling.launchpad.webapp.integrationtest.login.AuthRequestLoginTest
[INFO] Tests run: 1, Failures: 0, Errors: 0, Skipped: 0, Time elapsed: 0.023 s - in org.apache.sling.launchpad.webapp.integrationtest.login.AuthRequestLoginTest
[INFO] Running org.apache.sling.launchpad.webapp.integrationtest.login.RedirectOnLogoutTest
[INFO] Tests run: 1, Failures: 0, Errors: 0, Skipped: 0, Time elapsed: 0.008 s - in org.apache.sling.launchpad.webapp.integrationtest.login.RedirectOnLogoutTest
[INFO] Running org.apache.sling.launchpad.webapp.integrationtest.JspScriptingTest
[INFO] Tests run: 7, Failures: 0, Errors: 0, Skipped: 0, Time elapsed: 1.603 s - in org.apache.sling.launchpad.webapp.integrationtest.JspScriptingTest
[INFO] Running org.apache.sling.launchpad.webapp.integrationtest.jaxb.JaxbMarshallingTest
[INFO] Tests run: 1, Failures: 0, Errors: 0, Skipped: 0, Time elapsed: 0.249 s - in org.apache.sling.launchpad.webapp.integrationtest.jaxb.JaxbMarshallingTest
[INFO] Running org.apache.sling.launchpad.webapp.integrationtest.WebdavDeleteTest
[INFO] Tests run: 1, Failures: 0, Errors: 0, Skipped: 0, Time elapsed: 0.125 s - in org.apache.sling.launchpad.webapp.integrationtest.WebdavDeleteTest
[INFO] Running org.apache.sling.launchpad.webapp.integrationtest.ForwardTest
[INFO] Tests run: 5, Failures: 0, Errors: 0, Skipped: 0, Time elapsed: 1.819 s - in org.apache.sling.launchpad.webapp.integrationtest.ForwardTest
[INFO] Running org.apache.sling.launchpad.webapp.integrationtest.indexing.FullTextIndexingTest
[INFO] Tests run: 3, Failures: 0, Errors: 0, Skipped: 0, Time elapsed: 12.065 s - in org.apache.sling.launchpad.webapp.integrationtest.indexing.FullTextIndexingTest
[INFO] Running org.apache.sling.launchpad.webapp.integrationtest.GetStarTest
[INFO] Tests run: 2, Failures: 0, Errors: 0, Skipped: 0, Time elapsed: 0.044 s - in org.apache.sling.launchpad.webapp.integrationtest.GetStarTest
[INFO] Running org.apache.sling.launchpad.webapp.integrationtest.InitialContentTest
[INFO] Tests run: 5, Failures: 0, Errors: 0, Skipped: 0, Time elapsed: 0.016 s - in org.apache.sling.launchpad.webapp.integrationtest.InitialContentTest
[INFO] Running org.apache.sling.launchpad.webapp.integrationtest.JspIncludeTest
[INFO] Tests run: 9, Failures: 0, Errors: 0, Skipped: 0, Time elapsed: 6.713 s - in org.apache.sling.launchpad.webapp.integrationtest.JspIncludeTest
[INFO] Running org.apache.sling.launchpad.webapp.integrationtest.StreamServletTest
[INFO] Tests run: 4, Failures: 0, Errors: 0, Skipped: 0, Time elapsed: 0.316 s - in org.apache.sling.launchpad.webapp.integrationtest.StreamServletTest
[INFO] Running org.apache.sling.launchpad.webapp.integrationtest.ServletResolverConfigTest
[INFO] Tests run: 1, Failures: 0, Errors: 0, Skipped: 0, Time elapsed: 0.001 s - in org.apache.sling.launchpad.webapp.integrationtest.ServletResolverConfigTest
[INFO] Running org.apache.sling.launchpad.webapp.integrationtest.ContentLoaderMiscPropertyTest
[INFO] Tests run: 1, Failures: 0, Errors: 0, Skipped: 0, Time elapsed: 0 s - in org.apache.sling.launchpad.webapp.integrationtest.ContentLoaderMiscPropertyTest
[INFO] Running org.apache.sling.launchpad.webapp.integrationtest.ValueFromTest
[INFO] Tests run: 3, Failures: 0, Errors: 0, Skipped: 0, Time elapsed: 0.035 s - in org.apache.sling.launchpad.webapp.integrationtest.ValueFromTest
[INFO] Running org.apache.sling.launchpad.webapp.integrationtest.JspForwardTest
[INFO] Tests run: 6, Failures: 0, Errors: 0, Skipped: 0, Time elapsed: 2.189 s - in org.apache.sling.launchpad.webapp.integrationtest.JspForwardTest
[INFO] Running org.apache.sling.launchpad.webapp.integrationtest.WebDavDoubleSlashTest
[INFO] Tests run: 2, Failures: 0, Errors: 0, Skipped: 0, Time elapsed: 0.272 s - in org.apache.sling.launchpad.webapp.integrationtest.WebDavDoubleSlashTest
[INFO] Running org.apache.sling.launchpad.webapp.integrationtest.teleporter.LdapFilterTeleporterTest
[INFO] Tests run: 2, Failures: 0, Errors: 0, Skipped: 0, Time elapsed: 0.357 s - in org.apache.sling.launchpad.webapp.integrationtest.teleporter.LdapFilterTeleporterTest
[INFO] Running org.apache.sling.launchpad.webapp.integrationtest.teleporter.TeleportedResourcesFolderTest
[INFO] Tests run: 3, Failures: 0, Errors: 0, Skipped: 0, Time elapsed: 0.842 s - in org.apache.sling.launchpad.webapp.integrationtest.teleporter.TeleportedResourcesFolderTest
[INFO] Running org.apache.sling.launchpad.webapp.integrationtest.teleporter.BasicTeleporterTest
[INFO] Tests run: 2, Failures: 0, Errors: 0, Skipped: 0, Time elapsed: 0.326 s - in org.apache.sling.launchpad.webapp.integrationtest.teleporter.BasicTeleporterTest
[INFO] Running org.apache.sling.launchpad.webapp.integrationtest.teleporter.TeleportedResourcesSingleTest
[INFO] Tests run: 3, Failures: 0, Errors: 0, Skipped: 0, Time elapsed: 0.385 s - in org.apache.sling.launchpad.webapp.integrationtest.teleporter.TeleportedResourcesSingleTest
[INFO] Running org.apache.sling.launchpad.webapp.integrationtest.teleporter.TeleporterOptionsTest
[INFO] Tests run: 1, Failures: 0, Errors: 0, Skipped: 0, Time elapsed: 0 s - in org.apache.sling.launchpad.webapp.integrationtest.teleporter.TeleporterOptionsTest
[INFO] Running org.apache.sling.launchpad.webapp.integrationtest.teleporter.LocalServiceTeleporterTest
[INFO] Tests run: 1, Failures: 0, Errors: 0, Skipped: 0, Time elapsed: 0.201 s - in org.apache.sling.launchpad.webapp.integrationtest.teleporter.LocalServiceTeleporterTest
[INFO] Running org.apache.sling.launchpad.webapp.integrationtest.teleporter.ServicesPresentTest
[INFO] Tests run: 1, Failures: 0, Errors: 0, Skipped: 0, Time elapsed: 0.158 s - in org.apache.sling.launchpad.webapp.integrationtest.teleporter.ServicesPresentTest
[INFO] Running org.apache.sling.launchpad.webapp.integrationtest.teleporter.EmbeddedDependenciesTeleporterTest
[INFO] Tests run: 2, Failures: 0, Errors: 0, Skipped: 0, Time elapsed: 0.31 s - in org.apache.sling.launchpad.webapp.integrationtest.teleporter.EmbeddedDependenciesTeleporterTest
[INFO] Running org.apache.sling.launchpad.webapp.integrationtest.teleporter.MultipleRulesTeleporterTest
[INFO] Tests run: 2, Failures: 0, Errors: 0, Skipped: 0, Time elapsed: 0.308 s - in org.apache.sling.launchpad.webapp.integrationtest.teleporter.MultipleRulesTeleporterTest
[INFO] Running org.apache.sling.launchpad.webapp.integrationtest.JavascriptWrappersTest
[INFO] Tests run: 1, Failures: 0, Errors: 0, Skipped: 0, Time elapsed: 0.142 s - in org.apache.sling.launchpad.webapp.integrationtest.JavascriptWrappersTest
[INFO] Running org.apache.sling.launchpad.webapp.integrationtest.DavExDisabledAnonAccessTest
[INFO] Tests run: 2, Failures: 0, Errors: 0, Skipped: 0, Time elapsed: 1.229 s - in org.apache.sling.launchpad.webapp.integrationtest.DavExDisabledAnonAccessTest
[INFO] Running org.apache.sling.launchpad.webapp.integrationtest.PropertyRenderingTest
[INFO] Tests run: 10, Failures: 0, Errors: 0, Skipped: 0, Time elapsed: 0.409 s - in org.apache.sling.launchpad.webapp.integrationtest.PropertyRenderingTest
[INFO] Running org.apache.sling.launchpad.webapp.integrationtest.crud.CrudTest
[INFO] Tests run: 1, Failures: 0, Errors: 0, Skipped: 0, Time elapsed: 0.299 s - in org.apache.sling.launchpad.webapp.integrationtest.crud.CrudTest
[INFO] Running org.apache.sling.launchpad.webapp.integrationtest.WriteableResourcesProxyTest
[INFO] Tests run: 1, Failures: 0, Errors: 0, Skipped: 0, Time elapsed: 0.047 s - in org.apache.sling.launchpad.webapp.integrationtest.WriteableResourcesProxyTest
[INFO] Running org.apache.sling.launchpad.webapp.integrationtest.WebdavOptionsTest
[INFO] Tests run: 2, Failures: 0, Errors: 0, Skipped: 0, Time elapsed: 0.001 s - in org.apache.sling.launchpad.webapp.integrationtest.WebdavOptionsTest
[INFO] Running org.apache.sling.launchpad.webapp.integrationtest.MappingEventsProxyTest
[INFO] Tests run: 1, Failures: 0, Errors: 0, Skipped: 0, Time elapsed: 8.566 s - in org.apache.sling.launchpad.webapp.integrationtest.MappingEventsProxyTest
[INFO] Running org.apache.sling.launchpad.webapp.integrationtest.ScriptBuiltinObjectsTest
[INFO] Tests run: 1, Failures: 0, Errors: 0, Skipped: 0, Time elapsed: 0.089 s - in org.apache.sling.launchpad.webapp.integrationtest.ScriptBuiltinObjectsTest
[INFO] Running org.apache.sling.launchpad.webapp.integrationtest.VersionInfoServletTest
[ERROR] Tests run: 3, Failures: 1, Errors: 0, Skipped: 0, Time elapsed: 3.309 s <<< FAILURE! - in org.apache.sling.launchpad.webapp.integrationtest.VersionInfoServletTest
[ERROR] testStandardVersionsList(org.apache.sling.launchpad.webapp.integrationtest.VersionInfoServletTest) Time elapsed: 1.097 s <<< FAILURE!
junit.framework.AssertionFailedError: Expecting true baseVersion expected:<true> but was:<false>
at org.apache.sling.launchpad.webapp.integrationtest.VersionInfoServletTest.testStandardVersionsList(VersionInfoServletTest.java:77)
[INFO] Running org.apache.sling.launchpad.webapp.integrationtest.accessManager.RemoveAcesTest
[INFO] Tests run: 4, Failures: 0, Errors: 0, Skipped: 0, Time elapsed: 0.599 s - in org.apache.sling.launchpad.webapp.integrationtest.accessManager.RemoveAcesTest
[INFO] Running org.apache.sling.launchpad.webapp.integrationtest.accessManager.AccessPrivilegesInfoTest
[INFO] Tests run: 7, Failures: 0, Errors: 0, Skipped: 0, Time elapsed: 1.76 s - in org.apache.sling.launchpad.webapp.integrationtest.accessManager.AccessPrivilegesInfoTest
[INFO] Running org.apache.sling.launchpad.webapp.integrationtest.accessManager.ModifyAceTest
[INFO] Tests run: 16, Failures: 0, Errors: 0, Skipped: 0, Time elapsed: 2.241 s - in org.apache.sling.launchpad.webapp.integrationtest.accessManager.ModifyAceTest
[INFO] Running org.apache.sling.launchpad.webapp.integrationtest.accessManager.GetAclTest
[INFO] Tests run: 7, Failures: 0, Errors: 0, Skipped: 0, Time elapsed: 1.054 s - in org.apache.sling.launchpad.webapp.integrationtest.accessManager.GetAclTest
[INFO] Running org.apache.sling.launchpad.webapp.integrationtest.resourceresolver.ResourceResolverGeneralTest
[INFO] Tests run: 62, Failures: 0, Errors: 0, Skipped: 0, Time elapsed: 39.93 s - in org.apache.sling.launchpad.webapp.integrationtest.resourceresolver.ResourceResolverGeneralTest
[INFO] Running org.apache.sling.launchpad.webapp.integrationtest.resourceresolver.ResourceResolverApiTest
[INFO] Tests run: 8, Failures: 0, Errors: 0, Skipped: 0, Time elapsed: 1.241 s - in org.apache.sling.launchpad.webapp.integrationtest.resourceresolver.ResourceResolverApiTest
[INFO] Running org.apache.sling.launchpad.webapp.integrationtest.ExportedPackagesTest
[INFO] Tests run: 3, Failures: 0, Errors: 0, Skipped: 0, Time elapsed: 0.007 s - in org.apache.sling.launchpad.webapp.integrationtest.ExportedPackagesTest
[INFO] Running org.apache.sling.launchpad.webapp.integrationtest.VanityPathTest
[INFO] Tests run: 5, Failures: 0, Errors: 0, Skipped: 0, Time elapsed: 0.233 s - in org.apache.sling.launchpad.webapp.integrationtest.VanityPathTest
[INFO] Running org.apache.sling.launchpad.webapp.integrationtest.scripting.htl.HtlTest
[INFO] Tests run: 3, Failures: 0, Errors: 0, Skipped: 0, Time elapsed: 1.351 s - in org.apache.sling.launchpad.webapp.integrationtest.scripting.htl.HtlTest
[INFO] Running org.apache.sling.launchpad.webapp.integrationtest.scripting.StandaloneScriptExecutionTest
[INFO] Tests run: 1, Failures: 0, Errors: 0, Skipped: 0, Time elapsed: 0.08 s - in org.apache.sling.launchpad.webapp.integrationtest.scripting.StandaloneScriptExecutionTest
[INFO] Running org.apache.sling.launchpad.webapp.integrationtest.scripting.SlingJSPTaglibTest
System property [org.owasp.esapi.opsteam] is not set
System property [org.owasp.esapi.devteam] is not set
Attempting to load ESAPI.properties via file I/O.
Attempting to load ESAPI.properties as resource file via file I/O.
Not found in 'org.owasp.esapi.resources' directory or file not readable: <https://builds.apache.org/job/sling-org-apache-sling-launchpad-testing-10/ws/target/_-41000/ESAPI.properties>
Not found in SystemResource Directory/resourceDirectory: .esapi/ESAPI.properties
Not found in 'user.home' (/home/jenkins) directory: /home/jenkins/esapi/ESAPI.properties
Loading ESAPI.properties via file I/O failed. Exception was: java.io.FileNotFoundException
Attempting to load ESAPI.properties via the classpath.
SUCCESSFULLY LOADED ESAPI.properties via the CLASSPATH from '/ (root)' using class loader for DefaultSecurityConfiguration class!
SecurityConfiguration for Validator.ConfigurationFile.MultiValued not found in ESAPI.properties. Using default: false
Attempting to load validation.properties via file I/O.
Attempting to load validation.properties as resource file via file I/O.
Not found in 'org.owasp.esapi.resources' directory or file not readable: <https://builds.apache.org/job/sling-org-apache-sling-launchpad-testing-10/ws/target/_-41000/validation.properties>
Not found in SystemResource Directory/resourceDirectory: .esapi/validation.properties
Not found in 'user.home' (/home/jenkins) directory: /home/jenkins/esapi/validation.properties
Loading validation.properties via file I/O failed.
Attempting to load validation.properties via the classpath.
SUCCESSFULLY LOADED validation.properties via the CLASSPATH from '/ (root)' using class loader for DefaultSecurityConfiguration class!
[INFO] Tests run: 1, Failures: 0, Errors: 0, Skipped: 0, Time elapsed: 1.011 s - in org.apache.sling.launchpad.webapp.integrationtest.scripting.SlingJSPTaglibTest
[INFO] Running org.apache.sling.launchpad.webapp.integrationtest.IncludeTest
[INFO] Tests run: 5, Failures: 0, Errors: 0, Skipped: 0, Time elapsed: 2.133 s - in org.apache.sling.launchpad.webapp.integrationtest.IncludeTest
[INFO] Running org.apache.sling.launchpad.webapp.integrationtest.DavExIntegrationTest
[INFO] Tests run: 2, Failures: 0, Errors: 0, Skipped: 0, Time elapsed: 0.193 s - in org.apache.sling.launchpad.webapp.integrationtest.DavExIntegrationTest
[INFO] Running org.apache.sling.launchpad.webapp.integrationtest.auth.AuthenticationResponseCodeTest
[INFO] Tests run: 10, Failures: 0, Errors: 0, Skipped: 0, Time elapsed: 0.039 s - in org.apache.sling.launchpad.webapp.integrationtest.auth.AuthenticationResponseCodeTest
[INFO] Running org.apache.sling.launchpad.webapp.integrationtest.NodetypeRenderingTest
[INFO] Tests run: 7, Failures: 0, Errors: 0, Skipped: 0, Time elapsed: 0.639 s - in org.apache.sling.launchpad.webapp.integrationtest.NodetypeRenderingTest
[INFO] Running org.apache.sling.launchpad.webapp.integrationtest.GeneratedNodeNameTest
[INFO] Tests run: 6, Failures: 0, Errors: 0, Skipped: 0, Time elapsed: 0.164 s - in org.apache.sling.launchpad.webapp.integrationtest.GeneratedNodeNameTest
[INFO] Running org.apache.sling.launchpad.webapp.integrationtest.HttpPingTest
[INFO] Tests run: 2, Failures: 0, Errors: 0, Skipped: 0, Time elapsed: 0.006 s - in org.apache.sling.launchpad.webapp.integrationtest.HttpPingTest
[INFO] Running org.apache.sling.launchpad.webapp.integrationtest.ImmediateScriptActivationTest
[INFO] Tests run: 2, Failures: 0, Errors: 0, Skipped: 0, Time elapsed: 1.85 s - in org.apache.sling.launchpad.webapp.integrationtest.ImmediateScriptActivationTest
[INFO] Running org.apache.sling.launchpad.webapp.integrationtest.RangeStreamingTest
[INFO] Tests run: 4, Failures: 0, Errors: 0, Skipped: 0, Time elapsed: 0.324 s - in org.apache.sling.launchpad.webapp.integrationtest.RangeStreamingTest
[INFO] Running org.apache.sling.launchpad.webapp.integrationtest.StaticContentTest
[INFO] Tests run: 2, Failures: 0, Errors: 0, Skipped: 0, Time elapsed: 0.001 s - in org.apache.sling.launchpad.webapp.integrationtest.StaticContentTest
[INFO] Running org.apache.sling.launchpad.webapp.integrationtest.ResourceSuperTypeTest
[INFO] Tests run: 2, Failures: 0, Errors: 0, Skipped: 0, Time elapsed: 0.425 s - in org.apache.sling.launchpad.webapp.integrationtest.ResourceSuperTypeTest
[INFO] Running org.apache.sling.launchpad.webapp.integrationtest.FileUploadTest
[INFO] Tests run: 1, Failures: 0, Errors: 0, Skipped: 0, Time elapsed: 0.022 s - in org.apache.sling.launchpad.webapp.integrationtest.FileUploadTest
[INFO] Running org.apache.sling.launchpad.webapp.integrationtest.SlingWebDavServletTest
[INFO] Tests run: 2, Failures: 0, Errors: 0, Skipped: 0, Time elapsed: 0.169 s - in org.apache.sling.launchpad.webapp.integrationtest.SlingWebDavServletTest
[INFO] Running org.apache.sling.launchpad.webapp.integrationtest.SlingResourceTypeRenderingTest
[INFO] Tests run: 9, Failures: 0, Errors: 0, Skipped: 0, Time elapsed: 0.943 s - in org.apache.sling.launchpad.webapp.integrationtest.SlingResourceTypeRenderingTest
[INFO] Running org.apache.sling.launchpad.webapp.integrationtest.runmodes.InactiveRunModeTest
[INFO] Tests run: 2, Failures: 0, Errors: 0, Skipped: 0, Time elapsed: 0.012 s - in org.apache.sling.launchpad.webapp.integrationtest.runmodes.InactiveRunModeTest
[INFO]
[INFO] Results:
[INFO]
[ERROR] Failures:
[ERROR] VersionInfoServletTest.testStandardVersionsList:77 Expecting true baseVersion expected:<true> but was:<false>
[INFO]
[ERROR] Tests run: 655, Failures: 1, Errors: 0, Skipped: 1
[INFO]
[JENKINS] Recording test results
WARNING: An illegal reflective access operation has occurred
WARNING: Illegal reflective access by org.dom4j.io.SAXContentHandler to method com.sun.org.apache.xerces.internal.parsers.AbstractSAXParser$LocatorProxy.getEncoding()
WARNING: Please consider reporting this to the maintainers of org.dom4j.io.SAXContentHandler
WARNING: Use --illegal-access=warn to enable warnings of further illegal reflective access operations
WARNING: All illegal access operations will be denied in a future release
[WARNING] Attempt to (de-)serialize anonymous class hudson.maven.reporters.SurefireArchiver$2; see: https://jenkins.io/redirect/serialization-of-anonymous-classes/
[INFO]
[INFO] --- slingstart-maven-plugin:1.7.16:stop (stop-container) @ org.apache.sling.launchpad.testing ---
[INFO] Stopping 1 Launchpad instances
[INFO] Stopping Launchpad '_-41000'
19.09.2018 16:24:24.317 *INFO * [Apache Sling Terminator] Java VM is shutting down
19.09.2018 16:24:24.318 *INFO * [Apache Sling Terminator] Stopping Apache Sling
19.09.2018 16:24:26.233 *INFO * [Sling Notifier] Apache Sling has been stopped
[INFO]
[INFO] --- ianal-maven-plugin:1.0-alpha-1:verify-legal-files (default) @ org.apache.sling.launchpad.testing ---
[INFO] Checking legal files in: org.apache.sling.launchpad.testing-11-SNAPSHOT.jar
[INFO] Checking legal files in: org.apache.sling.launchpad.testing-11-SNAPSHOT-sources.jar
[INFO]
[INFO] --- apache-rat-plugin:0.11:check (default) @ org.apache.sling.launchpad.testing ---
[INFO] 51 implicit excludes (use -debug for more details).
[INFO] Exclude: DEPENDENCIES
[INFO] Exclude: src/main/appended-resources/META-INF/*
[INFO] Exclude: velocity.log
[INFO] Exclude: target/*
[INFO] Exclude: README.md
[INFO] Exclude: maven-eclipse.xml
[INFO] Exclude: .*
[INFO] Exclude: .*/**
[INFO] Exclude: **/*.json
[INFO] Exclude: DEPENDENCIES
[INFO] Exclude: **/*.rej
[INFO] Exclude: hs_err_*.log
[INFO] Exclude: **/repository/index/*/index-details.txt
[INFO] Exclude: bnd.bnd
[INFO] 5 resources included (use -debug for more details)
[INFO] Rat check: Summary of files. Unapproved: 1 unknown: 1 generated: 0 approved: 3 licence.
[WARNING] Attempt to (de-)serialize anonymous class hudson.maven.reporters.MavenArtifactArchiver$2; see: https://jenkins.io/redirect/serialization-of-anonymous-classes/
[JENKINS] Archiving disabled
[WARNING] Attempt to (de-)serialize anonymous class hudson.maven.reporters.MavenFingerprinter$1; see: https://jenkins.io/redirect/serialization-of-anonymous-classes/
[JENKINS] Archiving disabled
[INFO] ------------------------------------------------------------------------
[INFO] BUILD FAILURE
[INFO] ------------------------------------------------------------------------
[INFO] Total time: 05:00 min
[INFO] Finished at: 2018-09-19T16:24:34+00:00
[INFO] Final Memory: 51M/4096M
[INFO] ------------------------------------------------------------------------
Waiting for Jenkins to finish collecting data
[ERROR] Failed to execute goal org.apache.rat:apache-rat-plugin:0.11:check (default) on project org.apache.sling.launchpad.testing: Too many files with unapproved license: 1 See RAT report in: <https://builds.apache.org/job/sling-org-apache-sling-launchpad-testing-10/ws/target/rat.txt> -> [Help 1]
[ERROR]
[ERROR] To see the full stack trace of the errors, re-run Maven with the -e switch.
[ERROR] Re-run Maven using the -X switch to enable full debug logging.
[ERROR]
[ERROR] For more information about the errors and possible solutions, please read the following articles:
[ERROR] [Help 1] http://cwiki.apache.org/confluence/display/MAVEN/MojoFailureException
channel stopped
Archiving artifacts
Recording test results
Build failed in Jenkins:
sling-org-apache-sling-launchpad-testing-10 #171
Posted by Apache Jenkins Server <je...@builds.apache.org>.
See <https://builds.apache.org/job/sling-org-apache-sling-launchpad-testing-10/171/display/redirect>
------------------------------------------
Started by upstream project "sling-org-apache-sling-launchpad-integration-tests-1.8" build number 154
originally caused by:
Started by an SCM change
[EnvInject] - Loading node environment variables.
Building remotely on H33 (ubuntu xenial) in workspace <https://builds.apache.org/job/sling-org-apache-sling-launchpad-testing-10/ws/>
> git rev-parse --is-inside-work-tree # timeout=10
Fetching changes from the remote Git repository
> git config remote.origin.url https://github.com/apache/sling-org-apache-sling-launchpad-testing.git # timeout=10
Fetching upstream changes from https://github.com/apache/sling-org-apache-sling-launchpad-testing.git
> git --version # timeout=10
> git fetch --tags --progress https://github.com/apache/sling-org-apache-sling-launchpad-testing.git +refs/heads/*:refs/remotes/origin/*
ERROR: Error fetching remote repo 'origin'
hudson.plugins.git.GitException: Failed to fetch from https://github.com/apache/sling-org-apache-sling-launchpad-testing.git
at hudson.plugins.git.GitSCM.fetchFrom(GitSCM.java:888)
at hudson.plugins.git.GitSCM.retrieveChanges(GitSCM.java:1155)
at hudson.plugins.git.GitSCM.checkout(GitSCM.java:1186)
at hudson.scm.SCM.checkout(SCM.java:504)
at hudson.model.AbstractProject.checkout(AbstractProject.java:1208)
at hudson.model.AbstractBuild$AbstractBuildExecution.defaultCheckout(AbstractBuild.java:574)
at jenkins.scm.SCMCheckoutStrategy.checkout(SCMCheckoutStrategy.java:86)
at hudson.model.AbstractBuild$AbstractBuildExecution.run(AbstractBuild.java:499)
at hudson.model.Run.execute(Run.java:1794)
at hudson.maven.MavenModuleSetBuild.run(MavenModuleSetBuild.java:543)
at hudson.model.ResourceController.execute(ResourceController.java:97)
at hudson.model.Executor.run(Executor.java:429)
Caused by: hudson.plugins.git.GitException: Command "git fetch --tags --progress https://github.com/apache/sling-org-apache-sling-launchpad-testing.git +refs/heads/*:refs/remotes/origin/*" returned status code 128:
stdout:
stderr: remote: Counting objects: 709, done.
Receiving objects: 0% (1/709) Receiving objects: 1% (8/709) Receiving objects: 2% (15/709) Receiving objects: 3% (22/709) Receiving objects: 4% (29/709) Receiving objects: 5% (36/709) Receiving objects: 6% (43/709) Receiving objects: 7% (50/709) Receiving objects: 8% (57/709) Receiving objects: 9% (64/709) Receiving objects: 10% (71/709) Receiving objects: 11% (78/709) Receiving objects: 12% (86/709) Receiving objects: 13% (93/709) Receiving objects: 14% (100/709) Receiving objects: 15% (107/709) Receiving objects: 16% (114/709) Receiving objects: 17% (121/709) Receiving objects: 18% (128/709) Receiving objects: 19% (135/709) Receiving objects: 20% (142/709) Receiving objects: 21% (149/709) Receiving objects: 22% (156/709) Receiving objects: 23% (164/709) Receiving objects: 24% (171/709) Receiving objects: 25% (178/709) Receiving objects: 26% (185/709) Receiving objects: 27% (192/709) Receiving objects: 28% (199/709) Receiving objects: 29% (206/709) Receiving objects: 30% (213/709) Receiving objects: 31% (220/709) remote: Total 709 (delta 85), reused 85 (delta 85), pack-reused 624
Receiving objects: 32% (227/709) Receiving objects: 33% (234/709) Receiving objects: 34% (242/709) Receiving objects: 35% (249/709) Receiving objects: 36% (256/709) Receiving objects: 37% (263/709) Receiving objects: 38% (270/709) Receiving objects: 39% (277/709) Receiving objects: 40% (284/709) Receiving objects: 41% (291/709) Receiving objects: 42% (298/709) Receiving objects: 43% (305/709) Receiving objects: 44% (312/709) Receiving objects: 45% (320/709) Receiving objects: 46% (327/709) Receiving objects: 47% (334/709) Receiving objects: 48% (341/709) Receiving objects: 49% (348/709) Receiving objects: 50% (355/709) Receiving objects: 51% (362/709) Receiving objects: 52% (369/709) Receiving objects: 53% (376/709) Receiving objects: 54% (383/709) Receiving objects: 55% (390/709) Receiving objects: 56% (398/709) Receiving objects: 57% (405/709) Receiving objects: 58% (412/709) Receiving objects: 59% (419/709) Receiving objects: 60% (426/709) Receiving objects: 61% (433/709) Receiving objects: 62% (440/709) Receiving objects: 63% (447/709) Receiving objects: 64% (454/709) Receiving objects: 65% (461/709) Receiving objects: 66% (468/709) Receiving objects: 67% (476/709) Receiving objects: 68% (483/709) Receiving objects: 69% (490/709) Receiving objects: 70% (497/709) Receiving objects: 71% (504/709) Receiving objects: 72% (511/709) Receiving objects: 73% (518/709) Receiving objects: 74% (525/709) Receiving objects: 75% (532/709) Receiving objects: 76% (539/709) Receiving objects: 77% (546/709) Receiving objects: 78% (554/709) Receiving objects: 79% (561/709) Receiving objects: 80% (568/709) Receiving objects: 81% (575/709) Receiving objects: 82% (582/709) Receiving objects: 83% (589/709) Receiving objects: 84% (596/709) Receiving objects: 85% (603/709) Receiving objects: 86% (610/709) Receiving objects: 87% (617/709) Receiving objects: 88% (624/709) Receiving objects: 89% (632/709) Receiving objects: 90% (639/709) Receiving objects: 91% (646/709) Receiving objects: 92% (653/709) Receiving objects: 93% (660/709) Receiving objects: 94% (667/709) Receiving objects: 95% (674/709) Receiving objects: 96% (681/709) Receiving objects: 97% (688/709) Receiving objects: 98% (695/709) Receiving objects: 99% (702/709) Receiving objects: 100% (709/709) Receiving objects: 100% (709/709), 126.24 KiB | 0 bytes/s, done.
Resolving deltas: 0% (0/303) Resolving deltas: 1% (4/303) Resolving deltas: 2% (7/303) Resolving deltas: 3% (10/303) Resolving deltas: 4% (13/303) Resolving deltas: 5% (16/303) Resolving deltas: 6% (21/303) Resolving deltas: 7% (22/303) Resolving deltas: 8% (25/303) Resolving deltas: 9% (30/303) Resolving deltas: 10% (31/303) Resolving deltas: 11% (34/303) Resolving deltas: 12% (38/303) Resolving deltas: 13% (41/303) Resolving deltas: 14% (44/303) Resolving deltas: 15% (46/303) Resolving deltas: 16% (49/303) Resolving deltas: 17% (53/303) Resolving deltas: 18% (57/303) Resolving deltas: 19% (58/303) Resolving deltas: 20% (61/303) Resolving deltas: 21% (66/303) Resolving deltas: 22% (67/303) Resolving deltas: 23% (71/303) Resolving deltas: 24% (73/303) Resolving deltas: 25% (77/303) Resolving deltas: 26% (79/303) Resolving deltas: 27% (82/303) Resolving deltas: 28% (87/303) Resolving deltas: 29% (88/303) Resolving deltas: 30% (93/303) Resolving deltas: 31% (94/303) Resolving deltas: 32% (97/303) Resolving deltas: 33% (100/303) Resolving deltas: 34% (104/303) Resolving deltas: 35% (107/303) Resolving deltas: 36% (111/303) Resolving deltas: 37% (113/303) Resolving deltas: 38% (117/303) Resolving deltas: 39% (119/303) Resolving deltas: 40% (124/303) Resolving deltas: 42% (129/303) Resolving deltas: 46% (142/303) Resolving deltas: 47% (143/303) Resolving deltas: 53% (161/303) Resolving deltas: 55% (167/303) Resolving deltas: 59% (179/303) Resolving deltas: 62% (189/303) Resolving deltas: 63% (193/303) Resolving deltas: 65% (199/303) Resolving deltas: 68% (209/303) Resolving deltas: 71% (218/303) Resolving deltas: 71% (218/303), completed with 0 local objects.
fatal: pack has 85 unresolved deltas
fatal: index-pack failed
at org.jenkinsci.plugins.gitclient.CliGitAPIImpl.launchCommandIn(CliGitAPIImpl.java:2002)
at org.jenkinsci.plugins.gitclient.CliGitAPIImpl.launchCommandWithCredentials(CliGitAPIImpl.java:1721)
at org.jenkinsci.plugins.gitclient.CliGitAPIImpl.access$300(CliGitAPIImpl.java:72)
at org.jenkinsci.plugins.gitclient.CliGitAPIImpl$1.execute(CliGitAPIImpl.java:405)
at org.jenkinsci.plugins.gitclient.RemoteGitImpl$CommandInvocationHandler$1.call(RemoteGitImpl.java:153)
at org.jenkinsci.plugins.gitclient.RemoteGitImpl$CommandInvocationHandler$1.call(RemoteGitImpl.java:146)
at hudson.remoting.UserRequest.perform(UserRequest.java:212)
at hudson.remoting.UserRequest.perform(UserRequest.java:54)
at hudson.remoting.Request$2.run(Request.java:369)
at hudson.remoting.InterceptingExecutorService$1.call(InterceptingExecutorService.java:72)
at java.util.concurrent.FutureTask.run(FutureTask.java:266)
at java.util.concurrent.ThreadPoolExecutor.runWorker(ThreadPoolExecutor.java:1142)
at java.util.concurrent.ThreadPoolExecutor$Worker.run(ThreadPoolExecutor.java:617)
at java.lang.Thread.run(Thread.java:748)
Suppressed: hudson.remoting.Channel$CallSiteStackTrace: Remote call to H33
at hudson.remoting.Channel.attachCallSiteStackTrace(Channel.java:1741)
at hudson.remoting.UserRequest$ExceptionResponse.retrieve(UserRequest.java:357)
at hudson.remoting.Channel.call(Channel.java:955)
at org.jenkinsci.plugins.gitclient.RemoteGitImpl$CommandInvocationHandler.execute(RemoteGitImpl.java:146)
at sun.reflect.GeneratedMethodAccessor918.invoke(Unknown Source)
at sun.reflect.DelegatingMethodAccessorImpl.invoke(DelegatingMethodAccessorImpl.java:43)
at java.lang.reflect.Method.invoke(Method.java:498)
at org.jenkinsci.plugins.gitclient.RemoteGitImpl$CommandInvocationHandler.invoke(RemoteGitImpl.java:132)
at com.sun.proxy.$Proxy119.execute(Unknown Source)
at hudson.plugins.git.GitSCM.fetchFrom(GitSCM.java:886)
at hudson.plugins.git.GitSCM.retrieveChanges(GitSCM.java:1155)
at hudson.plugins.git.GitSCM.checkout(GitSCM.java:1186)
at hudson.scm.SCM.checkout(SCM.java:504)
at hudson.model.AbstractProject.checkout(AbstractProject.java:1208)
at hudson.model.AbstractBuild$AbstractBuildExecution.defaultCheckout(AbstractBuild.java:574)
at jenkins.scm.SCMCheckoutStrategy.checkout(SCMCheckoutStrategy.java:86)
at hudson.model.AbstractBuild$AbstractBuildExecution.run(AbstractBuild.java:499)
at hudson.model.Run.execute(Run.java:1794)
at hudson.maven.MavenModuleSetBuild.run(MavenModuleSetBuild.java:543)
at hudson.model.ResourceController.execute(ResourceController.java:97)
at hudson.model.Executor.run(Executor.java:429)
ERROR: Error fetching remote repo 'origin'
Retrying after 10 seconds
> git rev-parse --is-inside-work-tree # timeout=10
Fetching changes from the remote Git repository
> git config remote.origin.url https://github.com/apache/sling-org-apache-sling-launchpad-testing.git # timeout=10
Fetching upstream changes from https://github.com/apache/sling-org-apache-sling-launchpad-testing.git
> git --version # timeout=10
> git fetch --tags --progress https://github.com/apache/sling-org-apache-sling-launchpad-testing.git +refs/heads/*:refs/remotes/origin/*
ERROR: Error fetching remote repo 'origin'
hudson.plugins.git.GitException: Failed to fetch from https://github.com/apache/sling-org-apache-sling-launchpad-testing.git
at hudson.plugins.git.GitSCM.fetchFrom(GitSCM.java:888)
at hudson.plugins.git.GitSCM.retrieveChanges(GitSCM.java:1155)
at hudson.plugins.git.GitSCM.checkout(GitSCM.java:1186)
at hudson.scm.SCM.checkout(SCM.java:504)
at hudson.model.AbstractProject.checkout(AbstractProject.java:1208)
at hudson.model.AbstractBuild$AbstractBuildExecution.defaultCheckout(AbstractBuild.java:574)
at jenkins.scm.SCMCheckoutStrategy.checkout(SCMCheckoutStrategy.java:86)
at hudson.model.AbstractBuild$AbstractBuildExecution.run(AbstractBuild.java:499)
at hudson.model.Run.execute(Run.java:1794)
at hudson.maven.MavenModuleSetBuild.run(MavenModuleSetBuild.java:543)
at hudson.model.ResourceController.execute(ResourceController.java:97)
at hudson.model.Executor.run(Executor.java:429)
Caused by: hudson.plugins.git.GitException: Command "git fetch --tags --progress https://github.com/apache/sling-org-apache-sling-launchpad-testing.git +refs/heads/*:refs/remotes/origin/*" returned status code 128:
stdout:
stderr: remote: Counting objects: 709, done.
Receiving objects: 0% (1/709) Receiving objects: 1% (8/709) Receiving objects: 2% (15/709) Receiving objects: 3% (22/709) Receiving objects: 4% (29/709) Receiving objects: 5% (36/709) Receiving objects: 6% (43/709) Receiving objects: 7% (50/709) Receiving objects: 8% (57/709) Receiving objects: 9% (64/709) Receiving objects: 10% (71/709) Receiving objects: 11% (78/709) Receiving objects: 12% (86/709) Receiving objects: 13% (93/709) Receiving objects: 14% (100/709) Receiving objects: 15% (107/709) Receiving objects: 16% (114/709) Receiving objects: 17% (121/709) Receiving objects: 18% (128/709) Receiving objects: 19% (135/709) Receiving objects: 20% (142/709) Receiving objects: 21% (149/709) Receiving objects: 22% (156/709) Receiving objects: 23% (164/709) Receiving objects: 24% (171/709) Receiving objects: 25% (178/709) Receiving objects: 26% (185/709) Receiving objects: 27% (192/709) Receiving objects: 28% (199/709) Receiving objects: 29% (206/709) Receiving objects: 30% (213/709) Receiving objects: 31% (220/709) Receiving objects: 32% (227/709) Receiving objects: 33% (234/709) Receiving objects: 34% (242/709) Receiving objects: 35% (249/709) Receiving objects: 36% (256/709) Receiving objects: 37% (263/709) Receiving objects: 38% (270/709) Receiving objects: 39% (277/709) Receiving objects: 40% (284/709) Receiving objects: 41% (291/709) Receiving objects: 42% (298/709) Receiving objects: 43% (305/709) Receiving objects: 44% (312/709) Receiving objects: 45% (320/709) Receiving objects: 46% (327/709) remote: Total 709 (delta 85), reused 85 (delta 85), pack-reused 624
Receiving objects: 47% (334/709) Receiving objects: 48% (341/709) Receiving objects: 49% (348/709) Receiving objects: 50% (355/709) Receiving objects: 51% (362/709) Receiving objects: 52% (369/709) Receiving objects: 53% (376/709) Receiving objects: 54% (383/709) Receiving objects: 55% (390/709) Receiving objects: 56% (398/709) Receiving objects: 57% (405/709) Receiving objects: 58% (412/709) Receiving objects: 59% (419/709) Receiving objects: 60% (426/709) Receiving objects: 61% (433/709) Receiving objects: 62% (440/709) Receiving objects: 63% (447/709) Receiving objects: 64% (454/709) Receiving objects: 65% (461/709) Receiving objects: 66% (468/709) Receiving objects: 67% (476/709) Receiving objects: 68% (483/709) Receiving objects: 69% (490/709) Receiving objects: 70% (497/709) Receiving objects: 71% (504/709) Receiving objects: 72% (511/709) Receiving objects: 73% (518/709) Receiving objects: 74% (525/709) Receiving objects: 75% (532/709) Receiving objects: 76% (539/709) Receiving objects: 77% (546/709) Receiving objects: 78% (554/709) Receiving objects: 79% (561/709) Receiving objects: 80% (568/709) Receiving objects: 81% (575/709) Receiving objects: 82% (582/709) Receiving objects: 83% (589/709) Receiving objects: 84% (596/709) Receiving objects: 85% (603/709) Receiving objects: 86% (610/709) Receiving objects: 87% (617/709) Receiving objects: 88% (624/709) Receiving objects: 89% (632/709) Receiving objects: 90% (639/709) Receiving objects: 91% (646/709) Receiving objects: 92% (653/709) Receiving objects: 93% (660/709) Receiving objects: 94% (667/709) Receiving objects: 95% (674/709) Receiving objects: 96% (681/709) Receiving objects: 97% (688/709) Receiving objects: 98% (695/709) Receiving objects: 99% (702/709) Receiving objects: 100% (709/709) Receiving objects: 100% (709/709), 126.24 KiB | 0 bytes/s, done.
Resolving deltas: 0% (0/303) Resolving deltas: 1% (4/303) Resolving deltas: 2% (7/303) Resolving deltas: 3% (10/303) Resolving deltas: 4% (13/303) Resolving deltas: 5% (16/303) Resolving deltas: 6% (21/303) Resolving deltas: 7% (22/303) Resolving deltas: 8% (26/303) Resolving deltas: 10% (32/303) Resolving deltas: 11% (34/303) Resolving deltas: 12% (38/303) Resolving deltas: 13% (40/303) Resolving deltas: 14% (43/303) Resolving deltas: 15% (47/303) Resolving deltas: 16% (51/303) Resolving deltas: 17% (53/303) Resolving deltas: 18% (57/303) Resolving deltas: 19% (59/303) Resolving deltas: 20% (63/303) Resolving deltas: 21% (65/303) Resolving deltas: 22% (68/303) Resolving deltas: 23% (70/303) Resolving deltas: 24% (73/303) Resolving deltas: 25% (76/303) Resolving deltas: 26% (79/303) Resolving deltas: 28% (86/303) Resolving deltas: 29% (89/303) Resolving deltas: 30% (92/303) Resolving deltas: 31% (94/303) Resolving deltas: 32% (97/303) Resolving deltas: 33% (100/303) Resolving deltas: 34% (104/303) Resolving deltas: 35% (107/303) Resolving deltas: 36% (110/303) Resolving deltas: 37% (113/303) Resolving deltas: 38% (117/303) Resolving deltas: 39% (119/303) Resolving deltas: 41% (127/303) Resolving deltas: 42% (128/303) Resolving deltas: 44% (135/303) Resolving deltas: 47% (143/303) Resolving deltas: 55% (167/303) Resolving deltas: 58% (176/303) Resolving deltas: 61% (187/303) Resolving deltas: 62% (188/303) Resolving deltas: 65% (199/303) Resolving deltas: 66% (201/303) Resolving deltas: 67% (206/303) Resolving deltas: 71% (218/303) Resolving deltas: 71% (218/303), completed with 0 local objects.
fatal: pack has 85 unresolved deltas
fatal: index-pack failed
at org.jenkinsci.plugins.gitclient.CliGitAPIImpl.launchCommandIn(CliGitAPIImpl.java:2002)
at org.jenkinsci.plugins.gitclient.CliGitAPIImpl.launchCommandWithCredentials(CliGitAPIImpl.java:1721)
at org.jenkinsci.plugins.gitclient.CliGitAPIImpl.access$300(CliGitAPIImpl.java:72)
at org.jenkinsci.plugins.gitclient.CliGitAPIImpl$1.execute(CliGitAPIImpl.java:405)
at org.jenkinsci.plugins.gitclient.RemoteGitImpl$CommandInvocationHandler$1.call(RemoteGitImpl.java:153)
at org.jenkinsci.plugins.gitclient.RemoteGitImpl$CommandInvocationHandler$1.call(RemoteGitImpl.java:146)
at hudson.remoting.UserRequest.perform(UserRequest.java:212)
at hudson.remoting.UserRequest.perform(UserRequest.java:54)
at hudson.remoting.Request$2.run(Request.java:369)
at hudson.remoting.InterceptingExecutorService$1.call(InterceptingExecutorService.java:72)
at java.util.concurrent.FutureTask.run(FutureTask.java:266)
at java.util.concurrent.ThreadPoolExecutor.runWorker(ThreadPoolExecutor.java:1142)
at java.util.concurrent.ThreadPoolExecutor$Worker.run(ThreadPoolExecutor.java:617)
at java.lang.Thread.run(Thread.java:748)
Suppressed: hudson.remoting.Channel$CallSiteStackTrace: Remote call to H33
at hudson.remoting.Channel.attachCallSiteStackTrace(Channel.java:1741)
at hudson.remoting.UserRequest$ExceptionResponse.retrieve(UserRequest.java:357)
at hudson.remoting.Channel.call(Channel.java:955)
at org.jenkinsci.plugins.gitclient.RemoteGitImpl$CommandInvocationHandler.execute(RemoteGitImpl.java:146)
at sun.reflect.GeneratedMethodAccessor918.invoke(Unknown Source)
at sun.reflect.DelegatingMethodAccessorImpl.invoke(DelegatingMethodAccessorImpl.java:43)
at java.lang.reflect.Method.invoke(Method.java:498)
at org.jenkinsci.plugins.gitclient.RemoteGitImpl$CommandInvocationHandler.invoke(RemoteGitImpl.java:132)
at com.sun.proxy.$Proxy119.execute(Unknown Source)
at hudson.plugins.git.GitSCM.fetchFrom(GitSCM.java:886)
at hudson.plugins.git.GitSCM.retrieveChanges(GitSCM.java:1155)
at hudson.plugins.git.GitSCM.checkout(GitSCM.java:1186)
at hudson.scm.SCM.checkout(SCM.java:504)
at hudson.model.AbstractProject.checkout(AbstractProject.java:1208)
at hudson.model.AbstractBuild$AbstractBuildExecution.defaultCheckout(AbstractBuild.java:574)
at jenkins.scm.SCMCheckoutStrategy.checkout(SCMCheckoutStrategy.java:86)
at hudson.model.AbstractBuild$AbstractBuildExecution.run(AbstractBuild.java:499)
at hudson.model.Run.execute(Run.java:1794)
at hudson.maven.MavenModuleSetBuild.run(MavenModuleSetBuild.java:543)
at hudson.model.ResourceController.execute(ResourceController.java:97)
at hudson.model.Executor.run(Executor.java:429)
ERROR: Error fetching remote repo 'origin'
Retrying after 10 seconds
> git rev-parse --is-inside-work-tree # timeout=10
Fetching changes from the remote Git repository
> git config remote.origin.url https://github.com/apache/sling-org-apache-sling-launchpad-testing.git # timeout=10
Fetching upstream changes from https://github.com/apache/sling-org-apache-sling-launchpad-testing.git
> git --version # timeout=10
> git fetch --tags --progress https://github.com/apache/sling-org-apache-sling-launchpad-testing.git +refs/heads/*:refs/remotes/origin/*
ERROR: Error fetching remote repo 'origin'
hudson.plugins.git.GitException: Failed to fetch from https://github.com/apache/sling-org-apache-sling-launchpad-testing.git
at hudson.plugins.git.GitSCM.fetchFrom(GitSCM.java:888)
at hudson.plugins.git.GitSCM.retrieveChanges(GitSCM.java:1155)
at hudson.plugins.git.GitSCM.checkout(GitSCM.java:1186)
at hudson.scm.SCM.checkout(SCM.java:504)
at hudson.model.AbstractProject.checkout(AbstractProject.java:1208)
at hudson.model.AbstractBuild$AbstractBuildExecution.defaultCheckout(AbstractBuild.java:574)
at jenkins.scm.SCMCheckoutStrategy.checkout(SCMCheckoutStrategy.java:86)
at hudson.model.AbstractBuild$AbstractBuildExecution.run(AbstractBuild.java:499)
at hudson.model.Run.execute(Run.java:1794)
at hudson.maven.MavenModuleSetBuild.run(MavenModuleSetBuild.java:543)
at hudson.model.ResourceController.execute(ResourceController.java:97)
at hudson.model.Executor.run(Executor.java:429)
Caused by: hudson.plugins.git.GitException: Command "git fetch --tags --progress https://github.com/apache/sling-org-apache-sling-launchpad-testing.git +refs/heads/*:refs/remotes/origin/*" returned status code 128:
stdout:
stderr: remote: Counting objects: 709, done.
Receiving objects: 0% (1/709) Receiving objects: 1% (8/709) Receiving objects: 2% (15/709) Receiving objects: 3% (22/709) Receiving objects: 4% (29/709) Receiving objects: 5% (36/709) Receiving objects: 6% (43/709) Receiving objects: 7% (50/709) Receiving objects: 8% (57/709) Receiving objects: 9% (64/709) Receiving objects: 10% (71/709) Receiving objects: 11% (78/709) Receiving objects: 12% (86/709) Receiving objects: 13% (93/709) Receiving objects: 14% (100/709) Receiving objects: 15% (107/709) Receiving objects: 16% (114/709) Receiving objects: 17% (121/709) Receiving objects: 18% (128/709) Receiving objects: 19% (135/709) Receiving objects: 20% (142/709) Receiving objects: 21% (149/709) Receiving objects: 22% (156/709) Receiving objects: 23% (164/709) Receiving objects: 24% (171/709) Receiving objects: 25% (178/709) Receiving objects: 26% (185/709) Receiving objects: 27% (192/709) Receiving objects: 28% (199/709) Receiving objects: 29% (206/709) Receiving objects: 30% (213/709) Receiving objects: 31% (220/709) Receiving objects: 32% (227/709) Receiving objects: 33% (234/709) Receiving objects: 34% (242/709) Receiving objects: 35% (249/709) Receiving objects: 36% (256/709) Receiving objects: 37% (263/709) Receiving objects: 38% (270/709) Receiving objects: 39% (277/709) remote: Total 709 (delta 85), reused 85 (delta 85), pack-reused 624
Receiving objects: 40% (284/709) Receiving objects: 41% (291/709) Receiving objects: 42% (298/709) Receiving objects: 43% (305/709) Receiving objects: 44% (312/709) Receiving objects: 45% (320/709) Receiving objects: 46% (327/709) Receiving objects: 47% (334/709) Receiving objects: 48% (341/709) Receiving objects: 49% (348/709) Receiving objects: 50% (355/709) Receiving objects: 51% (362/709) Receiving objects: 52% (369/709) Receiving objects: 53% (376/709) Receiving objects: 54% (383/709) Receiving objects: 55% (390/709) Receiving objects: 56% (398/709) Receiving objects: 57% (405/709) Receiving objects: 58% (412/709) Receiving objects: 59% (419/709) Receiving objects: 60% (426/709) Receiving objects: 61% (433/709) Receiving objects: 62% (440/709) Receiving objects: 63% (447/709) Receiving objects: 64% (454/709) Receiving objects: 65% (461/709) Receiving objects: 66% (468/709) Receiving objects: 67% (476/709) Receiving objects: 68% (483/709) Receiving objects: 69% (490/709) Receiving objects: 70% (497/709) Receiving objects: 71% (504/709) Receiving objects: 72% (511/709) Receiving objects: 73% (518/709) Receiving objects: 74% (525/709) Receiving objects: 75% (532/709) Receiving objects: 76% (539/709) Receiving objects: 77% (546/709) Receiving objects: 78% (554/709) Receiving objects: 79% (561/709) Receiving objects: 80% (568/709) Receiving objects: 81% (575/709) Receiving objects: 82% (582/709) Receiving objects: 83% (589/709) Receiving objects: 84% (596/709) Receiving objects: 85% (603/709) Receiving objects: 86% (610/709) Receiving objects: 87% (617/709) Receiving objects: 88% (624/709) Receiving objects: 89% (632/709) Receiving objects: 90% (639/709) Receiving objects: 91% (646/709) Receiving objects: 92% (653/709) Receiving objects: 93% (660/709) Receiving objects: 94% (667/709) Receiving objects: 95% (674/709) Receiving objects: 96% (681/709) Receiving objects: 97% (688/709) Receiving objects: 98% (695/709) Receiving objects: 99% (702/709) Receiving objects: 100% (709/709) Receiving objects: 100% (709/709), 126.24 KiB | 0 bytes/s, done.
Resolving deltas: 0% (0/303) Resolving deltas: 1% (4/303) Resolving deltas: 2% (7/303) Resolving deltas: 3% (10/303) Resolving deltas: 4% (13/303) Resolving deltas: 5% (16/303) Resolving deltas: 6% (21/303) Resolving deltas: 7% (22/303) Resolving deltas: 8% (26/303) Resolving deltas: 10% (32/303) Resolving deltas: 11% (34/303) Resolving deltas: 12% (38/303) Resolving deltas: 13% (41/303) Resolving deltas: 14% (43/303) Resolving deltas: 15% (46/303) Resolving deltas: 16% (49/303) Resolving deltas: 17% (52/303) Resolving deltas: 18% (55/303) Resolving deltas: 19% (59/303) Resolving deltas: 20% (61/303) Resolving deltas: 21% (64/303) Resolving deltas: 22% (68/303) Resolving deltas: 23% (70/303) Resolving deltas: 24% (73/303) Resolving deltas: 25% (77/303) Resolving deltas: 26% (79/303) Resolving deltas: 27% (84/303) Resolving deltas: 28% (85/303) Resolving deltas: 29% (89/303) Resolving deltas: 30% (93/303) Resolving deltas: 31% (94/303) Resolving deltas: 32% (97/303) Resolving deltas: 33% (100/303) Resolving deltas: 34% (104/303) Resolving deltas: 35% (107/303) Resolving deltas: 36% (110/303) Resolving deltas: 37% (113/303) Resolving deltas: 38% (117/303) Resolving deltas: 39% (119/303) Resolving deltas: 40% (124/303) Resolving deltas: 41% (125/303) Resolving deltas: 44% (134/303) Resolving deltas: 48% (146/303) Resolving deltas: 54% (166/303) Resolving deltas: 55% (167/303) Resolving deltas: 56% (171/303) Resolving deltas: 57% (175/303) Resolving deltas: 60% (183/303) Resolving deltas: 61% (186/303) Resolving deltas: 64% (195/303) Resolving deltas: 65% (197/303) Resolving deltas: 68% (208/303) Resolving deltas: 71% (218/303) Resolving deltas: 71% (218/303), completed with 0 local objects.
fatal: pack has 85 unresolved deltas
fatal: index-pack failed
at org.jenkinsci.plugins.gitclient.CliGitAPIImpl.launchCommandIn(CliGitAPIImpl.java:2002)
at org.jenkinsci.plugins.gitclient.CliGitAPIImpl.launchCommandWithCredentials(CliGitAPIImpl.java:1721)
at org.jenkinsci.plugins.gitclient.CliGitAPIImpl.access$300(CliGitAPIImpl.java:72)
at org.jenkinsci.plugins.gitclient.CliGitAPIImpl$1.execute(CliGitAPIImpl.java:405)
at org.jenkinsci.plugins.gitclient.RemoteGitImpl$CommandInvocationHandler$1.call(RemoteGitImpl.java:153)
at org.jenkinsci.plugins.gitclient.RemoteGitImpl$CommandInvocationHandler$1.call(RemoteGitImpl.java:146)
at hudson.remoting.UserRequest.perform(UserRequest.java:212)
at hudson.remoting.UserRequest.perform(UserRequest.java:54)
at hudson.remoting.Request$2.run(Request.java:369)
at hudson.remoting.InterceptingExecutorService$1.call(InterceptingExecutorService.java:72)
at java.util.concurrent.FutureTask.run(FutureTask.java:266)
at java.util.concurrent.ThreadPoolExecutor.runWorker(ThreadPoolExecutor.java:1142)
at java.util.concurrent.ThreadPoolExecutor$Worker.run(ThreadPoolExecutor.java:617)
at java.lang.Thread.run(Thread.java:748)
Suppressed: hudson.remoting.Channel$CallSiteStackTrace: Remote call to H33
at hudson.remoting.Channel.attachCallSiteStackTrace(Channel.java:1741)
at hudson.remoting.UserRequest$ExceptionResponse.retrieve(UserRequest.java:357)
at hudson.remoting.Channel.call(Channel.java:955)
at org.jenkinsci.plugins.gitclient.RemoteGitImpl$CommandInvocationHandler.execute(RemoteGitImpl.java:146)
at sun.reflect.GeneratedMethodAccessor918.invoke(Unknown Source)
at sun.reflect.DelegatingMethodAccessorImpl.invoke(DelegatingMethodAccessorImpl.java:43)
at java.lang.reflect.Method.invoke(Method.java:498)
at org.jenkinsci.plugins.gitclient.RemoteGitImpl$CommandInvocationHandler.invoke(RemoteGitImpl.java:132)
at com.sun.proxy.$Proxy119.execute(Unknown Source)
at hudson.plugins.git.GitSCM.fetchFrom(GitSCM.java:886)
at hudson.plugins.git.GitSCM.retrieveChanges(GitSCM.java:1155)
at hudson.plugins.git.GitSCM.checkout(GitSCM.java:1186)
at hudson.scm.SCM.checkout(SCM.java:504)
at hudson.model.AbstractProject.checkout(AbstractProject.java:1208)
at hudson.model.AbstractBuild$AbstractBuildExecution.defaultCheckout(AbstractBuild.java:574)
at jenkins.scm.SCMCheckoutStrategy.checkout(SCMCheckoutStrategy.java:86)
at hudson.model.AbstractBuild$AbstractBuildExecution.run(AbstractBuild.java:499)
at hudson.model.Run.execute(Run.java:1794)
at hudson.maven.MavenModuleSetBuild.run(MavenModuleSetBuild.java:543)
at hudson.model.ResourceController.execute(ResourceController.java:97)
at hudson.model.Executor.run(Executor.java:429)
ERROR: Error fetching remote repo 'origin'
Archiving artifacts
Recording test results
ERROR: Step ?Publish JUnit test result report? failed: Test reports were found but none of them are new. Did leafNodes run?
For example, <https://builds.apache.org/job/sling-org-apache-sling-launchpad-testing-10/ws/target/failsafe-reports/TEST-org.apache.sling.launchpad.webapp.integrationtest.BundleContentTest.xml> is 15 days old