You are viewing a plain text version of this content. The canonical link for it is here.
Posted to commits@olingo.apache.org by Apache Jenkins Server <je...@builds.apache.org> on 2023/09/13 20:57:03 UTC

Build failed in Jenkins: Olingo » olingo-odata2 #29

See <https://ci-builds.apache.org/job/Olingo/job/olingo-odata2/29/display/redirect?page=changes>

Changes:

[Michael Bolz] [OLINGO-1604] Dependency updates


------------------------------------------
[...truncated 13.90 KB...]
[INFO] 
[INFO] --- compiler:2.3.2:testCompile (default-testCompile) @ olingo-odata2-api ---
[INFO] No sources to compile
[INFO] 
[INFO] --- surefire:3.1.2:test (default-test) @ olingo-odata2-api ---
[INFO] 
[INFO] --- jar:2.3.2:jar (default-jar) @ olingo-odata2-api ---
[INFO] Building jar: <https://ci-builds.apache.org/job/Olingo/job/olingo-odata2/ws/odata2-lib/odata-api/target/olingo-odata2-api-2.0.13-SNAPSHOT.jar>
[INFO] 
[INFO] --- site:3.12.1:attach-descriptor (attach-descriptor) @ olingo-odata2-api ---
[INFO] Skipping because packaging 'jar' is not pom.
[INFO] 
[INFO] --- source:2.2.1:jar-no-fork (attach-sources) @ olingo-odata2-api ---
[INFO] Building jar: <https://ci-builds.apache.org/job/Olingo/job/olingo-odata2/ws/odata2-lib/odata-api/target/olingo-odata2-api-2.0.13-SNAPSHOT-sources.jar>
[INFO] 
[INFO] --- checkstyle:2.10:check (checkstyle) @ olingo-odata2-api ---
[INFO] Starting audit...
Audit done.

[INFO] 
[INFO] --- install:3.1.1:install (default-install) @ olingo-odata2-api ---
[INFO] Installing <https://ci-builds.apache.org/job/Olingo/job/olingo-odata2/ws/odata2-lib/odata-api/pom.xml> to /home/jenkins/.m2/repository/org/apache/olingo/olingo-odata2-api/2.0.13-SNAPSHOT/olingo-odata2-api-2.0.13-SNAPSHOT.pom
[INFO] Installing <https://ci-builds.apache.org/job/Olingo/job/olingo-odata2/ws/odata2-lib/odata-api/target/olingo-odata2-api-2.0.13-SNAPSHOT.jar> to /home/jenkins/.m2/repository/org/apache/olingo/olingo-odata2-api/2.0.13-SNAPSHOT/olingo-odata2-api-2.0.13-SNAPSHOT.jar
[INFO] Installing <https://ci-builds.apache.org/job/Olingo/job/olingo-odata2/ws/odata2-lib/odata-api/target/olingo-odata2-api-2.0.13-SNAPSHOT-sources.jar> to /home/jenkins/.m2/repository/org/apache/olingo/olingo-odata2-api/2.0.13-SNAPSHOT/olingo-odata2-api-2.0.13-SNAPSHOT-sources.jar
[INFO] 
[INFO] --- deploy:2.7:deploy (default-deploy) @ olingo-odata2-api ---
Downloading from apache.snapshots.https: https://repository.apache.org/content/repositories/snapshots/org/apache/olingo/olingo-odata2-api/2.0.13-SNAPSHOT/maven-metadata.xml
Progress (1): 1.0 kB                    Downloaded from apache.snapshots.https: https://repository.apache.org/content/repositories/snapshots/org/apache/olingo/olingo-odata2-api/2.0.13-SNAPSHOT/maven-metadata.xml (1.0 kB at 5.1 kB/s)
Uploading to apache.snapshots.https: https://repository.apache.org/content/repositories/snapshots/org/apache/olingo/olingo-odata2-api/2.0.13-SNAPSHOT/olingo-odata2-api-2.0.13-20230913.205616-6.jar
Progress (1): 33/203 kBProgress (1): 66/203 kBProgress (1): 98/203 kBProgress (1): 131/203 kBProgress (1): 164/203 kBProgress (1): 197/203 kBProgress (1): 203 kB                        Uploaded to apache.snapshots.https: https://repository.apache.org/content/repositories/snapshots/org/apache/olingo/olingo-odata2-api/2.0.13-SNAPSHOT/olingo-odata2-api-2.0.13-20230913.205616-6.jar (203 kB at 129 kB/s)
Uploading to apache.snapshots.https: https://repository.apache.org/content/repositories/snapshots/org/apache/olingo/olingo-odata2-api/2.0.13-SNAPSHOT/olingo-odata2-api-2.0.13-20230913.205616-6.pom
Progress (1): 2.6 kB                    Uploaded to apache.snapshots.https: https://repository.apache.org/content/repositories/snapshots/org/apache/olingo/olingo-odata2-api/2.0.13-SNAPSHOT/olingo-odata2-api-2.0.13-20230913.205616-6.pom (2.6 kB at 2.4 kB/s)
Downloading from apache.snapshots.https: https://repository.apache.org/content/repositories/snapshots/org/apache/olingo/olingo-odata2-api/maven-metadata.xml
Progress (1): 435 B                   Downloaded from apache.snapshots.https: https://repository.apache.org/content/repositories/snapshots/org/apache/olingo/olingo-odata2-api/maven-metadata.xml (435 B at 2.2 kB/s)
Uploading to apache.snapshots.https: https://repository.apache.org/content/repositories/snapshots/org/apache/olingo/olingo-odata2-api/2.0.13-SNAPSHOT/maven-metadata.xml
Progress (1): 1.0 kB                    Uploaded to apache.snapshots.https: https://repository.apache.org/content/repositories/snapshots/org/apache/olingo/olingo-odata2-api/2.0.13-SNAPSHOT/maven-metadata.xml (1.0 kB at 915 B/s)
Uploading to apache.snapshots.https: https://repository.apache.org/content/repositories/snapshots/org/apache/olingo/olingo-odata2-api/maven-metadata.xml
Progress (1): 435 B                   Uploaded to apache.snapshots.https: https://repository.apache.org/content/repositories/snapshots/org/apache/olingo/olingo-odata2-api/maven-metadata.xml (435 B at 385 B/s)
Uploading to apache.snapshots.https: https://repository.apache.org/content/repositories/snapshots/org/apache/olingo/olingo-odata2-api/2.0.13-SNAPSHOT/olingo-odata2-api-2.0.13-20230913.205616-6-sources.jar
Progress (1): 33/297 kBProgress (1): 66/297 kBProgress (1): 98/297 kBProgress (1): 131/297 kBProgress (1): 164/297 kBProgress (1): 197/297 kBProgress (1): 229/297 kBProgress (1): 262/297 kBProgress (1): 295/297 kBProgress (1): 297 kB                        Uploaded to apache.snapshots.https: https://repository.apache.org/content/repositories/snapshots/org/apache/olingo/olingo-odata2-api/2.0.13-SNAPSHOT/olingo-odata2-api-2.0.13-20230913.205616-6-sources.jar (297 kB at 239 kB/s)
Uploading to apache.snapshots.https: https://repository.apache.org/content/repositories/snapshots/org/apache/olingo/olingo-odata2-api/2.0.13-SNAPSHOT/maven-metadata.xml
Progress (1): 1.0 kB                    Uploaded to apache.snapshots.https: https://repository.apache.org/content/repositories/snapshots/org/apache/olingo/olingo-odata2-api/2.0.13-SNAPSHOT/maven-metadata.xml (1.0 kB at 953 B/s)
[INFO] 
[INFO] -----------< org.apache.olingo:olingo-odata2-api-annotation >-----------
[INFO] Building olingo-odata2-api-annotation 2.0.13-SNAPSHOT             [4/31]
[INFO]   from odata2-lib/odata-annotation/pom.xml
[INFO] --------------------------------[ jar ]---------------------------------
[INFO] 
[INFO] --- clean:3.2.0:clean (default-clean) @ olingo-odata2-api-annotation ---
[INFO] 
[INFO] --- buildnumber:1.2:create (default) @ olingo-odata2-api-annotation ---
[INFO] 
[INFO] --- enforcer:3.3.0:enforce (enforce-maven-version) @ olingo-odata2-api-annotation ---
[INFO] 
[INFO] --- enforcer:3.3.0:enforce (enforce-java-version) @ olingo-odata2-api-annotation ---
[INFO] 
[INFO] --- remote-resources:1.5:process (process-resource-bundles) @ olingo-odata2-api-annotation ---
[INFO] 
[INFO] --- remote-resources:1.5:process (default) @ olingo-odata2-api-annotation ---
[INFO] 
[INFO] --- resources:3.3.1:resources (default-resources) @ olingo-odata2-api-annotation ---
[INFO] skip non existing resourceDirectory <https://ci-builds.apache.org/job/Olingo/job/olingo-odata2/ws/odata2-lib/odata-annotation/src/main/resources>
[INFO] Copying 3 resources from target/maven-shared-archive-resources to target/classes
[INFO] Copying 3 resources from target/maven-shared-archive-resources to target/classes
[INFO] 
[INFO] --- compiler:2.3.2:compile (default-compile) @ olingo-odata2-api-annotation ---
[INFO] Compiling 16 source files to <https://ci-builds.apache.org/job/Olingo/job/olingo-odata2/ws/odata2-lib/odata-annotation/target/classes>
[INFO] 
[INFO] --- bundle:2.3.7:manifest (bundle-manifest) @ olingo-odata2-api-annotation ---
[WARNING] Manifest org.apache.olingo:olingo-odata2-api-annotation:jar:2.0.13-SNAPSHOT : Superfluous export-package instructions: [org.apache.olingo.odata2.api]
[INFO] 
[INFO] --- resources:3.3.1:testResources (default-testResources) @ olingo-odata2-api-annotation ---
[INFO] skip non existing resourceDirectory <https://ci-builds.apache.org/job/Olingo/job/olingo-odata2/ws/odata2-lib/odata-annotation/src/test/resources>
[INFO] Copying 3 resources from target/maven-shared-archive-resources to target/test-classes
[INFO] Copying 3 resources from target/maven-shared-archive-resources to target/test-classes
[INFO] 
[INFO] --- compiler:2.3.2:testCompile (default-testCompile) @ olingo-odata2-api-annotation ---
[INFO] No sources to compile
[INFO] 
[INFO] --- surefire:3.1.2:test (default-test) @ olingo-odata2-api-annotation ---
[INFO] 
[INFO] --- jar:2.3.2:jar (default-jar) @ olingo-odata2-api-annotation ---
[INFO] Building jar: <https://ci-builds.apache.org/job/Olingo/job/olingo-odata2/ws/odata2-lib/odata-annotation/target/olingo-odata2-api-annotation-2.0.13-SNAPSHOT.jar>
[INFO] 
[INFO] --- site:3.12.1:attach-descriptor (attach-descriptor) @ olingo-odata2-api-annotation ---
[INFO] Skipping because packaging 'jar' is not pom.
[INFO] 
[INFO] --- source:2.2.1:jar-no-fork (attach-sources) @ olingo-odata2-api-annotation ---
[INFO] Building jar: <https://ci-builds.apache.org/job/Olingo/job/olingo-odata2/ws/odata2-lib/odata-annotation/target/olingo-odata2-api-annotation-2.0.13-SNAPSHOT-sources.jar>
[INFO] 
[INFO] --- checkstyle:2.10:check (checkstyle) @ olingo-odata2-api-annotation ---
[INFO] Starting audit...
Audit done.

[INFO] 
[INFO] --- install:3.1.1:install (default-install) @ olingo-odata2-api-annotation ---
[INFO] Installing <https://ci-builds.apache.org/job/Olingo/job/olingo-odata2/ws/odata2-lib/odata-annotation/pom.xml> to /home/jenkins/.m2/repository/org/apache/olingo/olingo-odata2-api-annotation/2.0.13-SNAPSHOT/olingo-odata2-api-annotation-2.0.13-SNAPSHOT.pom
[INFO] Installing <https://ci-builds.apache.org/job/Olingo/job/olingo-odata2/ws/odata2-lib/odata-annotation/target/olingo-odata2-api-annotation-2.0.13-SNAPSHOT.jar> to /home/jenkins/.m2/repository/org/apache/olingo/olingo-odata2-api-annotation/2.0.13-SNAPSHOT/olingo-odata2-api-annotation-2.0.13-SNAPSHOT.jar
[INFO] Installing <https://ci-builds.apache.org/job/Olingo/job/olingo-odata2/ws/odata2-lib/odata-annotation/target/olingo-odata2-api-annotation-2.0.13-SNAPSHOT-sources.jar> to /home/jenkins/.m2/repository/org/apache/olingo/olingo-odata2-api-annotation/2.0.13-SNAPSHOT/olingo-odata2-api-annotation-2.0.13-SNAPSHOT-sources.jar
[INFO] 
[INFO] --- deploy:2.7:deploy (default-deploy) @ olingo-odata2-api-annotation ---
Downloading from apache.snapshots.https: https://repository.apache.org/content/repositories/snapshots/org/apache/olingo/olingo-odata2-api-annotation/2.0.13-SNAPSHOT/maven-metadata.xml
Progress (1): 1.0 kB                    Downloaded from apache.snapshots.https: https://repository.apache.org/content/repositories/snapshots/org/apache/olingo/olingo-odata2-api-annotation/2.0.13-SNAPSHOT/maven-metadata.xml (1.0 kB at 4.5 kB/s)
Uploading to apache.snapshots.https: https://repository.apache.org/content/repositories/snapshots/org/apache/olingo/olingo-odata2-api-annotation/2.0.13-SNAPSHOT/olingo-odata2-api-annotation-2.0.13-20230913.205616-6.jar
Progress (1): 20 kB                   Uploaded to apache.snapshots.https: https://repository.apache.org/content/repositories/snapshots/org/apache/olingo/olingo-odata2-api-annotation/2.0.13-SNAPSHOT/olingo-odata2-api-annotation-2.0.13-20230913.205616-6.jar (20 kB at 19 kB/s)
Uploading to apache.snapshots.https: https://repository.apache.org/content/repositories/snapshots/org/apache/olingo/olingo-odata2-api-annotation/2.0.13-SNAPSHOT/olingo-odata2-api-annotation-2.0.13-20230913.205616-6.pom
Progress (1): 3.1 kB                    Uploaded to apache.snapshots.https: https://repository.apache.org/content/repositories/snapshots/org/apache/olingo/olingo-odata2-api-annotation/2.0.13-SNAPSHOT/olingo-odata2-api-annotation-2.0.13-20230913.205616-6.pom (3.1 kB at 3.0 kB/s)
Downloading from apache.snapshots.https: https://repository.apache.org/content/repositories/snapshots/org/apache/olingo/olingo-odata2-api-annotation/maven-metadata.xml
Progress (1): 446 B                   Downloaded from apache.snapshots.https: https://repository.apache.org/content/repositories/snapshots/org/apache/olingo/olingo-odata2-api-annotation/maven-metadata.xml (446 B at 2.5 kB/s)
Uploading to apache.snapshots.https: https://repository.apache.org/content/repositories/snapshots/org/apache/olingo/olingo-odata2-api-annotation/2.0.13-SNAPSHOT/maven-metadata.xml
Progress (1): 1.0 kB                    Uploaded to apache.snapshots.https: https://repository.apache.org/content/repositories/snapshots/org/apache/olingo/olingo-odata2-api-annotation/2.0.13-SNAPSHOT/maven-metadata.xml (1.0 kB at 844 B/s)
Uploading to apache.snapshots.https: https://repository.apache.org/content/repositories/snapshots/org/apache/olingo/olingo-odata2-api-annotation/maven-metadata.xml
Progress (1): 446 B                   Uploaded to apache.snapshots.https: https://repository.apache.org/content/repositories/snapshots/org/apache/olingo/olingo-odata2-api-annotation/maven-metadata.xml (446 B at 386 B/s)
Uploading to apache.snapshots.https: https://repository.apache.org/content/repositories/snapshots/org/apache/olingo/olingo-odata2-api-annotation/2.0.13-SNAPSHOT/olingo-odata2-api-annotation-2.0.13-20230913.205616-6-sources.jar
Progress (1): 23 kB                   Uploaded to apache.snapshots.https: https://repository.apache.org/content/repositories/snapshots/org/apache/olingo/olingo-odata2-api-annotation/2.0.13-SNAPSHOT/olingo-odata2-api-annotation-2.0.13-20230913.205616-6-sources.jar (23 kB at 21 kB/s)
Uploading to apache.snapshots.https: https://repository.apache.org/content/repositories/snapshots/org/apache/olingo/olingo-odata2-api-annotation/2.0.13-SNAPSHOT/maven-metadata.xml
Progress (1): 1.0 kB                    Uploaded to apache.snapshots.https: https://repository.apache.org/content/repositories/snapshots/org/apache/olingo/olingo-odata2-api-annotation/2.0.13-SNAPSHOT/maven-metadata.xml (1.0 kB at 963 B/s)
[INFO] 
[INFO] --------------< org.apache.olingo:olingo-odata2-testutil >--------------
[INFO] Building olingo-odata2-testutil 2.0.13-SNAPSHOT                   [5/31]
[INFO]   from odata2-lib/odata-testutil/pom.xml
[INFO] --------------------------------[ jar ]---------------------------------
Downloading from oss.sonatype.org: https://oss.sonatype.org/content/groups/staging/org/apache/cxf/cxf-rt-frontend-jaxrs/2.7.18/cxf-rt-frontend-jaxrs-2.7.18.pom
Downloading from central: https://repo.maven.apache.org/maven2/org/apache/cxf/cxf-rt-frontend-jaxrs/2.7.18/cxf-rt-frontend-jaxrs-2.7.18.pom
Progress (1): 1.4/6.4 kBProgress (1): 2.7/6.4 kBProgress (1): 4.1/6.4 kBProgress (1): 5.5/6.4 kBProgress (1): 6.4 kB                        Downloaded from central: https://repo.maven.apache.org/maven2/org/apache/cxf/cxf-rt-frontend-jaxrs/2.7.18/cxf-rt-frontend-jaxrs-2.7.18.pom (6.4 kB at 38 kB/s)
Downloading from oss.sonatype.org: https://oss.sonatype.org/content/groups/staging/org/apache/cxf/cxf-parent/2.7.18/cxf-parent-2.7.18.pom
Downloading from central: https://repo.maven.apache.org/maven2/org/apache/cxf/cxf-parent/2.7.18/cxf-parent-2.7.18.pom
Progress (1): 1.4/85 kBProgress (1): 2.7/85 kBProgress (1): 4.1/85 kBProgress (1): 5.5/85 kBProgress (1): 6.9/85 kBProgress (1): 8.2/85 kBProgress (1): 9.6/85 kBProgress (1): 11/85 kB Progress (1): 12/85 kBProgress (1): 14/85 kBProgress (1): 15/85 kBProgress (1): 16/85 kBProgress (1): 32/85 kBProgress (1): 49/85 kBProgress (1): 65/85 kBProgress (1): 81/85 kBProgress (1): 85 kB                      Downloaded from central: https://repo.maven.apache.org/maven2/org/apache/cxf/cxf-parent/2.7.18/cxf-parent-2.7.18.pom (85 kB at 1.2 MB/s)
Downloading from oss.sonatype.org: https://oss.sonatype.org/content/groups/staging/org/apache/cxf/cxf/2.7.18/cxf-2.7.18.pom
Downloading from central: https://repo.maven.apache.org/maven2/org/apache/cxf/cxf/2.7.18/cxf-2.7.18.pom
Progress (1): 16/35 kBProgress (1): 33/35 kBProgress (1): 35 kB                      Downloaded from central: https://repo.maven.apache.org/maven2/org/apache/cxf/cxf/2.7.18/cxf-2.7.18.pom (35 kB at 808 kB/s)
Downloading from oss.sonatype.org: https://oss.sonatype.org/content/groups/staging/org/apache/cxf/cxf-api/2.7.18/cxf-api-2.7.18.pom
Downloading from central: https://repo.maven.apache.org/maven2/org/apache/cxf/cxf-api/2.7.18/cxf-api-2.7.18.pom
Progress (1): 15 kB                   Downloaded from central: https://repo.maven.apache.org/maven2/org/apache/cxf/cxf-api/2.7.18/cxf-api-2.7.18.pom (15 kB at 446 kB/s)
Downloading from oss.sonatype.org: https://oss.sonatype.org/content/groups/staging/org/apache/cxf/cxf-rt-core/2.7.18/cxf-rt-core-2.7.18.pom
Downloading from central: https://repo.maven.apache.org/maven2/org/apache/cxf/cxf-rt-core/2.7.18/cxf-rt-core-2.7.18.pom
Progress (1): 4.7 kB                    Downloaded from central: https://repo.maven.apache.org/maven2/org/apache/cxf/cxf-rt-core/2.7.18/cxf-rt-core-2.7.18.pom (4.7 kB at 146 kB/s)
Downloading from oss.sonatype.org: https://oss.sonatype.org/content/groups/staging/org/apache/cxf/cxf-rt-bindings-xml/2.7.18/cxf-rt-bindings-xml-2.7.18.pom
Downloading from central: https://repo.maven.apache.org/maven2/org/apache/cxf/cxf-rt-bindings-xml/2.7.18/cxf-rt-bindings-xml-2.7.18.pom
Progress (1): 5.3 kB                    Downloaded from central: https://repo.maven.apache.org/maven2/org/apache/cxf/cxf-rt-bindings-xml/2.7.18/cxf-rt-bindings-xml-2.7.18.pom (5.3 kB at 157 kB/s)
Downloading from oss.sonatype.org: https://oss.sonatype.org/content/groups/staging/org/apache/cxf/cxf-rt-transports-http/2.7.18/cxf-rt-transports-http-2.7.18.pom
Downloading from central: https://repo.maven.apache.org/maven2/org/apache/cxf/cxf-rt-transports-http/2.7.18/cxf-rt-transports-http-2.7.18.pom
Progress (1): 7.2 kB                    Downloaded from central: https://repo.maven.apache.org/maven2/org/apache/cxf/cxf-rt-transports-http/2.7.18/cxf-rt-transports-http-2.7.18.pom (7.2 kB at 224 kB/s)
Downloading from oss.sonatype.org: https://oss.sonatype.org/content/groups/staging/org/apache/cxf/cxf-rt-frontend-jaxrs/2.7.18/cxf-rt-frontend-jaxrs-2.7.18.jar
Downloading from oss.sonatype.org: https://oss.sonatype.org/content/groups/staging/org/apache/cxf/cxf-api/2.7.18/cxf-api-2.7.18.jar
Downloading from oss.sonatype.org: https://oss.sonatype.org/content/groups/staging/org/apache/cxf/cxf-rt-core/2.7.18/cxf-rt-core-2.7.18.jar
Downloading from oss.sonatype.org: https://oss.sonatype.org/content/groups/staging/org/apache/cxf/cxf-rt-bindings-xml/2.7.18/cxf-rt-bindings-xml-2.7.18.jar
Downloading from oss.sonatype.org: https://oss.sonatype.org/content/groups/staging/org/apache/cxf/cxf-rt-transports-http/2.7.18/cxf-rt-transports-http-2.7.18.jar
Downloading from central: https://repo.maven.apache.org/maven2/org/apache/cxf/cxf-rt-frontend-jaxrs/2.7.18/cxf-rt-frontend-jaxrs-2.7.18.jar
Progress (1): 16/677 kBProgress (1): 33/677 kBProgress (1): 49/677 kBProgress (1): 66/677 kBProgress (1): 82/677 kBProgress (1): 98/677 kBProgress (1): 115/677 kBProgress (1): 131/677 kBProgress (1): 147/677 kBProgress (1): 164/677 kBProgress (1): 180/677 kBProgress (1): 197/677 kBProgress (1): 213/677 kBProgress (1): 229/677 kBProgress (1): 246/677 kBProgress (1): 262/677 kBProgress (1): 279/677 kBProgress (1): 295/677 kBProgress (1): 311/677 kBProgress (1): 328/677 kBProgress (1): 344/677 kBProgress (1): 360/677 kBProgress (1): 377/677 kBProgress (1): 393/677 kBProgress (1): 410/677 kBProgress (1): 426/677 kBProgress (1): 442/677 kBProgress (1): 459/677 kBProgress (1): 475/677 kBProgress (1): 492/677 kBProgress (1): 508/677 kBProgress (1): 524/677 kBProgress (1): 541/677 kBProgress (1): 557/677 kBProgress (1): 573/677 kBProgress (1): 590/677 kBProgress (1): 606/677 kBProgress (1): 623/677 kBProgress (1): 639/677 kBProgress (1): 655/677 kBProgress (1): 658/677 kBProgress (1): 674/677 kBProgress (1): 677 kB                        Downloaded from central: https://repo.maven.apache.org/maven2/org/apache/cxf/cxf-rt-frontend-jaxrs/2.7.18/cxf-rt-frontend-jaxrs-2.7.18.jar (677 kB at 5.9 MB/s)
Downloading from central: https://repo.maven.apache.org/maven2/org/apache/cxf/cxf-api/2.7.18/cxf-api-2.7.18.jar
Downloading from central: https://repo.maven.apache.org/maven2/org/apache/cxf/cxf-rt-core/2.7.18/cxf-rt-core-2.7.18.jar
Downloading from central: https://repo.maven.apache.org/maven2/org/apache/cxf/cxf-rt-bindings-xml/2.7.18/cxf-rt-bindings-xml-2.7.18.jar
Downloading from central: https://repo.maven.apache.org/maven2/org/apache/cxf/cxf-rt-transports-http/2.7.18/cxf-rt-transports-http-2.7.18.jar
Progress (1): 16/328 kBProgress (1): 33/328 kBProgress (1): 49/328 kBProgress (1): 66/328 kBProgress (1): 82/328 kBProgress (1): 98/328 kBProgress (1): 115/328 kBProgress (1): 131/328 kBProgress (1): 147/328 kBProgress (1): 164/328 kBProgress (1): 180/328 kBProgress (1): 197/328 kBProgress (1): 213/328 kBProgress (1): 229/328 kBProgress (1): 246/328 kBProgress (1): 256/328 kBProgress (1): 272/328 kBProgress (1): 289/328 kBProgress (1): 305/328 kBProgress (1): 321/328 kBProgress (1): 328 kB                        Downloaded from central: https://repo.maven.apache.org/maven2/org/apache/cxf/cxf-rt-transports-http/2.7.18/cxf-rt-transports-http-2.7.18.jar (328 kB at 4.5 MB/s)
Progress (1): 1.4/39 kBProgress (1): 2.7/39 kBProgress (1): 4.1/39 kBProgress (1): 5.5/39 kBProgress (2): 5.5/39 kB | 1.4/414 kBProgress (2): 6.9/39 kB | 1.4/414 kBProgress (2): 6.9/39 kB | 2.7/414 kBProgress (2): 8.2/39 kB | 2.7/414 kBProgress (2): 8.2/39 kB | 4.1/414 kBProgress (2): 9.6/39 kB | 4.1/414 kBProgress (2): 9.6/39 kB | 5.5/414 kBProgress (2): 11/39 kB | 5.5/414 kB Progress (2): 11/39 kB | 6.9/414 kBProgress (2): 12/39 kB | 6.9/414 kBProgress (2): 12/39 kB | 8.2/414 kBProgress (2): 14/39 kB | 8.2/414 kBProgress (2): 14/39 kB | 9.6/414 kBProgress (2): 15/39 kB | 9.6/414 kBProgress (2): 16/39 kB | 9.6/414 kBProgress (2): 16/39 kB | 11/414 kB Progress (2): 18/39 kB | 11/414 kBProgress (2): 18/39 kB | 12/414 kBProgress (2): 19/39 kB | 12/414 kBProgress (2): 19/39 kB | 14/414 kBProgress (2): 21/39 kB | 14/414 kBProgress (2): 21/39 kB | 15/414 kBProgress (2): 22/39 kB | 15/414 kBProgress (2): 22/39 kB | 16/414 kBProgress (2): 23/39 kB | 16/414 kBProgress (2): 25/39 kB | 16/414 kBProgress (2): 26/39 kB | 16/414 kBProgress (2): 27/39 kB | 16/414 kBProgress (2): 29/39 kB | 16/414 kBProgress (2): 29/39 kB | 32/414 kBProgress (2): 30/39 kB | 32/414 kBProgress (2): 32/39 kB | 32/414 kBProgress (2): 33/39 kB | 32/414 kBProgress (2): 34/39 kB | 32/414 kBProgress (2): 36/39 kB | 32/414 kBProgress (2): 37/39 kB | 32/414 kBProgress (2): 38/39 kB | 32/414 kBProgress (2): 39 kB | 32/414 kB                                  Downloaded from central: https://repo.maven.apache.org/maven2/org/apache/cxf/cxf-rt-bindings-xml/2.7.18/cxf-rt-bindings-xml-2.7.18.jar (39 kB at 318 kB/s)
Progress (1): 49/414 kBProgress (1): 65/414 kBProgress (1): 81/414 kBProgress (1): 98/414 kBProgress (1): 114/414 kBProgress (2): 114/414 kB | 0/1.1 MBProgress (2): 131/414 kB | 0/1.1 MBProgress (2): 147/414 kB | 0/1.1 MBProgress (2): 163/414 kB | 0/1.1 MBProgress (2): 163/414 kB | 0/1.1 MBProgress (2): 180/414 kB | 0/1.1 MBProgress (2): 196/414 kB | 0/1.1 MBProgress (2): 212/414 kB | 0/1.1 MBProgress (2): 229/414 kB | 0/1.1 MBProgress (2): 245/414 kB | 0/1.1 MBProgress (2): 256/414 kB | 0/1.1 MBProgress (2): 256/414 kB | 0/1.1 MBProgress (2): 272/414 kB | 0/1.1 MBProgress (2): 289/414 kB | 0/1.1 MBProgress (2): 305/414 kB | 0/1.1 MBProgress (2): 305/414 kB | 0.1/1.1 MBProgress (2): 321/414 kB | 0.1/1.1 MBProgress (2): 338/414 kB | 0.1/1.1 MBProgress (2): 338/414 kB | 0.1/1.1 MBProgress (2): 354/414 kB | 0.1/1.1 MBProgress (2): 370/414 kB | 0.1/1.1 MBProgress (2): 387/414 kB | 0.1/1.1 MBProgress (2): 387/414 kB | 0.1/1.1 MBProgress (2): 403/414 kB | 0.1/1.1 MBProgress (2): 414 kB | 0.1/1.1 MB                                     Downloaded from central: https://repo.maven.apache.org/maven2/org/apache/cxf/cxf-rt-core/2.7.18/cxf-rt-core-2.7.18.jar (414 kB at 2.0 MB/s)
Progress (1): 0.1/1.1 MBProgress (1): 0.1/1.1 MBProgress (1): 0.1/1.1 MBProgress (1): 0.2/1.1 MBProgress (1): 0.2/1.1 MBProgress (1): 0.2/1.1 MBProgress (1): 0.2/1.1 MBProgress (1): 0.2/1.1 MBProgress (1): 0.2/1.1 MBProgress (1): 0.3/1.1 MBProgress (1): 0.3/1.1 MBProgress (1): 0.3/1.1 MBProgress (1): 0.3/1.1 MBProgress (1): 0.3/1.1 MBProgress (1): 0.3/1.1 MBProgress (1): 0.4/1.1 MBProgress (1): 0.4/1.1 MBProgress (1): 0.4/1.1 MBProgress (1): 0.4/1.1 MBProgress (1): 0.4/1.1 MBProgress (1): 0.4/1.1 MBProgress (1): 0.5/1.1 MBProgress (1): 0.5/1.1 MBProgress (1): 0.5/1.1 MBProgress (1): 0.5/1.1 MBProgress (1): 0.5/1.1 MBProgress (1): 0.5/1.1 MBProgress (1): 0.6/1.1 MBProgress (1): 0.6/1.1 MBProgress (1): 0.6/1.1 MBProgress (1): 0.6/1.1 MBProgress (1): 0.6/1.1 MBProgress (1): 0.6/1.1 MBProgress (1): 0.7/1.1 MBProgress (1): 0.7/1.1 MBProgress (1): 0.7/1.1 MBProgress (1): 0.7/1.1 MBProgress (1): 0.7/1.1 MBProgress (1): 0.7/1.1 MBProgress (1): 0.7/1.1 MBProgress (1): 0.8/1.1 MBProgress (1): 0.8/1.1 MBProgress (1): 0.8/1.1 MBProgress (1): 0.8/1.1 MBProgress (1): 0.8/1.1 MBProgress (1): 0.8/1.1 MBProgress (1): 0.9/1.1 MBProgress (1): 0.9/1.1 MBProgress (1): 0.9/1.1 MBProgress (1): 0.9/1.1 MBProgress (1): 0.9/1.1 MBProgress (1): 0.9/1.1 MBProgress (1): 1.0/1.1 MBProgress (1): 1.0/1.1 MBProgress (1): 1.0/1.1 MBProgress (1): 1.0/1.1 MBProgress (1): 1.0/1.1 MBProgress (1): 1.0/1.1 MBProgress (1): 1.1/1.1 MBProgress (1): 1.1/1.1 MBProgress (1): 1.1/1.1 MBProgress (1): 1.1/1.1 MBProgress (1): 1.1 MB                        Downloaded from central: https://repo.maven.apache.org/maven2/org/apache/cxf/cxf-api/2.7.18/cxf-api-2.7.18.jar (1.1 MB at 3.5 MB/s)
[INFO] 
[INFO] --- clean:3.2.0:clean (default-clean) @ olingo-odata2-testutil ---
[INFO] 
[INFO] --- buildnumber:1.2:create (default) @ olingo-odata2-testutil ---
[INFO] 
[INFO] --- enforcer:3.3.0:enforce (enforce-maven-version) @ olingo-odata2-testutil ---
[INFO] 
[INFO] --- enforcer:3.3.0:enforce (enforce-java-version) @ olingo-odata2-testutil ---
[INFO] 
[INFO] --- remote-resources:1.5:process (process-resource-bundles) @ olingo-odata2-testutil ---
[INFO] 
[INFO] --- remote-resources:1.5:process (default) @ olingo-odata2-testutil ---
[INFO] 
[INFO] --- resources:3.3.1:resources (default-resources) @ olingo-odata2-testutil ---
[INFO] Copying 1 resource from src/main/resources to target/classes
[INFO] Copying 3 resources from target/maven-shared-archive-resources to target/classes
[INFO] Copying 3 resources from target/maven-shared-archive-resources to target/classes
[INFO] 
[INFO] --- compiler:2.3.2:compile (default-compile) @ olingo-odata2-testutil ---
[INFO] Compiling 25 source files to <https://ci-builds.apache.org/job/Olingo/job/olingo-odata2/ws/odata2-lib/odata-testutil/target/classes>
[INFO] -------------------------------------------------------------
[ERROR] COMPILATION ERROR : 
[INFO] -------------------------------------------------------------
[ERROR] <https://ci-builds.apache.org/job/Olingo/job/olingo-odata2/ws/odata2-lib/odata-testutil/src/main/java/org/apache/olingo/odata2/testutil/helper/HttpMerge.java>:[23,33] error: cannot find symbol
[ERROR]  package org.apache.http.annotation
<https://ci-builds.apache.org/job/Olingo/job/olingo-odata2/ws/odata2-lib/odata-testutil/src/main/java/org/apache/olingo/odata2/testutil/helper/HttpMerge.java>:[26,1] error: cannot find symbol
[ERROR]  class NotThreadSafe
<https://ci-builds.apache.org/job/Olingo/job/olingo-odata2/ws/odata2-lib/odata-testutil/src/main/java/org/apache/olingo/odata2/testutil/helper/HttpSomethingUnsupported.java>:[23,33] error: cannot find symbol
[ERROR]  package org.apache.http.annotation
<https://ci-builds.apache.org/job/Olingo/job/olingo-odata2/ws/odata2-lib/odata-testutil/src/main/java/org/apache/olingo/odata2/testutil/helper/HttpSomethingUnsupported.java>:[26,1] error: cannot find symbol
[INFO] 4 errors 
[INFO] -------------------------------------------------------------
[INFO] ------------------------------------------------------------------------
[INFO] Reactor Summary for olingo-odata2-parent 2.0.13-SNAPSHOT:
[INFO] 
[INFO] olingo-odata2-parent ............................... SUCCESS [  9.488 s]
[INFO] olingo-odata2-lib .................................. SUCCESS [  3.930 s]
[INFO] olingo-odata2-api .................................. SUCCESS [ 13.726 s]
[INFO] olingo-odata2-api-annotation ....................... SUCCESS [  8.202 s]
[INFO] olingo-odata2-testutil ............................. FAILURE [  9.089 s]
[INFO] olingo-odata2-core ................................. SKIPPED
[INFO] olingo-odata2-ref .................................. SKIPPED
[INFO] olingo-odata2-fit .................................. SKIPPED
[INFO] olingo-odata2-ref-web .............................. SKIPPED
[INFO] olingo-odata2-client-api ........................... SKIPPED
[INFO] olingo-odata2-client-core .......................... SKIPPED
[INFO] olingo-odata2-jpa-processor ........................ SKIPPED
[INFO] olingo-odata2-jpa-processor-api .................... SKIPPED
[INFO] olingo-odata2-jpa-processor-core ................... SKIPPED
[INFO] olingo-odata2-jpa-processor-ref .................... SKIPPED
[INFO] olingo-odata2-jpa-processor-ref-web ................ SKIPPED
[INFO] olingo-odata2-annotation-processor ................. SKIPPED
[INFO] olingo-odata2-annotation-processor-api ............. SKIPPED
[INFO] olingo-odata2-annotation-processor-core ............ SKIPPED
[INFO] olingo-odata2-annotation-processor-ref ............. SKIPPED
[INFO] olingo-odata2-annotation-processor-ref-web ......... SKIPPED
[INFO] olingo-odata2-dist ................................. SKIPPED
[INFO] olingo-odata2-dist-lib ............................. SKIPPED
[INFO] olingo-odata2-dist-jpa ............................. SKIPPED
[INFO] olingo-odata2-dist-janos ........................... SKIPPED
[INFO] olingo-odata2-dist-ref ............................. SKIPPED
[INFO] olingo-odata2-dist-javadoc ......................... SKIPPED
[INFO] olingo-odata2-sample ............................... SKIPPED
[INFO] olingo-odata2-sample-cars-service-archetype ........ SKIPPED
[INFO] olingo-odata2-sample-cars-annotation-archetype ..... SKIPPED
[INFO] olingo-odata2-sample-cars-jpa-archetype ............ SKIPPED
[INFO] ------------------------------------------------------------------------
[INFO] BUILD FAILURE
[INFO] ------------------------------------------------------------------------
[INFO] Total time:  45.521 s
[INFO] Finished at: 2023-09-13T20:57:01Z
[INFO] ------------------------------------------------------------------------
[ERROR] Failed to execute goal org.apache.maven.plugins:maven-compiler-plugin:2.3.2:compile (default-compile) on project olingo-odata2-testutil: Compilation failure: Compilation failure: 
[ERROR] <https://ci-builds.apache.org/job/Olingo/job/olingo-odata2/ws/odata2-lib/odata-testutil/src/main/java/org/apache/olingo/odata2/testutil/helper/HttpMerge.java>:[23,33] error: cannot find symbol
[ERROR]  package org.apache.http.annotation
[ERROR] <https://ci-builds.apache.org/job/Olingo/job/olingo-odata2/ws/odata2-lib/odata-testutil/src/main/java/org/apache/olingo/odata2/testutil/helper/HttpMerge.java>:[26,1] error: cannot find symbol
[ERROR]  class NotThreadSafe
[ERROR] <https://ci-builds.apache.org/job/Olingo/job/olingo-odata2/ws/odata2-lib/odata-testutil/src/main/java/org/apache/olingo/odata2/testutil/helper/HttpSomethingUnsupported.java>:[23,33] error: cannot find symbol
[ERROR]  package org.apache.http.annotation
[ERROR] <https://ci-builds.apache.org/job/Olingo/job/olingo-odata2/ws/odata2-lib/odata-testutil/src/main/java/org/apache/olingo/odata2/testutil/helper/HttpSomethingUnsupported.java>:[26,1] error: cannot find symbol
[ERROR] -> [Help 1]
[ERROR] 
[ERROR] To see the full stack trace of the errors, re-run Maven with the -e switch.
[ERROR] Re-run Maven using the -X switch to enable full debug logging.
[ERROR] 
[ERROR] For more information about the errors and possible solutions, please read the following articles:
[ERROR] [Help 1] http://cwiki.apache.org/confluence/display/MAVEN/MojoFailureException
[ERROR] 
[ERROR] After correcting the problems, you can resume the build with the command
[ERROR]   mvn <args> -rf :olingo-odata2-testutil
Build step 'Invoke top-level Maven targets' marked build as failure

Build failed in Jenkins: Olingo » olingo-odata2 #30

Posted by Apache Jenkins Server <je...@builds.apache.org>.
See <https://ci-builds.apache.org/job/Olingo/job/olingo-odata2/30/display/redirect?page=changes>

Changes:

[Michael Bolz] [OLINGO-1604] Removed deprecated annotations

[Michael Bolz] [OLINGO-1604] Fixed some dependencies

[Michael Bolz] [OLINGO-1604] Fixed RAT issue

[Michael Bolz] [OLINGO-1604] 2.0.13-RC01

[Michael Bolz] [OLINGO-1604] Set version to 2.0.13


------------------------------------------
Started by an SCM change
Running as SYSTEM
[EnvInject] - Loading node environment variables.
Building remotely on builds24 (ubuntu) in workspace <https://ci-builds.apache.org/job/Olingo/job/olingo-odata2/ws/>
The recommended git tool is: NONE
No credentials specified
 > git rev-parse --resolve-git-dir <https://ci-builds.apache.org/job/Olingo/job/olingo-odata2/ws/.git> # timeout=10
Fetching changes from the remote Git repository
 > git config remote.origin.url https://git-wip-us.apache.org/repos/asf/olingo-odata2.git # timeout=10
Fetching upstream changes from https://git-wip-us.apache.org/repos/asf/olingo-odata2.git
 > git --version # timeout=10
 > git --version # 'git version 2.17.1'
 > git fetch --tags --progress -- https://git-wip-us.apache.org/repos/asf/olingo-odata2.git +refs/heads/master:refs/remotes/origin/master # timeout=10
 > git rev-parse origin/master^{commit} # timeout=10
Checking out Revision c31a2ca5a56c49fea37319ad133af4ea5a5db081 (origin/master)
 > git config core.sparsecheckout # timeout=10
 > git checkout -f c31a2ca5a56c49fea37319ad133af4ea5a5db081 # timeout=10
Commit message: "[OLINGO-1604] Set version to 2.0.13"
 > git rev-list --no-walk ff33effec47ef028494a353fab3ccb6f917e9e03 # timeout=10
[olingo-odata2] $ /home/jenkins/tools/maven/latest3/bin/mvn ******** clean deploy
[INFO] Scanning for projects...
[INFO] ------------------------------------------------------------------------
[INFO] Reactor Build Order:
[INFO] 
[INFO] olingo-odata2-parent                                               [pom]
[INFO] olingo-odata2-lib                                                  [pom]
[INFO] olingo-odata2-api                                                  [jar]
[INFO] olingo-odata2-api-annotation                                       [jar]
[INFO] olingo-odata2-testutil                                             [jar]
[INFO] olingo-odata2-core                                                 [jar]
[INFO] olingo-odata2-ref                                                  [jar]
[INFO] olingo-odata2-fit                                                  [jar]
[INFO] olingo-odata2-ref-web                                              [war]
[INFO] olingo-odata2-client-api                                           [jar]
[INFO] olingo-odata2-client-core                                          [jar]
[INFO] olingo-odata2-jpa-processor                                        [pom]
[INFO] olingo-odata2-jpa-processor-api                                    [jar]
[INFO] olingo-odata2-jpa-processor-core                                   [jar]
[INFO] olingo-odata2-jpa-processor-ref                                    [jar]
[INFO] olingo-odata2-jpa-processor-ref-web                                [war]
[INFO] olingo-odata2-annotation-processor                                 [pom]
[INFO] olingo-odata2-annotation-processor-api                             [jar]
[INFO] olingo-odata2-annotation-processor-core                            [jar]
[INFO] olingo-odata2-annotation-processor-ref                             [jar]
[INFO] olingo-odata2-annotation-processor-ref-web                         [war]
[INFO] olingo-odata2-dist                                                 [pom]
[INFO] olingo-odata2-dist-lib                                             [pom]
[INFO] olingo-odata2-dist-jpa                                             [pom]
[INFO] olingo-odata2-dist-janos                                           [pom]
[INFO] olingo-odata2-dist-ref                                             [pom]
[INFO] olingo-odata2-dist-javadoc                                         [pom]
[INFO] olingo-odata2-sample                                               [pom]
[INFO] olingo-odata2-sample-cars-service-archetype            [maven-archetype]
[INFO] olingo-odata2-sample-cars-annotation-archetype         [maven-archetype]
[INFO] olingo-odata2-sample-cars-jpa-archetype                [maven-archetype]
[INFO] 
[INFO] ---------------< org.apache.olingo:olingo-odata2-parent >---------------
[INFO] Building olingo-odata2-parent 2.0.13                              [1/31]
[INFO]   from pom.xml
[INFO] --------------------------------[ pom ]---------------------------------
[INFO] 
[INFO] --- clean:3.2.0:clean (default-clean) @ olingo-odata2-parent ---
[INFO] Deleting <https://ci-builds.apache.org/job/Olingo/job/olingo-odata2/ws/target>
[INFO] 
[INFO] --- buildnumber:1.2:create (default) @ olingo-odata2-parent ---
[INFO] Checking for local modifications: skipped.
[INFO] Updating project files from SCM: skipped.
[INFO] Executing: /bin/sh -c cd <https://ci-builds.apache.org/job/Olingo/job/olingo-odata2/ws/> && git rev-parse --verify HEAD
[INFO] Working directory: <https://ci-builds.apache.org/job/Olingo/job/olingo-odata2/ws/>
[INFO] Storing buildNumber: c31a2ca5a56c49fea37319ad133af4ea5a5db081 at timestamp: 2023-10-22T18:56:44+0000
[INFO] Executing: /bin/sh -c cd <https://ci-builds.apache.org/job/Olingo/job/olingo-odata2/ws/> && git rev-parse --verify HEAD
[INFO] Working directory: <https://ci-builds.apache.org/job/Olingo/job/olingo-odata2/ws/>
[INFO] Storing buildScmBranch: UNKNOWN
[INFO] 
[INFO] --- enforcer:3.3.0:enforce (enforce-maven-version) @ olingo-odata2-parent ---
[INFO] Rule 0: org.apache.maven.enforcer.rules.version.RequireMavenVersion passed
[INFO] 
[INFO] --- enforcer:3.3.0:enforce (enforce-java-version) @ olingo-odata2-parent ---
[INFO] Rule 0: org.apache.maven.enforcer.rules.version.RequireJavaVersion passed
[INFO] 
[INFO] --- remote-resources:1.5:process (process-resource-bundles) @ olingo-odata2-parent ---
[INFO] 
[INFO] --- remote-resources:1.5:process (default) @ olingo-odata2-parent ---
[INFO] 
[INFO] --- site:3.12.1:attach-descriptor (attach-descriptor) @ olingo-odata2-parent ---
[INFO] No site descriptor found: nothing to attach.
[INFO] 
[INFO] --- source:2.2.1:jar-no-fork (attach-sources) @ olingo-odata2-parent ---
[INFO] 
[INFO] --- checkstyle:2.10:check (checkstyle) @ olingo-odata2-parent ---
[INFO] Starting audit...
Audit done.

[INFO] 
[INFO] --- install:3.1.1:install (default-install) @ olingo-odata2-parent ---
[INFO] Installing <https://ci-builds.apache.org/job/Olingo/job/olingo-odata2/ws/pom.xml> to /home/jenkins/.m2/repository/org/apache/olingo/olingo-odata2-parent/2.0.13/olingo-odata2-parent-2.0.13.pom
[INFO] 
[INFO] --- deploy:2.7:deploy (default-deploy) @ olingo-odata2-parent ---
Uploading to apache.releases.https: https://repository.apache.org/service/local/staging/deploy/maven2/org/apache/olingo/olingo-odata2-parent/2.0.13/olingo-odata2-parent-2.0.13.pom
[INFO] ------------------------------------------------------------------------
[INFO] Reactor Summary for olingo-odata2-parent 2.0.13:
[INFO] 
[INFO] olingo-odata2-parent ............................... FAILURE [ 11.098 s]
[INFO] olingo-odata2-lib .................................. SKIPPED
[INFO] olingo-odata2-api .................................. SKIPPED
[INFO] olingo-odata2-api-annotation ....................... SKIPPED
[INFO] olingo-odata2-testutil ............................. SKIPPED
[INFO] olingo-odata2-core ................................. SKIPPED
[INFO] olingo-odata2-ref .................................. SKIPPED
[INFO] olingo-odata2-fit .................................. SKIPPED
[INFO] olingo-odata2-ref-web .............................. SKIPPED
[INFO] olingo-odata2-client-api ........................... SKIPPED
[INFO] olingo-odata2-client-core .......................... SKIPPED
[INFO] olingo-odata2-jpa-processor ........................ SKIPPED
[INFO] olingo-odata2-jpa-processor-api .................... SKIPPED
[INFO] olingo-odata2-jpa-processor-core ................... SKIPPED
[INFO] olingo-odata2-jpa-processor-ref .................... SKIPPED
[INFO] olingo-odata2-jpa-processor-ref-web ................ SKIPPED
[INFO] olingo-odata2-annotation-processor ................. SKIPPED
[INFO] olingo-odata2-annotation-processor-api ............. SKIPPED
[INFO] olingo-odata2-annotation-processor-core ............ SKIPPED
[INFO] olingo-odata2-annotation-processor-ref ............. SKIPPED
[INFO] olingo-odata2-annotation-processor-ref-web ......... SKIPPED
[INFO] olingo-odata2-dist ................................. SKIPPED
[INFO] olingo-odata2-dist-lib ............................. SKIPPED
[INFO] olingo-odata2-dist-jpa ............................. SKIPPED
[INFO] olingo-odata2-dist-janos ........................... SKIPPED
[INFO] olingo-odata2-dist-ref ............................. SKIPPED
[INFO] olingo-odata2-dist-javadoc ......................... SKIPPED
[INFO] olingo-odata2-sample ............................... SKIPPED
[INFO] olingo-odata2-sample-cars-service-archetype ........ SKIPPED
[INFO] olingo-odata2-sample-cars-annotation-archetype ..... SKIPPED
[INFO] olingo-odata2-sample-cars-jpa-archetype ............ SKIPPED
[INFO] ------------------------------------------------------------------------
[INFO] BUILD FAILURE
[INFO] ------------------------------------------------------------------------
[INFO] Total time:  12.994 s
[INFO] Finished at: 2023-10-22T18:56:50Z
[INFO] ------------------------------------------------------------------------
[ERROR] Failed to execute goal org.apache.maven.plugins:maven-deploy-plugin:2.7:deploy (default-deploy) on project olingo-odata2-parent: Failed to deploy artifacts: Could not transfer artifact org.apache.olingo:olingo-odata2-parent:pom:2.0.13 from/to apache.releases.https (https://repository.apache.org/service/local/staging/deploy/maven2): status code: 401, reason phrase: Unauthorized (401) -> [Help 1]
[ERROR] 
[ERROR] To see the full stack trace of the errors, re-run Maven with the -e switch.
[ERROR] Re-run Maven using the -X switch to enable full debug logging.
[ERROR] 
[ERROR] For more information about the errors and possible solutions, please read the following articles:
[ERROR] [Help 1] http://cwiki.apache.org/confluence/display/MAVEN/MojoExecutionException
Build step 'Invoke top-level Maven targets' marked build as failure