You are viewing a plain text version of this content. The canonical link for it is here.
Posted to commits@myfaces.apache.org by Apache Jenkins Server <je...@builds.apache.org> on 2015/03/22 01:09:45 UTC
Build failed in Jenkins: myfaces-current11 #1764
See <https://builds.apache.org/job/myfaces-current11/1764/>
------------------------------------------
Started by upstream project "maven-plugins" build number 2686
originally caused by:
Started by an SCM change
Building remotely on solaris1 (Solaris) in workspace <https://builds.apache.org/job/myfaces-current11/ws/>
java.io.IOException: Failed to install http://archive.apache.org/dist/maven/binaries/apache-maven-2.2.1-bin.zip to /home/jenkins/tools/maven/apache-maven-2.2.1
at hudson.FilePath.installIfNecessaryFrom(FilePath.java:772)
at hudson.tools.DownloadFromUrlInstaller.performInstallation(DownloadFromUrlInstaller.java:70)
at hudson.tools.InstallerTranslator.getToolHome(InstallerTranslator.java:68)
at hudson.tools.ToolLocationNodeProperty.getToolHome(ToolLocationNodeProperty.java:107)
at hudson.tools.ToolInstallation.translateFor(ToolInstallation.java:204)
at hudson.tasks.Maven$MavenInstallation.forNode(Maven.java:609)
at hudson.maven.MavenModuleSetBuild.getEnvironment(MavenModuleSetBuild.java:182)
at hudson.scm.SubversionSCM.checkout(SubversionSCM.java:866)
at hudson.model.AbstractProject.checkout(AbstractProject.java:1252)
at hudson.model.AbstractBuild$AbstractBuildExecution.defaultCheckout(AbstractBuild.java:615)
at jenkins.scm.SCMCheckoutStrategy.checkout(SCMCheckoutStrategy.java:86)
at hudson.model.AbstractBuild$AbstractBuildExecution.run(AbstractBuild.java:524)
at hudson.model.Run.execute(Run.java:1706)
at hudson.maven.MavenModuleSetBuild.run(MavenModuleSetBuild.java:529)
at hudson.model.ResourceController.execute(ResourceController.java:88)
at hudson.model.Executor.run(Executor.java:232)
Caused by: java.io.IOException: Failed to mkdirs: /home/jenkins/tools/maven/apache-maven-2.2.1
at hudson.FilePath.mkdirs(FilePath.java:1075)
at hudson.FilePath.installIfNecessaryFrom(FilePath.java:738)
... 15 more
Retrying after 10 seconds
java.io.IOException: Failed to install http://archive.apache.org/dist/maven/binaries/apache-maven-2.2.1-bin.zip to /home/jenkins/tools/maven/apache-maven-2.2.1
at hudson.FilePath.installIfNecessaryFrom(FilePath.java:772)
at hudson.tools.DownloadFromUrlInstaller.performInstallation(DownloadFromUrlInstaller.java:70)
at hudson.tools.InstallerTranslator.getToolHome(InstallerTranslator.java:68)
at hudson.tools.ToolLocationNodeProperty.getToolHome(ToolLocationNodeProperty.java:107)
at hudson.tools.ToolInstallation.translateFor(ToolInstallation.java:204)
at hudson.tasks.Maven$MavenInstallation.forNode(Maven.java:609)
at hudson.maven.MavenModuleSetBuild.getEnvironment(MavenModuleSetBuild.java:182)
at hudson.scm.SubversionSCM.checkout(SubversionSCM.java:866)
at hudson.model.AbstractProject.checkout(AbstractProject.java:1252)
at hudson.model.AbstractBuild$AbstractBuildExecution.defaultCheckout(AbstractBuild.java:615)
at jenkins.scm.SCMCheckoutStrategy.checkout(SCMCheckoutStrategy.java:86)
at hudson.model.AbstractBuild$AbstractBuildExecution.run(AbstractBuild.java:524)
at hudson.model.Run.execute(Run.java:1706)
at hudson.maven.MavenModuleSetBuild.run(MavenModuleSetBuild.java:529)
at hudson.model.ResourceController.execute(ResourceController.java:88)
at hudson.model.Executor.run(Executor.java:232)
Caused by: java.io.IOException: Failed to mkdirs: /home/jenkins/tools/maven/apache-maven-2.2.1
at hudson.FilePath.mkdirs(FilePath.java:1075)
at hudson.FilePath.installIfNecessaryFrom(FilePath.java:738)
... 15 more
Retrying after 10 seconds
java.io.IOException: Failed to install http://archive.apache.org/dist/maven/binaries/apache-maven-2.2.1-bin.zip to /home/jenkins/tools/maven/apache-maven-2.2.1
at hudson.FilePath.installIfNecessaryFrom(FilePath.java:772)
at hudson.tools.DownloadFromUrlInstaller.performInstallation(DownloadFromUrlInstaller.java:70)
at hudson.tools.InstallerTranslator.getToolHome(InstallerTranslator.java:68)
at hudson.tools.ToolLocationNodeProperty.getToolHome(ToolLocationNodeProperty.java:107)
at hudson.tools.ToolInstallation.translateFor(ToolInstallation.java:204)
at hudson.tasks.Maven$MavenInstallation.forNode(Maven.java:609)
at hudson.maven.MavenModuleSetBuild.getEnvironment(MavenModuleSetBuild.java:182)
at hudson.scm.SubversionSCM.checkout(SubversionSCM.java:866)
at hudson.model.AbstractProject.checkout(AbstractProject.java:1252)
at hudson.model.AbstractBuild$AbstractBuildExecution.defaultCheckout(AbstractBuild.java:615)
at jenkins.scm.SCMCheckoutStrategy.checkout(SCMCheckoutStrategy.java:86)
at hudson.model.AbstractBuild$AbstractBuildExecution.run(AbstractBuild.java:524)
at hudson.model.Run.execute(Run.java:1706)
at hudson.maven.MavenModuleSetBuild.run(MavenModuleSetBuild.java:529)
at hudson.model.ResourceController.execute(ResourceController.java:88)
at hudson.model.Executor.run(Executor.java:232)
Caused by: java.io.IOException: Failed to mkdirs: /home/jenkins/tools/maven/apache-maven-2.2.1
at hudson.FilePath.mkdirs(FilePath.java:1075)
at hudson.FilePath.installIfNecessaryFrom(FilePath.java:738)
... 15 more
Jenkins build is back to normal : myfaces-current11 #1771
Posted by Apache Jenkins Server <je...@builds.apache.org>.
See <https://builds.apache.org/job/myfaces-current11/1771/>
Build failed in Jenkins: myfaces-current11 #1770
Posted by Apache Jenkins Server <je...@builds.apache.org>.
See <https://builds.apache.org/job/myfaces-current11/1770/>
------------------------------------------
Started by upstream project "maven-plugins" build number 2692
originally caused by:
Started by an SCM change
Building remotely on solaris1 (Solaris) in workspace <https://builds.apache.org/job/myfaces-current11/ws/>
java.io.IOException: Failed to install http://archive.apache.org/dist/maven/binaries/apache-maven-2.2.1-bin.zip to /home/jenkins/tools/maven/apache-maven-2.2.1
at hudson.FilePath.installIfNecessaryFrom(FilePath.java:772)
at hudson.tools.DownloadFromUrlInstaller.performInstallation(DownloadFromUrlInstaller.java:70)
at hudson.tools.InstallerTranslator.getToolHome(InstallerTranslator.java:68)
at hudson.tools.ToolLocationNodeProperty.getToolHome(ToolLocationNodeProperty.java:107)
at hudson.tools.ToolInstallation.translateFor(ToolInstallation.java:204)
at hudson.tasks.Maven$MavenInstallation.forNode(Maven.java:609)
at hudson.maven.MavenModuleSetBuild.getEnvironment(MavenModuleSetBuild.java:182)
at hudson.scm.SubversionSCM.checkout(SubversionSCM.java:866)
at hudson.model.AbstractProject.checkout(AbstractProject.java:1252)
at hudson.model.AbstractBuild$AbstractBuildExecution.defaultCheckout(AbstractBuild.java:615)
at jenkins.scm.SCMCheckoutStrategy.checkout(SCMCheckoutStrategy.java:86)
at hudson.model.AbstractBuild$AbstractBuildExecution.run(AbstractBuild.java:524)
at hudson.model.Run.execute(Run.java:1706)
at hudson.maven.MavenModuleSetBuild.run(MavenModuleSetBuild.java:529)
at hudson.model.ResourceController.execute(ResourceController.java:88)
at hudson.model.Executor.run(Executor.java:232)
Caused by: java.io.IOException: Failed to mkdirs: /home/jenkins/tools/maven/apache-maven-2.2.1
at hudson.FilePath.mkdirs(FilePath.java:1075)
at hudson.FilePath.installIfNecessaryFrom(FilePath.java:738)
... 15 more
Retrying after 10 seconds
java.io.IOException: Failed to install http://archive.apache.org/dist/maven/binaries/apache-maven-2.2.1-bin.zip to /home/jenkins/tools/maven/apache-maven-2.2.1
at hudson.FilePath.installIfNecessaryFrom(FilePath.java:772)
at hudson.tools.DownloadFromUrlInstaller.performInstallation(DownloadFromUrlInstaller.java:70)
at hudson.tools.InstallerTranslator.getToolHome(InstallerTranslator.java:68)
at hudson.tools.ToolLocationNodeProperty.getToolHome(ToolLocationNodeProperty.java:107)
at hudson.tools.ToolInstallation.translateFor(ToolInstallation.java:204)
at hudson.tasks.Maven$MavenInstallation.forNode(Maven.java:609)
at hudson.maven.MavenModuleSetBuild.getEnvironment(MavenModuleSetBuild.java:182)
at hudson.scm.SubversionSCM.checkout(SubversionSCM.java:866)
at hudson.model.AbstractProject.checkout(AbstractProject.java:1252)
at hudson.model.AbstractBuild$AbstractBuildExecution.defaultCheckout(AbstractBuild.java:615)
at jenkins.scm.SCMCheckoutStrategy.checkout(SCMCheckoutStrategy.java:86)
at hudson.model.AbstractBuild$AbstractBuildExecution.run(AbstractBuild.java:524)
at hudson.model.Run.execute(Run.java:1706)
at hudson.maven.MavenModuleSetBuild.run(MavenModuleSetBuild.java:529)
at hudson.model.ResourceController.execute(ResourceController.java:88)
at hudson.model.Executor.run(Executor.java:232)
Caused by: java.io.IOException: Failed to mkdirs: /home/jenkins/tools/maven/apache-maven-2.2.1
at hudson.FilePath.mkdirs(FilePath.java:1075)
at hudson.FilePath.installIfNecessaryFrom(FilePath.java:738)
... 15 more
Retrying after 10 seconds
java.io.IOException: Failed to install http://archive.apache.org/dist/maven/binaries/apache-maven-2.2.1-bin.zip to /home/jenkins/tools/maven/apache-maven-2.2.1
at hudson.FilePath.installIfNecessaryFrom(FilePath.java:772)
at hudson.tools.DownloadFromUrlInstaller.performInstallation(DownloadFromUrlInstaller.java:70)
at hudson.tools.InstallerTranslator.getToolHome(InstallerTranslator.java:68)
at hudson.tools.ToolLocationNodeProperty.getToolHome(ToolLocationNodeProperty.java:107)
at hudson.tools.ToolInstallation.translateFor(ToolInstallation.java:204)
at hudson.tasks.Maven$MavenInstallation.forNode(Maven.java:609)
at hudson.maven.MavenModuleSetBuild.getEnvironment(MavenModuleSetBuild.java:182)
at hudson.scm.SubversionSCM.checkout(SubversionSCM.java:866)
at hudson.model.AbstractProject.checkout(AbstractProject.java:1252)
at hudson.model.AbstractBuild$AbstractBuildExecution.defaultCheckout(AbstractBuild.java:615)
at jenkins.scm.SCMCheckoutStrategy.checkout(SCMCheckoutStrategy.java:86)
at hudson.model.AbstractBuild$AbstractBuildExecution.run(AbstractBuild.java:524)
at hudson.model.Run.execute(Run.java:1706)
at hudson.maven.MavenModuleSetBuild.run(MavenModuleSetBuild.java:529)
at hudson.model.ResourceController.execute(ResourceController.java:88)
at hudson.model.Executor.run(Executor.java:232)
Caused by: java.io.IOException: Failed to mkdirs: /home/jenkins/tools/maven/apache-maven-2.2.1
at hudson.FilePath.mkdirs(FilePath.java:1075)
at hudson.FilePath.installIfNecessaryFrom(FilePath.java:738)
... 15 more
Build failed in Jenkins: myfaces-current11 #1769
Posted by Apache Jenkins Server <je...@builds.apache.org>.
See <https://builds.apache.org/job/myfaces-current11/1769/>
------------------------------------------
Started by upstream project "maven-plugins" build number 2691
originally caused by:
Started by an SCM change
Building remotely on solaris1 (Solaris) in workspace <https://builds.apache.org/job/myfaces-current11/ws/>
java.io.IOException: Failed to install http://archive.apache.org/dist/maven/binaries/apache-maven-2.2.1-bin.zip to /home/jenkins/tools/maven/apache-maven-2.2.1
at hudson.FilePath.installIfNecessaryFrom(FilePath.java:772)
at hudson.tools.DownloadFromUrlInstaller.performInstallation(DownloadFromUrlInstaller.java:70)
at hudson.tools.InstallerTranslator.getToolHome(InstallerTranslator.java:68)
at hudson.tools.ToolLocationNodeProperty.getToolHome(ToolLocationNodeProperty.java:107)
at hudson.tools.ToolInstallation.translateFor(ToolInstallation.java:204)
at hudson.tasks.Maven$MavenInstallation.forNode(Maven.java:609)
at hudson.maven.MavenModuleSetBuild.getEnvironment(MavenModuleSetBuild.java:182)
at hudson.scm.SubversionSCM.checkout(SubversionSCM.java:866)
at hudson.model.AbstractProject.checkout(AbstractProject.java:1252)
at hudson.model.AbstractBuild$AbstractBuildExecution.defaultCheckout(AbstractBuild.java:615)
at jenkins.scm.SCMCheckoutStrategy.checkout(SCMCheckoutStrategy.java:86)
at hudson.model.AbstractBuild$AbstractBuildExecution.run(AbstractBuild.java:524)
at hudson.model.Run.execute(Run.java:1706)
at hudson.maven.MavenModuleSetBuild.run(MavenModuleSetBuild.java:529)
at hudson.model.ResourceController.execute(ResourceController.java:88)
at hudson.model.Executor.run(Executor.java:232)
Caused by: java.io.IOException: Failed to mkdirs: /home/jenkins/tools/maven/apache-maven-2.2.1
at hudson.FilePath.mkdirs(FilePath.java:1075)
at hudson.FilePath.installIfNecessaryFrom(FilePath.java:738)
... 15 more
Retrying after 10 seconds
java.io.IOException: Failed to install http://archive.apache.org/dist/maven/binaries/apache-maven-2.2.1-bin.zip to /home/jenkins/tools/maven/apache-maven-2.2.1
at hudson.FilePath.installIfNecessaryFrom(FilePath.java:772)
at hudson.tools.DownloadFromUrlInstaller.performInstallation(DownloadFromUrlInstaller.java:70)
at hudson.tools.InstallerTranslator.getToolHome(InstallerTranslator.java:68)
at hudson.tools.ToolLocationNodeProperty.getToolHome(ToolLocationNodeProperty.java:107)
at hudson.tools.ToolInstallation.translateFor(ToolInstallation.java:204)
at hudson.tasks.Maven$MavenInstallation.forNode(Maven.java:609)
at hudson.maven.MavenModuleSetBuild.getEnvironment(MavenModuleSetBuild.java:182)
at hudson.scm.SubversionSCM.checkout(SubversionSCM.java:866)
at hudson.model.AbstractProject.checkout(AbstractProject.java:1252)
at hudson.model.AbstractBuild$AbstractBuildExecution.defaultCheckout(AbstractBuild.java:615)
at jenkins.scm.SCMCheckoutStrategy.checkout(SCMCheckoutStrategy.java:86)
at hudson.model.AbstractBuild$AbstractBuildExecution.run(AbstractBuild.java:524)
at hudson.model.Run.execute(Run.java:1706)
at hudson.maven.MavenModuleSetBuild.run(MavenModuleSetBuild.java:529)
at hudson.model.ResourceController.execute(ResourceController.java:88)
at hudson.model.Executor.run(Executor.java:232)
Caused by: java.io.IOException: Failed to mkdirs: /home/jenkins/tools/maven/apache-maven-2.2.1
at hudson.FilePath.mkdirs(FilePath.java:1075)
at hudson.FilePath.installIfNecessaryFrom(FilePath.java:738)
... 15 more
Retrying after 10 seconds
java.io.IOException: Failed to install http://archive.apache.org/dist/maven/binaries/apache-maven-2.2.1-bin.zip to /home/jenkins/tools/maven/apache-maven-2.2.1
at hudson.FilePath.installIfNecessaryFrom(FilePath.java:772)
at hudson.tools.DownloadFromUrlInstaller.performInstallation(DownloadFromUrlInstaller.java:70)
at hudson.tools.InstallerTranslator.getToolHome(InstallerTranslator.java:68)
at hudson.tools.ToolLocationNodeProperty.getToolHome(ToolLocationNodeProperty.java:107)
at hudson.tools.ToolInstallation.translateFor(ToolInstallation.java:204)
at hudson.tasks.Maven$MavenInstallation.forNode(Maven.java:609)
at hudson.maven.MavenModuleSetBuild.getEnvironment(MavenModuleSetBuild.java:182)
at hudson.scm.SubversionSCM.checkout(SubversionSCM.java:866)
at hudson.model.AbstractProject.checkout(AbstractProject.java:1252)
at hudson.model.AbstractBuild$AbstractBuildExecution.defaultCheckout(AbstractBuild.java:615)
at jenkins.scm.SCMCheckoutStrategy.checkout(SCMCheckoutStrategy.java:86)
at hudson.model.AbstractBuild$AbstractBuildExecution.run(AbstractBuild.java:524)
at hudson.model.Run.execute(Run.java:1706)
at hudson.maven.MavenModuleSetBuild.run(MavenModuleSetBuild.java:529)
at hudson.model.ResourceController.execute(ResourceController.java:88)
at hudson.model.Executor.run(Executor.java:232)
Caused by: java.io.IOException: Failed to mkdirs: /home/jenkins/tools/maven/apache-maven-2.2.1
at hudson.FilePath.mkdirs(FilePath.java:1075)
at hudson.FilePath.installIfNecessaryFrom(FilePath.java:738)
... 15 more
Build failed in Jenkins: myfaces-current11 #1768
Posted by Apache Jenkins Server <je...@builds.apache.org>.
See <https://builds.apache.org/job/myfaces-current11/1768/>
------------------------------------------
Started by upstream project "maven-plugins" build number 2690
originally caused by:
Started by an SCM change
Building remotely on solaris1 (Solaris) in workspace <https://builds.apache.org/job/myfaces-current11/ws/>
java.io.IOException: Failed to install http://archive.apache.org/dist/maven/binaries/apache-maven-2.2.1-bin.zip to /home/jenkins/tools/maven/apache-maven-2.2.1
at hudson.FilePath.installIfNecessaryFrom(FilePath.java:772)
at hudson.tools.DownloadFromUrlInstaller.performInstallation(DownloadFromUrlInstaller.java:70)
at hudson.tools.InstallerTranslator.getToolHome(InstallerTranslator.java:68)
at hudson.tools.ToolLocationNodeProperty.getToolHome(ToolLocationNodeProperty.java:107)
at hudson.tools.ToolInstallation.translateFor(ToolInstallation.java:204)
at hudson.tasks.Maven$MavenInstallation.forNode(Maven.java:609)
at hudson.maven.MavenModuleSetBuild.getEnvironment(MavenModuleSetBuild.java:182)
at hudson.scm.SubversionSCM.checkout(SubversionSCM.java:866)
at hudson.model.AbstractProject.checkout(AbstractProject.java:1252)
at hudson.model.AbstractBuild$AbstractBuildExecution.defaultCheckout(AbstractBuild.java:615)
at jenkins.scm.SCMCheckoutStrategy.checkout(SCMCheckoutStrategy.java:86)
at hudson.model.AbstractBuild$AbstractBuildExecution.run(AbstractBuild.java:524)
at hudson.model.Run.execute(Run.java:1706)
at hudson.maven.MavenModuleSetBuild.run(MavenModuleSetBuild.java:529)
at hudson.model.ResourceController.execute(ResourceController.java:88)
at hudson.model.Executor.run(Executor.java:232)
Caused by: java.io.IOException: Failed to mkdirs: /home/jenkins/tools/maven/apache-maven-2.2.1
at hudson.FilePath.mkdirs(FilePath.java:1075)
at hudson.FilePath.installIfNecessaryFrom(FilePath.java:738)
... 15 more
Retrying after 10 seconds
java.io.IOException: Failed to install http://archive.apache.org/dist/maven/binaries/apache-maven-2.2.1-bin.zip to /home/jenkins/tools/maven/apache-maven-2.2.1
at hudson.FilePath.installIfNecessaryFrom(FilePath.java:772)
at hudson.tools.DownloadFromUrlInstaller.performInstallation(DownloadFromUrlInstaller.java:70)
at hudson.tools.InstallerTranslator.getToolHome(InstallerTranslator.java:68)
at hudson.tools.ToolLocationNodeProperty.getToolHome(ToolLocationNodeProperty.java:107)
at hudson.tools.ToolInstallation.translateFor(ToolInstallation.java:204)
at hudson.tasks.Maven$MavenInstallation.forNode(Maven.java:609)
at hudson.maven.MavenModuleSetBuild.getEnvironment(MavenModuleSetBuild.java:182)
at hudson.scm.SubversionSCM.checkout(SubversionSCM.java:866)
at hudson.model.AbstractProject.checkout(AbstractProject.java:1252)
at hudson.model.AbstractBuild$AbstractBuildExecution.defaultCheckout(AbstractBuild.java:615)
at jenkins.scm.SCMCheckoutStrategy.checkout(SCMCheckoutStrategy.java:86)
at hudson.model.AbstractBuild$AbstractBuildExecution.run(AbstractBuild.java:524)
at hudson.model.Run.execute(Run.java:1706)
at hudson.maven.MavenModuleSetBuild.run(MavenModuleSetBuild.java:529)
at hudson.model.ResourceController.execute(ResourceController.java:88)
at hudson.model.Executor.run(Executor.java:232)
Caused by: java.io.IOException: Failed to mkdirs: /home/jenkins/tools/maven/apache-maven-2.2.1
at hudson.FilePath.mkdirs(FilePath.java:1075)
at hudson.FilePath.installIfNecessaryFrom(FilePath.java:738)
... 15 more
Retrying after 10 seconds
java.io.IOException: Failed to install http://archive.apache.org/dist/maven/binaries/apache-maven-2.2.1-bin.zip to /home/jenkins/tools/maven/apache-maven-2.2.1
at hudson.FilePath.installIfNecessaryFrom(FilePath.java:772)
at hudson.tools.DownloadFromUrlInstaller.performInstallation(DownloadFromUrlInstaller.java:70)
at hudson.tools.InstallerTranslator.getToolHome(InstallerTranslator.java:68)
at hudson.tools.ToolLocationNodeProperty.getToolHome(ToolLocationNodeProperty.java:107)
at hudson.tools.ToolInstallation.translateFor(ToolInstallation.java:204)
at hudson.tasks.Maven$MavenInstallation.forNode(Maven.java:609)
at hudson.maven.MavenModuleSetBuild.getEnvironment(MavenModuleSetBuild.java:182)
at hudson.scm.SubversionSCM.checkout(SubversionSCM.java:866)
at hudson.model.AbstractProject.checkout(AbstractProject.java:1252)
at hudson.model.AbstractBuild$AbstractBuildExecution.defaultCheckout(AbstractBuild.java:615)
at jenkins.scm.SCMCheckoutStrategy.checkout(SCMCheckoutStrategy.java:86)
at hudson.model.AbstractBuild$AbstractBuildExecution.run(AbstractBuild.java:524)
at hudson.model.Run.execute(Run.java:1706)
at hudson.maven.MavenModuleSetBuild.run(MavenModuleSetBuild.java:529)
at hudson.model.ResourceController.execute(ResourceController.java:88)
at hudson.model.Executor.run(Executor.java:232)
Caused by: java.io.IOException: Failed to mkdirs: /home/jenkins/tools/maven/apache-maven-2.2.1
at hudson.FilePath.mkdirs(FilePath.java:1075)
at hudson.FilePath.installIfNecessaryFrom(FilePath.java:738)
... 15 more
Build failed in Jenkins: myfaces-current11 #1767
Posted by Apache Jenkins Server <je...@builds.apache.org>.
See <https://builds.apache.org/job/myfaces-current11/1767/>
------------------------------------------
Started by upstream project "maven-plugins" build number 2689
originally caused by:
Started by an SCM change
Building remotely on solaris1 (Solaris) in workspace <https://builds.apache.org/job/myfaces-current11/ws/>
java.io.IOException: Failed to install http://archive.apache.org/dist/maven/binaries/apache-maven-2.2.1-bin.zip to /home/jenkins/tools/maven/apache-maven-2.2.1
at hudson.FilePath.installIfNecessaryFrom(FilePath.java:772)
at hudson.tools.DownloadFromUrlInstaller.performInstallation(DownloadFromUrlInstaller.java:70)
at hudson.tools.InstallerTranslator.getToolHome(InstallerTranslator.java:68)
at hudson.tools.ToolLocationNodeProperty.getToolHome(ToolLocationNodeProperty.java:107)
at hudson.tools.ToolInstallation.translateFor(ToolInstallation.java:204)
at hudson.tasks.Maven$MavenInstallation.forNode(Maven.java:609)
at hudson.maven.MavenModuleSetBuild.getEnvironment(MavenModuleSetBuild.java:182)
at hudson.scm.SubversionSCM.checkout(SubversionSCM.java:866)
at hudson.model.AbstractProject.checkout(AbstractProject.java:1252)
at hudson.model.AbstractBuild$AbstractBuildExecution.defaultCheckout(AbstractBuild.java:615)
at jenkins.scm.SCMCheckoutStrategy.checkout(SCMCheckoutStrategy.java:86)
at hudson.model.AbstractBuild$AbstractBuildExecution.run(AbstractBuild.java:524)
at hudson.model.Run.execute(Run.java:1706)
at hudson.maven.MavenModuleSetBuild.run(MavenModuleSetBuild.java:529)
at hudson.model.ResourceController.execute(ResourceController.java:88)
at hudson.model.Executor.run(Executor.java:232)
Caused by: java.io.IOException: Failed to mkdirs: /home/jenkins/tools/maven/apache-maven-2.2.1
at hudson.FilePath.mkdirs(FilePath.java:1075)
at hudson.FilePath.installIfNecessaryFrom(FilePath.java:738)
... 15 more
Retrying after 10 seconds
java.io.IOException: Failed to install http://archive.apache.org/dist/maven/binaries/apache-maven-2.2.1-bin.zip to /home/jenkins/tools/maven/apache-maven-2.2.1
at hudson.FilePath.installIfNecessaryFrom(FilePath.java:772)
at hudson.tools.DownloadFromUrlInstaller.performInstallation(DownloadFromUrlInstaller.java:70)
at hudson.tools.InstallerTranslator.getToolHome(InstallerTranslator.java:68)
at hudson.tools.ToolLocationNodeProperty.getToolHome(ToolLocationNodeProperty.java:107)
at hudson.tools.ToolInstallation.translateFor(ToolInstallation.java:204)
at hudson.tasks.Maven$MavenInstallation.forNode(Maven.java:609)
at hudson.maven.MavenModuleSetBuild.getEnvironment(MavenModuleSetBuild.java:182)
at hudson.scm.SubversionSCM.checkout(SubversionSCM.java:866)
at hudson.model.AbstractProject.checkout(AbstractProject.java:1252)
at hudson.model.AbstractBuild$AbstractBuildExecution.defaultCheckout(AbstractBuild.java:615)
at jenkins.scm.SCMCheckoutStrategy.checkout(SCMCheckoutStrategy.java:86)
at hudson.model.AbstractBuild$AbstractBuildExecution.run(AbstractBuild.java:524)
at hudson.model.Run.execute(Run.java:1706)
at hudson.maven.MavenModuleSetBuild.run(MavenModuleSetBuild.java:529)
at hudson.model.ResourceController.execute(ResourceController.java:88)
at hudson.model.Executor.run(Executor.java:232)
Caused by: java.io.IOException: Failed to mkdirs: /home/jenkins/tools/maven/apache-maven-2.2.1
at hudson.FilePath.mkdirs(FilePath.java:1075)
at hudson.FilePath.installIfNecessaryFrom(FilePath.java:738)
... 15 more
Retrying after 10 seconds
java.io.IOException: Failed to install http://archive.apache.org/dist/maven/binaries/apache-maven-2.2.1-bin.zip to /home/jenkins/tools/maven/apache-maven-2.2.1
at hudson.FilePath.installIfNecessaryFrom(FilePath.java:772)
at hudson.tools.DownloadFromUrlInstaller.performInstallation(DownloadFromUrlInstaller.java:70)
at hudson.tools.InstallerTranslator.getToolHome(InstallerTranslator.java:68)
at hudson.tools.ToolLocationNodeProperty.getToolHome(ToolLocationNodeProperty.java:107)
at hudson.tools.ToolInstallation.translateFor(ToolInstallation.java:204)
at hudson.tasks.Maven$MavenInstallation.forNode(Maven.java:609)
at hudson.maven.MavenModuleSetBuild.getEnvironment(MavenModuleSetBuild.java:182)
at hudson.scm.SubversionSCM.checkout(SubversionSCM.java:866)
at hudson.model.AbstractProject.checkout(AbstractProject.java:1252)
at hudson.model.AbstractBuild$AbstractBuildExecution.defaultCheckout(AbstractBuild.java:615)
at jenkins.scm.SCMCheckoutStrategy.checkout(SCMCheckoutStrategy.java:86)
at hudson.model.AbstractBuild$AbstractBuildExecution.run(AbstractBuild.java:524)
at hudson.model.Run.execute(Run.java:1706)
at hudson.maven.MavenModuleSetBuild.run(MavenModuleSetBuild.java:529)
at hudson.model.ResourceController.execute(ResourceController.java:88)
at hudson.model.Executor.run(Executor.java:232)
Caused by: java.io.IOException: Failed to mkdirs: /home/jenkins/tools/maven/apache-maven-2.2.1
at hudson.FilePath.mkdirs(FilePath.java:1075)
at hudson.FilePath.installIfNecessaryFrom(FilePath.java:738)
... 15 more
Build failed in Jenkins: myfaces-current11 #1766
Posted by Apache Jenkins Server <je...@builds.apache.org>.
See <https://builds.apache.org/job/myfaces-current11/1766/>
------------------------------------------
Started by upstream project "maven-plugins" build number 2688
originally caused by:
Started by an SCM change
Building remotely on solaris1 (Solaris) in workspace <https://builds.apache.org/job/myfaces-current11/ws/>
java.io.IOException: Failed to install http://archive.apache.org/dist/maven/binaries/apache-maven-2.2.1-bin.zip to /home/jenkins/tools/maven/apache-maven-2.2.1
at hudson.FilePath.installIfNecessaryFrom(FilePath.java:772)
at hudson.tools.DownloadFromUrlInstaller.performInstallation(DownloadFromUrlInstaller.java:70)
at hudson.tools.InstallerTranslator.getToolHome(InstallerTranslator.java:68)
at hudson.tools.ToolLocationNodeProperty.getToolHome(ToolLocationNodeProperty.java:107)
at hudson.tools.ToolInstallation.translateFor(ToolInstallation.java:204)
at hudson.tasks.Maven$MavenInstallation.forNode(Maven.java:609)
at hudson.maven.MavenModuleSetBuild.getEnvironment(MavenModuleSetBuild.java:182)
at hudson.scm.SubversionSCM.checkout(SubversionSCM.java:866)
at hudson.model.AbstractProject.checkout(AbstractProject.java:1252)
at hudson.model.AbstractBuild$AbstractBuildExecution.defaultCheckout(AbstractBuild.java:615)
at jenkins.scm.SCMCheckoutStrategy.checkout(SCMCheckoutStrategy.java:86)
at hudson.model.AbstractBuild$AbstractBuildExecution.run(AbstractBuild.java:524)
at hudson.model.Run.execute(Run.java:1706)
at hudson.maven.MavenModuleSetBuild.run(MavenModuleSetBuild.java:529)
at hudson.model.ResourceController.execute(ResourceController.java:88)
at hudson.model.Executor.run(Executor.java:232)
Caused by: java.io.IOException: Failed to mkdirs: /home/jenkins/tools/maven/apache-maven-2.2.1
at hudson.FilePath.mkdirs(FilePath.java:1075)
at hudson.FilePath.installIfNecessaryFrom(FilePath.java:738)
... 15 more
Retrying after 10 seconds
java.io.IOException: Failed to install http://archive.apache.org/dist/maven/binaries/apache-maven-2.2.1-bin.zip to /home/jenkins/tools/maven/apache-maven-2.2.1
at hudson.FilePath.installIfNecessaryFrom(FilePath.java:772)
at hudson.tools.DownloadFromUrlInstaller.performInstallation(DownloadFromUrlInstaller.java:70)
at hudson.tools.InstallerTranslator.getToolHome(InstallerTranslator.java:68)
at hudson.tools.ToolLocationNodeProperty.getToolHome(ToolLocationNodeProperty.java:107)
at hudson.tools.ToolInstallation.translateFor(ToolInstallation.java:204)
at hudson.tasks.Maven$MavenInstallation.forNode(Maven.java:609)
at hudson.maven.MavenModuleSetBuild.getEnvironment(MavenModuleSetBuild.java:182)
at hudson.scm.SubversionSCM.checkout(SubversionSCM.java:866)
at hudson.model.AbstractProject.checkout(AbstractProject.java:1252)
at hudson.model.AbstractBuild$AbstractBuildExecution.defaultCheckout(AbstractBuild.java:615)
at jenkins.scm.SCMCheckoutStrategy.checkout(SCMCheckoutStrategy.java:86)
at hudson.model.AbstractBuild$AbstractBuildExecution.run(AbstractBuild.java:524)
at hudson.model.Run.execute(Run.java:1706)
at hudson.maven.MavenModuleSetBuild.run(MavenModuleSetBuild.java:529)
at hudson.model.ResourceController.execute(ResourceController.java:88)
at hudson.model.Executor.run(Executor.java:232)
Caused by: java.io.IOException: Failed to mkdirs: /home/jenkins/tools/maven/apache-maven-2.2.1
at hudson.FilePath.mkdirs(FilePath.java:1075)
at hudson.FilePath.installIfNecessaryFrom(FilePath.java:738)
... 15 more
Retrying after 10 seconds
java.io.IOException: Failed to install http://archive.apache.org/dist/maven/binaries/apache-maven-2.2.1-bin.zip to /home/jenkins/tools/maven/apache-maven-2.2.1
at hudson.FilePath.installIfNecessaryFrom(FilePath.java:772)
at hudson.tools.DownloadFromUrlInstaller.performInstallation(DownloadFromUrlInstaller.java:70)
at hudson.tools.InstallerTranslator.getToolHome(InstallerTranslator.java:68)
at hudson.tools.ToolLocationNodeProperty.getToolHome(ToolLocationNodeProperty.java:107)
at hudson.tools.ToolInstallation.translateFor(ToolInstallation.java:204)
at hudson.tasks.Maven$MavenInstallation.forNode(Maven.java:609)
at hudson.maven.MavenModuleSetBuild.getEnvironment(MavenModuleSetBuild.java:182)
at hudson.scm.SubversionSCM.checkout(SubversionSCM.java:866)
at hudson.model.AbstractProject.checkout(AbstractProject.java:1252)
at hudson.model.AbstractBuild$AbstractBuildExecution.defaultCheckout(AbstractBuild.java:615)
at jenkins.scm.SCMCheckoutStrategy.checkout(SCMCheckoutStrategy.java:86)
at hudson.model.AbstractBuild$AbstractBuildExecution.run(AbstractBuild.java:524)
at hudson.model.Run.execute(Run.java:1706)
at hudson.maven.MavenModuleSetBuild.run(MavenModuleSetBuild.java:529)
at hudson.model.ResourceController.execute(ResourceController.java:88)
at hudson.model.Executor.run(Executor.java:232)
Caused by: java.io.IOException: Failed to mkdirs: /home/jenkins/tools/maven/apache-maven-2.2.1
at hudson.FilePath.mkdirs(FilePath.java:1075)
at hudson.FilePath.installIfNecessaryFrom(FilePath.java:738)
... 15 more
Build failed in Jenkins: myfaces-current11 #1765
Posted by Apache Jenkins Server <je...@builds.apache.org>.
See <https://builds.apache.org/job/myfaces-current11/1765/>
------------------------------------------
Started by upstream project "maven-plugins" build number 2687
originally caused by:
Started by an SCM change
Building remotely on solaris1 (Solaris) in workspace <https://builds.apache.org/job/myfaces-current11/ws/>
java.io.IOException: Failed to install http://archive.apache.org/dist/maven/binaries/apache-maven-2.2.1-bin.zip to /home/jenkins/tools/maven/apache-maven-2.2.1
at hudson.FilePath.installIfNecessaryFrom(FilePath.java:772)
at hudson.tools.DownloadFromUrlInstaller.performInstallation(DownloadFromUrlInstaller.java:70)
at hudson.tools.InstallerTranslator.getToolHome(InstallerTranslator.java:68)
at hudson.tools.ToolLocationNodeProperty.getToolHome(ToolLocationNodeProperty.java:107)
at hudson.tools.ToolInstallation.translateFor(ToolInstallation.java:204)
at hudson.tasks.Maven$MavenInstallation.forNode(Maven.java:609)
at hudson.maven.MavenModuleSetBuild.getEnvironment(MavenModuleSetBuild.java:182)
at hudson.scm.SubversionSCM.checkout(SubversionSCM.java:866)
at hudson.model.AbstractProject.checkout(AbstractProject.java:1252)
at hudson.model.AbstractBuild$AbstractBuildExecution.defaultCheckout(AbstractBuild.java:615)
at jenkins.scm.SCMCheckoutStrategy.checkout(SCMCheckoutStrategy.java:86)
at hudson.model.AbstractBuild$AbstractBuildExecution.run(AbstractBuild.java:524)
at hudson.model.Run.execute(Run.java:1706)
at hudson.maven.MavenModuleSetBuild.run(MavenModuleSetBuild.java:529)
at hudson.model.ResourceController.execute(ResourceController.java:88)
at hudson.model.Executor.run(Executor.java:232)
Caused by: java.io.IOException: Failed to mkdirs: /home/jenkins/tools/maven/apache-maven-2.2.1
at hudson.FilePath.mkdirs(FilePath.java:1075)
at hudson.FilePath.installIfNecessaryFrom(FilePath.java:738)
... 15 more
Retrying after 10 seconds
java.io.IOException: Failed to install http://archive.apache.org/dist/maven/binaries/apache-maven-2.2.1-bin.zip to /home/jenkins/tools/maven/apache-maven-2.2.1
at hudson.FilePath.installIfNecessaryFrom(FilePath.java:772)
at hudson.tools.DownloadFromUrlInstaller.performInstallation(DownloadFromUrlInstaller.java:70)
at hudson.tools.InstallerTranslator.getToolHome(InstallerTranslator.java:68)
at hudson.tools.ToolLocationNodeProperty.getToolHome(ToolLocationNodeProperty.java:107)
at hudson.tools.ToolInstallation.translateFor(ToolInstallation.java:204)
at hudson.tasks.Maven$MavenInstallation.forNode(Maven.java:609)
at hudson.maven.MavenModuleSetBuild.getEnvironment(MavenModuleSetBuild.java:182)
at hudson.scm.SubversionSCM.checkout(SubversionSCM.java:866)
at hudson.model.AbstractProject.checkout(AbstractProject.java:1252)
at hudson.model.AbstractBuild$AbstractBuildExecution.defaultCheckout(AbstractBuild.java:615)
at jenkins.scm.SCMCheckoutStrategy.checkout(SCMCheckoutStrategy.java:86)
at hudson.model.AbstractBuild$AbstractBuildExecution.run(AbstractBuild.java:524)
at hudson.model.Run.execute(Run.java:1706)
at hudson.maven.MavenModuleSetBuild.run(MavenModuleSetBuild.java:529)
at hudson.model.ResourceController.execute(ResourceController.java:88)
at hudson.model.Executor.run(Executor.java:232)
Caused by: java.io.IOException: Failed to mkdirs: /home/jenkins/tools/maven/apache-maven-2.2.1
at hudson.FilePath.mkdirs(FilePath.java:1075)
at hudson.FilePath.installIfNecessaryFrom(FilePath.java:738)
... 15 more
Retrying after 10 seconds
java.io.IOException: Failed to install http://archive.apache.org/dist/maven/binaries/apache-maven-2.2.1-bin.zip to /home/jenkins/tools/maven/apache-maven-2.2.1
at hudson.FilePath.installIfNecessaryFrom(FilePath.java:772)
at hudson.tools.DownloadFromUrlInstaller.performInstallation(DownloadFromUrlInstaller.java:70)
at hudson.tools.InstallerTranslator.getToolHome(InstallerTranslator.java:68)
at hudson.tools.ToolLocationNodeProperty.getToolHome(ToolLocationNodeProperty.java:107)
at hudson.tools.ToolInstallation.translateFor(ToolInstallation.java:204)
at hudson.tasks.Maven$MavenInstallation.forNode(Maven.java:609)
at hudson.maven.MavenModuleSetBuild.getEnvironment(MavenModuleSetBuild.java:182)
at hudson.scm.SubversionSCM.checkout(SubversionSCM.java:866)
at hudson.model.AbstractProject.checkout(AbstractProject.java:1252)
at hudson.model.AbstractBuild$AbstractBuildExecution.defaultCheckout(AbstractBuild.java:615)
at jenkins.scm.SCMCheckoutStrategy.checkout(SCMCheckoutStrategy.java:86)
at hudson.model.AbstractBuild$AbstractBuildExecution.run(AbstractBuild.java:524)
at hudson.model.Run.execute(Run.java:1706)
at hudson.maven.MavenModuleSetBuild.run(MavenModuleSetBuild.java:529)
at hudson.model.ResourceController.execute(ResourceController.java:88)
at hudson.model.Executor.run(Executor.java:232)
Caused by: java.io.IOException: Failed to mkdirs: /home/jenkins/tools/maven/apache-maven-2.2.1
at hudson.FilePath.mkdirs(FilePath.java:1075)
at hudson.FilePath.installIfNecessaryFrom(FilePath.java:738)
... 15 more