You are viewing a plain text version of this content. The canonical link for it is here.
Posted to dev@geode.apache.org by Apache Jenkins Server <je...@builds.apache.org> on 2017/10/10 18:58:06 UTC

Build failed in Jenkins: Geode-nightly-flaky #145

See <https://builds.apache.org/job/Geode-nightly-flaky/145/display/redirect?page=changes>

Changes:

[khowe] GEODE_3299: Refactor Gfsh functions to acquire Cache from FunctionContex

[kirk.lund] GEODE-3790: add new test for CacheListener invocations

[huynhja] GEODE-3787: Do not catch NotAuthorizedExceptions in CompiledIteratorDef

[dsmith] GEODE-3743: Deprecating manual-start of senders

[github] GEODE-3761 Document manual-start deprecation of gateway senders (#895)

[github] GEODE-1290: AbstractRegionEntry.prepareValueForCache cache the new

[github] GEODE-3785: correctly update the schema version, namespace and lcoati…

------------------------------------------
[...truncated 109.03 KB...]
Download https://repo1.maven.org/maven2/io/springfox/springfox-swagger-common/2.6.1/springfox-swagger-common-2.6.1.pom
Download https://repo1.maven.org/maven2/io/springfox/springfox-spring-web/2.6.1/springfox-spring-web-2.6.1.pom
Download https://repo1.maven.org/maven2/com/fasterxml/classmate/1.3.1/classmate-1.3.1.pom
Download https://repo1.maven.org/maven2/org/springframework/plugin/spring-plugin-core/1.2.0.RELEASE/spring-plugin-core-1.2.0.RELEASE.pom
Download https://repo1.maven.org/maven2/org/springframework/plugin/spring-plugin/1.2.0.RELEASE/spring-plugin-1.2.0.RELEASE.pom
Download https://repo1.maven.org/maven2/org/springframework/plugin/spring-plugin-metadata/1.2.0.RELEASE/spring-plugin-metadata-1.2.0.RELEASE.pom
Download https://repo1.maven.org/maven2/org/mapstruct/mapstruct/1.0.0.Final/mapstruct-1.0.0.Final.pom
Download https://repo1.maven.org/maven2/org/mapstruct/mapstruct-parent/1.0.0.Final/mapstruct-parent-1.0.0.Final.pom
Download https://repo1.maven.org/maven2/io/springfox/springfox-core/2.6.1/springfox-core-2.6.1.pom
Download https://repo1.maven.org/maven2/com/fasterxml/jackson/module/jackson-module-scala_2.10/2.8.6/jackson-module-scala_2.10-2.8.6.jar
Download https://repo1.maven.org/maven2/io/springfox/springfox-swagger2/2.6.1/springfox-swagger2-2.6.1.jar
Download https://repo1.maven.org/maven2/io/springfox/springfox-swagger-ui/2.6.1/springfox-swagger-ui-2.6.1.jar
Download https://repo1.maven.org/maven2/org/springframework/hateoas/spring-hateoas/0.23.0.RELEASE/spring-hateoas-0.23.0.RELEASE.jar
Download https://repo1.maven.org/maven2/com/fasterxml/jackson/module/jackson-module-paranamer/2.8.6/jackson-module-paranamer-2.8.6.jar
Download https://repo1.maven.org/maven2/io/swagger/swagger-annotations/1.5.10/swagger-annotations-1.5.10.jar
Download https://repo1.maven.org/maven2/io/swagger/swagger-models/1.5.10/swagger-models-1.5.10.jar
Download https://repo1.maven.org/maven2/io/springfox/springfox-spi/2.6.1/springfox-spi-2.6.1.jar
Download https://repo1.maven.org/maven2/io/springfox/springfox-schema/2.6.1/springfox-schema-2.6.1.jar
Download https://repo1.maven.org/maven2/io/springfox/springfox-swagger-common/2.6.1/springfox-swagger-common-2.6.1.jar
Download https://repo1.maven.org/maven2/io/springfox/springfox-spring-web/2.6.1/springfox-spring-web-2.6.1.jar
Download https://repo1.maven.org/maven2/org/springframework/plugin/spring-plugin-core/1.2.0.RELEASE/spring-plugin-core-1.2.0.RELEASE.jar
Download https://repo1.maven.org/maven2/org/springframework/plugin/spring-plugin-metadata/1.2.0.RELEASE/spring-plugin-metadata-1.2.0.RELEASE.jar
Download https://repo1.maven.org/maven2/org/mapstruct/mapstruct/1.0.0.Final/mapstruct-1.0.0.Final.jar
Download https://repo1.maven.org/maven2/com/thoughtworks/paranamer/paranamer/2.8/paranamer-2.8.jar
Download https://repo1.maven.org/maven2/io/springfox/springfox-core/2.6.1/springfox-core-2.6.1.jar
Note: Some input files use unchecked or unsafe operations.
Note: Recompile with -Xlint:unchecked for details.
:geode-web-api:processResources
:geode-web-api:classes
:geode-assembly:docs
:geode-assembly:gfshDepsJar
:geode-common:javadocJar
:geode-common:sourcesJar
:geode-common:signArchives SKIPPED
:geode-core:javadocJar
:geode-core:raJar
:geode-core:jcaJar
:geode-core:sourcesJar
:geode-core:signArchives SKIPPED
:geode-core:webJar
:geode-cq:jar
:geode-cq:javadoc
:geode-cq:javadocJar
:geode-cq:sourcesJar
:geode-cq:signArchives SKIPPED
:geode-json:javadocJar
:geode-json:sourcesJar
:geode-json:signArchives SKIPPED
:geode-lucene:jar
:geode-lucene:javadoc
:geode-lucene:javadocJar
:geode-lucene:sourcesJar
:geode-lucene:signArchives SKIPPED
:geode-old-client-support:jar
:geode-old-client-support:javadoc
:geode-old-client-support:javadocJar
:geode-old-client-support:sourcesJar
:geode-old-client-support:signArchives SKIPPED
:geode-protobuf:jar
:geode-protobuf:javadoc
:geode-protobuf:javadocJar
:geode-protobuf:sourcesJar
:geode-protobuf:signArchives SKIPPED
:geode-pulse:javadoc
:geode-pulse:javadocJar
:geode-pulse:sourcesJar
:geode-pulse:war
:geode-pulse:signArchives SKIPPED
:geode-rebalancer:jar
:geode-rebalancer:javadoc
:geode-rebalancer:javadocJar
:geode-rebalancer:sourcesJar
:geode-rebalancer:signArchives SKIPPED
:geode-wan:jar
:geode-wan:javadoc
:geode-wan:javadocJar
:geode-wan:sourcesJar
:geode-wan:signArchives SKIPPED
:geode-web:javadoc NO-SOURCE
:geode-web:javadocJar
:geode-web:sourcesJar
:geode-web:war
:geode-web:signArchives SKIPPED
:geode-web-api:javadoc
:geode-web-api:javadocJar
:geode-web-api:sourcesJar
:geode-web-api:war
:geode-web-api:signArchives SKIPPED
:geode-assembly:installDist
:geode-pulse:jar
:geode-assembly:compileTestJava
Download https://repo1.maven.org/maven2/org/codehaus/cargo/cargo-core-uberjar/1.6.3/cargo-core-uberjar-1.6.3.pom
Download https://repo1.maven.org/maven2/org/codehaus/cargo/cargo-core/1.6.3/cargo-core-1.6.3.pom
Download https://repo1.maven.org/maven2/org/codehaus/cargo/codehaus-cargo/1.6.3/codehaus-cargo-1.6.3.pom
Download https://repo1.maven.org/maven2/org/codehaus/cargo/cargo-core-uberjar/1.6.3/cargo-core-uberjar-1.6.3.jar
Note: Some input files use or override a deprecated API.
Note: Recompile with -Xlint:deprecation for details.
Note: Some input files use unchecked or unsafe operations.
Note: Recompile with -Xlint:unchecked for details.
:geode-assembly:processTestResources
:geode-assembly:testClasses
:geode-assembly:flakyTest
:geode-benchmarks:compileTestJava NO-SOURCE
:geode-benchmarks:processTestResources NO-SOURCE
:geode-benchmarks:testClasses UP-TO-DATE
:geode-benchmarks:flakyTest NO-SOURCE
:geode-common:compileTestJava
:geode-common:processTestResources NO-SOURCE
:geode-common:testClasses
:geode-common:flakyTest
:geode-concurrency-test:generateJpfProperties
:geode-concurrency-test:compileTestJava NO-SOURCE
:geode-concurrency-test:processTestResources NO-SOURCE
:geode-concurrency-test:testClasses UP-TO-DATE
:geode-concurrency-test:flakyTest NO-SOURCE
:geode-core:flakyTest

org.apache.geode.management.RegionManagementDUnitTest > testNavigationAPIS FAILED
    org.apache.geode.test.dunit.RMIException: While invoking org.apache.geode.test.dunit.NamedRunnable.run in VM 0 running on Host asf914.gq1.ygridcore.net with 4 VMs
        at org.apache.geode.test.dunit.VM.invoke(VM.java:393)
        at org.apache.geode.test.dunit.VM.invoke(VM.java:363)
        at org.apache.geode.test.dunit.VM.invoke(VM.java:296)
        at org.apache.geode.management.RegionManagementDUnitTest.verifyNavigationApis(RegionManagementDUnitTest.java:406)
        at org.apache.geode.management.RegionManagementDUnitTest.testNavigationAPIS(RegionManagementDUnitTest.java:267)

        Caused by:
        org.awaitility.core.ConditionTimeoutException: Condition defined as a lambda expression in org.apache.geode.management.RegionManagementDUnitTest that uses org.apache.geode.management.DistributedSystemMXBean, org.apache.geode.management.DistributedSystemMXBeanint expected:<[4]> but was:<[5]> within 2 minutes.
            at org.awaitility.core.ConditionAwaiter.await(ConditionAwaiter.java:104)
            at org.awaitility.core.AssertionCondition.await(AssertionCondition.java:117)
            at org.awaitility.core.AssertionCondition.await(AssertionCondition.java:32)
            at org.awaitility.core.ConditionFactory.until(ConditionFactory.java:809)
            at org.awaitility.core.ConditionFactory.until(ConditionFactory.java:648)
            at org.apache.geode.management.RegionManagementDUnitTest.awaitMemberCount(RegionManagementDUnitTest.java:1049)
            at org.apache.geode.management.RegionManagementDUnitTest.lambda$verifyNavigationApis$8ec4a763$1(RegionManagementDUnitTest.java:410)

281 tests completed, 1 failed, 8 skipped
:geode-core:flakyTest FAILED
:geode-cq:compileTestJavaNote: Some input files use or override a deprecated API.
Note: Recompile with -Xlint:deprecation for details.
Note: Some input files use unchecked or unsafe operations.
Note: Recompile with -Xlint:unchecked for details.

:geode-cq:processTestResources
:geode-cq:testClasses
:geode-cq:flakyTest
:geode-json:compileTestJava NO-SOURCE
:geode-json:processTestResources
:geode-json:testClasses
:geode-json:flakyTest NO-SOURCE
:geode-junit:compileTestJavaNote: <https://builds.apache.org/job/Geode-nightly-flaky/ws/geode-junit/src/test/java/org/apache/geode/test/compiler/JarBuilderTest.java> uses or overrides a deprecated API.
Note: Recompile with -Xlint:deprecation for details.
Note: <https://builds.apache.org/job/Geode-nightly-flaky/ws/geode-junit/src/test/java/org/apache/geode/test/compiler/ClassNameExtractorTest.java> uses unchecked or unsafe operations.
Note: Recompile with -Xlint:unchecked for details.

:geode-junit:processTestResources
:geode-junit:testClasses
:geode-junit:flakyTest
:geode-lucene:compileTestJava
Download https://repo1.maven.org/maven2/org/apache/lucene/lucene-test-framework/6.4.1/lucene-test-framework-6.4.1.pom
Download https://repo1.maven.org/maven2/org/apache/lucene/lucene-codecs/6.4.1/lucene-codecs-6.4.1.pom
Download https://repo1.maven.org/maven2/com/carrotsearch/randomizedtesting/randomizedtesting-runner/2.4.0/randomizedtesting-runner-2.4.0.pom
Download https://repo1.maven.org/maven2/com/carrotsearch/randomizedtesting/randomizedtesting-parent/2.4.0/randomizedtesting-parent-2.4.0.pom
Download https://repo1.maven.org/maven2/org/apache/lucene/lucene-test-framework/6.4.1/lucene-test-framework-6.4.1.jar
Download https://repo1.maven.org/maven2/org/apache/lucene/lucene-codecs/6.4.1/lucene-codecs-6.4.1.jar
Download https://repo1.maven.org/maven2/com/carrotsearch/randomizedtesting/randomizedtesting-runner/2.4.0/randomizedtesting-runner-2.4.0.jar
Note: Some input files use or override a deprecated API.
Note: Recompile with -Xlint:deprecation for details.
Note: Some input files use unchecked or unsafe operations.
Note: Recompile with -Xlint:unchecked for details.
:geode-lucene:processTestResources
:geode-lucene:testClasses
:geode-lucene:flakyTest
:geode-old-client-support:compileTestJavaNote: <https://builds.apache.org/job/Geode-nightly-flaky/ws/geode-old-client-support/src/test/java/com/gemstone/gemfire/cache/execute/FunctionExceptionTest.java> uses or overrides a deprecated API.
Note: Recompile with -Xlint:deprecation for details.

:geode-old-client-support:processTestResources NO-SOURCE
:geode-old-client-support:testClasses
:geode-old-client-support:flakyTest
:geode-old-versions:compileTestJava NO-SOURCE
:geode-old-versions:processTestResources NO-SOURCE
:geode-old-versions:testClasses UP-TO-DATE
:geode-old-versions:flakyTest NO-SOURCE
:geode-protobuf:extractIncludeTestProto
Download https://repo1.maven.org/maven2/org/powermock/powermock-api-mockito/1.7.1/powermock-api-mockito-1.7.1.pom
Download https://repo1.maven.org/maven2/org/powermock/powermock-api-mockito/1.7.1/powermock-api-mockito-1.7.1.jar
:geode-protobuf:extractTestProto
:geode-protobuf:generateTestProto NO-SOURCE
:geode-protobuf:compileTestJavaNote: Some input files use or override a deprecated API.
Note: Recompile with -Xlint:deprecation for details.
Note: Some input files use unchecked or unsafe operations.
Note: Recompile with -Xlint:unchecked for details.

:geode-protobuf:processTestResources
:geode-protobuf:testClasses
:geode-protobuf:flakyTest
:geode-pulse:compileTestJava
Download https://repo1.maven.org/maven2/com/codeborne/phantomjsdriver/1.3.0/phantomjsdriver-1.3.0.pom
Download https://repo1.maven.org/maven2/com/codeborne/phantomjsdriver/1.3.0/phantomjsdriver-1.3.0.jar
Download https://repo1.maven.org/maven2/org/seleniumhq/selenium/selenium-api/3.0.1/selenium-api-3.0.1.jar
Download https://repo1.maven.org/maven2/org/seleniumhq/selenium/selenium-remote-driver/3.0.1/selenium-remote-driver-3.0.1.jar
Download https://repo1.maven.org/maven2/org/seleniumhq/selenium/selenium-support/3.0.1/selenium-support-3.0.1.jar
Note: Some input files use or override a deprecated API.
Note: Recompile with -Xlint:deprecation for details.
Note: <https://builds.apache.org/job/Geode-nightly-flaky/ws/geode-pulse/src/test/java/org/apache/geode/tools/pulse/controllers/PulseControllerJUnitTest.java> uses unchecked or unsafe operations.
Note: Recompile with -Xlint:unchecked for details.
:geode-pulse:processTestResources
:geode-pulse:testClasses
:geode-pulse:flakyTest
:geode-rebalancer:compileTestJava
:geode-rebalancer:processTestResources NO-SOURCE
:geode-rebalancer:testClasses
:geode-rebalancer:flakyTest
:geode-wan:compileTestJavaNote: Some input files use or override a deprecated API.
Note: Recompile with -Xlint:deprecation for details.
Note: Some input files use unchecked or unsafe operations.
Note: Recompile with -Xlint:unchecked for details.

:geode-wan:processTestResources
:geode-wan:testClasses
:geode-wan:flakyTest
:geode-web:compileTestJavaNote: Some input files use or override a deprecated API.
Note: Recompile with -Xlint:deprecation for details.

:geode-web:processTestResources NO-SOURCE
:geode-web:testClasses
:geode-web:flakyTest
:geode-web-api:compileTestJava
:geode-web-api:processTestResources NO-SOURCE
:geode-web-api:testClasses
:geode-web-api:flakyTest
:combineReports
All test reports at <https://builds.apache.org/job/Geode-nightly-flaky/ws/build/reports/combined>

FAILURE: Build failed with an exception.

* What went wrong:
Execution failed for task ':geode-core:flakyTest'.
> There were failing tests. See the report at: file://<https://builds.apache.org/job/Geode-nightly-flaky/ws/geode-core/build/reports/flakyTest/index.html>

* Try:
Run with --stacktrace option to get the stack trace. Run with --info or --debug option to get more log output.

BUILD FAILED

Total time: 2 hrs 5 mins 40.657 secs
Build step 'Invoke Gradle script' changed build result to FAILURE
Build step 'Invoke Gradle script' marked build as failure
Archiving artifacts
Recording test results

Jenkins build is back to normal : Geode-nightly-flaky #148

Posted by Apache Jenkins Server <je...@builds.apache.org>.
See <https://builds.apache.org/job/Geode-nightly-flaky/148/display/redirect?page=changes>


Build failed in Jenkins: Geode-nightly-flaky #147

Posted by Apache Jenkins Server <je...@builds.apache.org>.
See <https://builds.apache.org/job/Geode-nightly-flaky/147/display/redirect?page=changes>

Changes:

[khowe] GEODE_3299: Refactor Gfsh functions to acquire Cache from FunctionContex

[kohlmu-pivotal] GEODE-3802: Amending package renaming issues

[github] GEODE-3539: consolidate IndexType for better option verification (#910)

[kmiller] GEODE-3445 Document new gfsh connect option

[github] GEODE-3247 Document query method invocation changes (#909)

[jstewart] GEODE-3685: Fix test failure

[bschuchardt] GEODE-1176 CI failure: FixedPRSinglehopDUnitTest.test_MetadataContents

[bschuchardt] GEODE-3808 LonerDMJUnitTest.testMemberID fails if hostname lookup isn't

[dbarnes] User Guide: Clarified a passage in the Authentication section.

[khowe] GEODE_3299: Refactor Gfsh functions to acquire Cache from FunctionContex

[kmiller] GEODE-3445 Revise doc to specify 1-way authentication

[kirk.lund] GEODE-3791: add new tests for CacheListener on PartionedRegion

[kirk.lund] GEODE-3805: Use correct timestamplto check last modified time

------------------------------------------
[...truncated 109.02 KB...]
Download https://repo1.maven.org/maven2/io/springfox/springfox-swagger-common/2.6.1/springfox-swagger-common-2.6.1.pom
Download https://repo1.maven.org/maven2/io/springfox/springfox-spring-web/2.6.1/springfox-spring-web-2.6.1.pom
Download https://repo1.maven.org/maven2/com/fasterxml/classmate/1.3.1/classmate-1.3.1.pom
Download https://repo1.maven.org/maven2/org/springframework/plugin/spring-plugin-core/1.2.0.RELEASE/spring-plugin-core-1.2.0.RELEASE.pom
Download https://repo1.maven.org/maven2/org/springframework/plugin/spring-plugin/1.2.0.RELEASE/spring-plugin-1.2.0.RELEASE.pom
Download https://repo1.maven.org/maven2/org/springframework/plugin/spring-plugin-metadata/1.2.0.RELEASE/spring-plugin-metadata-1.2.0.RELEASE.pom
Download https://repo1.maven.org/maven2/org/mapstruct/mapstruct/1.0.0.Final/mapstruct-1.0.0.Final.pom
Download https://repo1.maven.org/maven2/org/mapstruct/mapstruct-parent/1.0.0.Final/mapstruct-parent-1.0.0.Final.pom
Download https://repo1.maven.org/maven2/io/springfox/springfox-core/2.6.1/springfox-core-2.6.1.pom
Download https://repo1.maven.org/maven2/com/fasterxml/jackson/module/jackson-module-scala_2.10/2.8.6/jackson-module-scala_2.10-2.8.6.jar
Download https://repo1.maven.org/maven2/io/springfox/springfox-swagger2/2.6.1/springfox-swagger2-2.6.1.jar
Download https://repo1.maven.org/maven2/io/springfox/springfox-swagger-ui/2.6.1/springfox-swagger-ui-2.6.1.jar
Download https://repo1.maven.org/maven2/org/springframework/hateoas/spring-hateoas/0.23.0.RELEASE/spring-hateoas-0.23.0.RELEASE.jar
Download https://repo1.maven.org/maven2/com/fasterxml/jackson/module/jackson-module-paranamer/2.8.6/jackson-module-paranamer-2.8.6.jar
Download https://repo1.maven.org/maven2/io/swagger/swagger-annotations/1.5.10/swagger-annotations-1.5.10.jar
Download https://repo1.maven.org/maven2/io/swagger/swagger-models/1.5.10/swagger-models-1.5.10.jar
Download https://repo1.maven.org/maven2/io/springfox/springfox-spi/2.6.1/springfox-spi-2.6.1.jar
Download https://repo1.maven.org/maven2/io/springfox/springfox-schema/2.6.1/springfox-schema-2.6.1.jar
Download https://repo1.maven.org/maven2/io/springfox/springfox-swagger-common/2.6.1/springfox-swagger-common-2.6.1.jar
Download https://repo1.maven.org/maven2/io/springfox/springfox-spring-web/2.6.1/springfox-spring-web-2.6.1.jar
Download https://repo1.maven.org/maven2/org/springframework/plugin/spring-plugin-core/1.2.0.RELEASE/spring-plugin-core-1.2.0.RELEASE.jar
Download https://repo1.maven.org/maven2/org/springframework/plugin/spring-plugin-metadata/1.2.0.RELEASE/spring-plugin-metadata-1.2.0.RELEASE.jar
Download https://repo1.maven.org/maven2/org/mapstruct/mapstruct/1.0.0.Final/mapstruct-1.0.0.Final.jar
Download https://repo1.maven.org/maven2/com/thoughtworks/paranamer/paranamer/2.8/paranamer-2.8.jar
Download https://repo1.maven.org/maven2/io/springfox/springfox-core/2.6.1/springfox-core-2.6.1.jar
Note: Some input files use unchecked or unsafe operations.
Note: Recompile with -Xlint:unchecked for details.
:geode-web-api:processResources
:geode-web-api:classes
:geode-assembly:docs
:geode-assembly:gfshDepsJar
:geode-common:javadocJar
:geode-common:sourcesJar
:geode-common:signArchives SKIPPED
:geode-core:javadocJar
:geode-core:raJar
:geode-core:jcaJar
:geode-core:sourcesJar
:geode-core:signArchives SKIPPED
:geode-core:webJar
:geode-cq:jar
:geode-cq:javadoc
:geode-cq:javadocJar
:geode-cq:sourcesJar
:geode-cq:signArchives SKIPPED
:geode-json:javadocJar
:geode-json:sourcesJar
:geode-json:signArchives SKIPPED
:geode-lucene:jar
:geode-lucene:javadoc
:geode-lucene:javadocJar
:geode-lucene:sourcesJar
:geode-lucene:signArchives SKIPPED
:geode-old-client-support:jar
:geode-old-client-support:javadoc
:geode-old-client-support:javadocJar
:geode-old-client-support:sourcesJar
:geode-old-client-support:signArchives SKIPPED
:geode-protobuf:jar
:geode-protobuf:javadoc
:geode-protobuf:javadocJar
:geode-protobuf:sourcesJar
:geode-protobuf:signArchives SKIPPED
:geode-pulse:javadoc
:geode-pulse:javadocJar
:geode-pulse:sourcesJar
:geode-pulse:war
:geode-pulse:signArchives SKIPPED
:geode-rebalancer:jar
:geode-rebalancer:javadoc
:geode-rebalancer:javadocJar
:geode-rebalancer:sourcesJar
:geode-rebalancer:signArchives SKIPPED
:geode-wan:jar
:geode-wan:javadoc
:geode-wan:javadocJar
:geode-wan:sourcesJar
:geode-wan:signArchives SKIPPED
:geode-web:javadoc NO-SOURCE
:geode-web:javadocJar
:geode-web:sourcesJar
:geode-web:war
:geode-web:signArchives SKIPPED
:geode-web-api:javadoc
:geode-web-api:javadocJar
:geode-web-api:sourcesJar
:geode-web-api:war
:geode-web-api:signArchives SKIPPED
:geode-assembly:installDist
:geode-pulse:jar
:geode-assembly:compileTestJava
Download https://repo1.maven.org/maven2/org/codehaus/cargo/cargo-core-uberjar/1.6.3/cargo-core-uberjar-1.6.3.pom
Download https://repo1.maven.org/maven2/org/codehaus/cargo/cargo-core/1.6.3/cargo-core-1.6.3.pom
Download https://repo1.maven.org/maven2/org/codehaus/cargo/codehaus-cargo/1.6.3/codehaus-cargo-1.6.3.pom
Download https://repo1.maven.org/maven2/org/codehaus/cargo/cargo-core-uberjar/1.6.3/cargo-core-uberjar-1.6.3.jar
Note: Some input files use or override a deprecated API.
Note: Recompile with -Xlint:deprecation for details.
Note: Some input files use unchecked or unsafe operations.
Note: Recompile with -Xlint:unchecked for details.
:geode-assembly:processTestResources
:geode-assembly:testClasses
:geode-assembly:flakyTest
:geode-benchmarks:compileTestJava NO-SOURCE
:geode-benchmarks:processTestResources NO-SOURCE
:geode-benchmarks:testClasses UP-TO-DATE
:geode-benchmarks:flakyTest NO-SOURCE
:geode-common:compileTestJava
:geode-common:processTestResources NO-SOURCE
:geode-common:testClasses
:geode-common:flakyTest
:geode-concurrency-test:generateJpfProperties
:geode-concurrency-test:compileTestJava NO-SOURCE
:geode-concurrency-test:processTestResources NO-SOURCE
:geode-concurrency-test:testClasses UP-TO-DATE
:geode-concurrency-test:flakyTest NO-SOURCE
:geode-core:flakyTest

org.apache.geode.management.RegionManagementDUnitTest > testNavigationAPIS FAILED
    org.apache.geode.test.dunit.RMIException: While invoking org.apache.geode.test.dunit.NamedRunnable.run in VM 0 running on Host asf914.gq1.ygridcore.net with 4 VMs
        at org.apache.geode.test.dunit.VM.invoke(VM.java:393)
        at org.apache.geode.test.dunit.VM.invoke(VM.java:363)
        at org.apache.geode.test.dunit.VM.invoke(VM.java:296)
        at org.apache.geode.management.RegionManagementDUnitTest.verifyNavigationApis(RegionManagementDUnitTest.java:406)
        at org.apache.geode.management.RegionManagementDUnitTest.testNavigationAPIS(RegionManagementDUnitTest.java:267)

        Caused by:
        org.awaitility.core.ConditionTimeoutException: Condition defined as a lambda expression in org.apache.geode.management.RegionManagementDUnitTest that uses org.apache.geode.management.DistributedSystemMXBean, org.apache.geode.management.DistributedSystemMXBeanint expected:<[4]> but was:<[5]> within 2 minutes.
            at org.awaitility.core.ConditionAwaiter.await(ConditionAwaiter.java:104)
            at org.awaitility.core.AssertionCondition.await(AssertionCondition.java:117)
            at org.awaitility.core.AssertionCondition.await(AssertionCondition.java:32)
            at org.awaitility.core.ConditionFactory.until(ConditionFactory.java:809)
            at org.awaitility.core.ConditionFactory.until(ConditionFactory.java:648)
            at org.apache.geode.management.RegionManagementDUnitTest.awaitMemberCount(RegionManagementDUnitTest.java:1049)
            at org.apache.geode.management.RegionManagementDUnitTest.lambda$verifyNavigationApis$8ec4a763$1(RegionManagementDUnitTest.java:410)

280 tests completed, 1 failed, 8 skipped
:geode-core:flakyTest FAILED
:geode-cq:compileTestJavaNote: Some input files use or override a deprecated API.
Note: Recompile with -Xlint:deprecation for details.
Note: Some input files use unchecked or unsafe operations.
Note: Recompile with -Xlint:unchecked for details.

:geode-cq:processTestResources
:geode-cq:testClasses
:geode-cq:flakyTest
:geode-json:compileTestJava NO-SOURCE
:geode-json:processTestResources
:geode-json:testClasses
:geode-json:flakyTest NO-SOURCE
:geode-junit:compileTestJavaNote: <https://builds.apache.org/job/Geode-nightly-flaky/ws/geode-junit/src/test/java/org/apache/geode/test/compiler/JarBuilderTest.java> uses or overrides a deprecated API.
Note: Recompile with -Xlint:deprecation for details.
Note: <https://builds.apache.org/job/Geode-nightly-flaky/ws/geode-junit/src/test/java/org/apache/geode/test/compiler/ClassNameExtractorTest.java> uses unchecked or unsafe operations.
Note: Recompile with -Xlint:unchecked for details.

:geode-junit:processTestResources
:geode-junit:testClasses
:geode-junit:flakyTest
:geode-lucene:compileTestJava
Download https://repo1.maven.org/maven2/org/apache/lucene/lucene-test-framework/6.4.1/lucene-test-framework-6.4.1.pom
Download https://repo1.maven.org/maven2/org/apache/lucene/lucene-codecs/6.4.1/lucene-codecs-6.4.1.pom
Download https://repo1.maven.org/maven2/com/carrotsearch/randomizedtesting/randomizedtesting-runner/2.4.0/randomizedtesting-runner-2.4.0.pom
Download https://repo1.maven.org/maven2/com/carrotsearch/randomizedtesting/randomizedtesting-parent/2.4.0/randomizedtesting-parent-2.4.0.pom
Download https://repo1.maven.org/maven2/org/apache/lucene/lucene-test-framework/6.4.1/lucene-test-framework-6.4.1.jar
Download https://repo1.maven.org/maven2/org/apache/lucene/lucene-codecs/6.4.1/lucene-codecs-6.4.1.jar
Download https://repo1.maven.org/maven2/com/carrotsearch/randomizedtesting/randomizedtesting-runner/2.4.0/randomizedtesting-runner-2.4.0.jar
Note: Some input files use or override a deprecated API.
Note: Recompile with -Xlint:deprecation for details.
Note: Some input files use unchecked or unsafe operations.
Note: Recompile with -Xlint:unchecked for details.
:geode-lucene:processTestResources
:geode-lucene:testClasses
:geode-lucene:flakyTest
:geode-old-client-support:compileTestJavaNote: <https://builds.apache.org/job/Geode-nightly-flaky/ws/geode-old-client-support/src/test/java/com/gemstone/gemfire/cache/execute/FunctionExceptionTest.java> uses or overrides a deprecated API.
Note: Recompile with -Xlint:deprecation for details.

:geode-old-client-support:processTestResources NO-SOURCE
:geode-old-client-support:testClasses
:geode-old-client-support:flakyTest
:geode-old-versions:compileTestJava NO-SOURCE
:geode-old-versions:processTestResources NO-SOURCE
:geode-old-versions:testClasses UP-TO-DATE
:geode-old-versions:flakyTest NO-SOURCE
:geode-protobuf:extractIncludeTestProto
Download https://repo1.maven.org/maven2/org/powermock/powermock-api-mockito/1.7.1/powermock-api-mockito-1.7.1.pom
Download https://repo1.maven.org/maven2/org/powermock/powermock-api-mockito/1.7.1/powermock-api-mockito-1.7.1.jar
:geode-protobuf:extractTestProto
:geode-protobuf:generateTestProto NO-SOURCE
:geode-protobuf:compileTestJavaNote: Some input files use or override a deprecated API.
Note: Recompile with -Xlint:deprecation for details.
Note: Some input files use unchecked or unsafe operations.
Note: Recompile with -Xlint:unchecked for details.

:geode-protobuf:processTestResources
:geode-protobuf:testClasses
:geode-protobuf:flakyTest
:geode-pulse:compileTestJava
Download https://repo1.maven.org/maven2/com/codeborne/phantomjsdriver/1.3.0/phantomjsdriver-1.3.0.pom
Download https://repo1.maven.org/maven2/com/codeborne/phantomjsdriver/1.3.0/phantomjsdriver-1.3.0.jar
Download https://repo1.maven.org/maven2/org/seleniumhq/selenium/selenium-api/3.0.1/selenium-api-3.0.1.jar
Download https://repo1.maven.org/maven2/org/seleniumhq/selenium/selenium-remote-driver/3.0.1/selenium-remote-driver-3.0.1.jar
Download https://repo1.maven.org/maven2/org/seleniumhq/selenium/selenium-support/3.0.1/selenium-support-3.0.1.jar
Note: Some input files use or override a deprecated API.
Note: Recompile with -Xlint:deprecation for details.
Note: <https://builds.apache.org/job/Geode-nightly-flaky/ws/geode-pulse/src/test/java/org/apache/geode/tools/pulse/controllers/PulseControllerJUnitTest.java> uses unchecked or unsafe operations.
Note: Recompile with -Xlint:unchecked for details.
:geode-pulse:processTestResources
:geode-pulse:testClasses
:geode-pulse:flakyTest
:geode-rebalancer:compileTestJava
:geode-rebalancer:processTestResources NO-SOURCE
:geode-rebalancer:testClasses
:geode-rebalancer:flakyTest
:geode-wan:compileTestJavaNote: Some input files use or override a deprecated API.
Note: Recompile with -Xlint:deprecation for details.
Note: Some input files use unchecked or unsafe operations.
Note: Recompile with -Xlint:unchecked for details.

:geode-wan:processTestResources
:geode-wan:testClasses
:geode-wan:flakyTest
:geode-web:compileTestJavaNote: Some input files use or override a deprecated API.
Note: Recompile with -Xlint:deprecation for details.

:geode-web:processTestResources NO-SOURCE
:geode-web:testClasses
:geode-web:flakyTest
:geode-web-api:compileTestJava
:geode-web-api:processTestResources NO-SOURCE
:geode-web-api:testClasses
:geode-web-api:flakyTest
:combineReports
All test reports at <https://builds.apache.org/job/Geode-nightly-flaky/ws/build/reports/combined>

FAILURE: Build failed with an exception.

* What went wrong:
Execution failed for task ':geode-core:flakyTest'.
> There were failing tests. See the report at: file://<https://builds.apache.org/job/Geode-nightly-flaky/ws/geode-core/build/reports/flakyTest/index.html>

* Try:
Run with --stacktrace option to get the stack trace. Run with --info or --debug option to get more log output.

BUILD FAILED

Total time: 2 hrs 2 mins 52.862 secs
Build step 'Invoke Gradle script' changed build result to FAILURE
Build step 'Invoke Gradle script' marked build as failure
Archiving artifacts
Recording test results

Build failed in Jenkins: Geode-nightly-flaky #146

Posted by Apache Jenkins Server <je...@builds.apache.org>.
See <https://builds.apache.org/job/Geode-nightly-flaky/146/display/redirect?page=changes>

Changes:

[browe] GEODE-3751: a single place for client protocol loading, logic.

[huynhja] GEODE-3714: Removed repetitive looping code when evaluating

[kohlmu-pivotal] GEODE-3802: moved Authenticator and Authorization classes to internal

[github] GEODE-3722 Revise one more instance of queryStrings (#901)

[github] GEODE-3740 Document diskTasksWaiting CachePerfStats statistic (#900)

[nabarunnag] GEODE-3131: Awaitility clause added to reference count verification.

[github] GEODE-3803: Added additional string methods to whitelist (#907)

[agingade] GEODE-3796 Changes are made to validate region version after the region

[agingade] GEODE-3796 Changes are made to validate region version after the region

------------------------------------------
[...truncated 117.01 KB...]
Download https://repo1.maven.org/maven2/org/springframework/plugin/spring-plugin/1.2.0.RELEASE/spring-plugin-1.2.0.RELEASE.pom
Download https://repo1.maven.org/maven2/org/springframework/plugin/spring-plugin-metadata/1.2.0.RELEASE/spring-plugin-metadata-1.2.0.RELEASE.pom
Download https://repo1.maven.org/maven2/org/mapstruct/mapstruct/1.0.0.Final/mapstruct-1.0.0.Final.pom
Download https://repo1.maven.org/maven2/org/mapstruct/mapstruct-parent/1.0.0.Final/mapstruct-parent-1.0.0.Final.pom
Download https://repo1.maven.org/maven2/org/springframework/spring-expression/4.3.5.RELEASE/spring-expression-4.3.5.RELEASE.pom
Download https://repo1.maven.org/maven2/io/springfox/springfox-core/2.6.1/springfox-core-2.6.1.pom
Download https://repo1.maven.org/maven2/com/fasterxml/jackson/module/jackson-module-scala_2.10/2.8.6/jackson-module-scala_2.10-2.8.6.jar
Download https://repo1.maven.org/maven2/io/springfox/springfox-swagger2/2.6.1/springfox-swagger2-2.6.1.jar
Download https://repo1.maven.org/maven2/io/springfox/springfox-swagger-ui/2.6.1/springfox-swagger-ui-2.6.1.jar
Download https://repo1.maven.org/maven2/org/springframework/hateoas/spring-hateoas/0.23.0.RELEASE/spring-hateoas-0.23.0.RELEASE.jar
Download https://repo1.maven.org/maven2/org/scala-lang/scala-reflect/2.10.6/scala-reflect-2.10.6.jar
Download https://repo1.maven.org/maven2/com/fasterxml/jackson/module/jackson-module-paranamer/2.8.6/jackson-module-paranamer-2.8.6.jar
Download https://repo1.maven.org/maven2/io/swagger/swagger-annotations/1.5.10/swagger-annotations-1.5.10.jar
Download https://repo1.maven.org/maven2/io/swagger/swagger-models/1.5.10/swagger-models-1.5.10.jar
Download https://repo1.maven.org/maven2/io/springfox/springfox-spi/2.6.1/springfox-spi-2.6.1.jar
Download https://repo1.maven.org/maven2/io/springfox/springfox-schema/2.6.1/springfox-schema-2.6.1.jar
Download https://repo1.maven.org/maven2/io/springfox/springfox-swagger-common/2.6.1/springfox-swagger-common-2.6.1.jar
Download https://repo1.maven.org/maven2/io/springfox/springfox-spring-web/2.6.1/springfox-spring-web-2.6.1.jar
Download https://repo1.maven.org/maven2/com/fasterxml/classmate/1.3.1/classmate-1.3.1.jar
Download https://repo1.maven.org/maven2/org/springframework/plugin/spring-plugin-core/1.2.0.RELEASE/spring-plugin-core-1.2.0.RELEASE.jar
Download https://repo1.maven.org/maven2/org/springframework/plugin/spring-plugin-metadata/1.2.0.RELEASE/spring-plugin-metadata-1.2.0.RELEASE.jar
Download https://repo1.maven.org/maven2/org/mapstruct/mapstruct/1.0.0.Final/mapstruct-1.0.0.Final.jar
Download https://repo1.maven.org/maven2/io/springfox/springfox-core/2.6.1/springfox-core-2.6.1.jar
Note: Some input files use unchecked or unsafe operations.
Note: Recompile with -Xlint:unchecked for details.
:geode-web-api:processResources
:geode-web-api:classes
:geode-assembly:docs
:geode-assembly:gfshDepsJar
:geode-common:javadocJar
:geode-common:sourcesJar
:geode-common:signArchives SKIPPED
:geode-core:javadocJar
:geode-core:raJar
:geode-core:jcaJar
:geode-core:sourcesJar
:geode-core:signArchives SKIPPED
:geode-core:webJar
:geode-cq:jar
:geode-cq:javadoc
:geode-cq:javadocJar
:geode-cq:sourcesJar
:geode-cq:signArchives SKIPPED
:geode-json:javadocJar
:geode-json:sourcesJar
:geode-json:signArchives SKIPPED
:geode-lucene:jar
:geode-lucene:javadoc
:geode-lucene:javadocJar
:geode-lucene:sourcesJar
:geode-lucene:signArchives SKIPPED
:geode-old-client-support:jar
:geode-old-client-support:javadoc
:geode-old-client-support:javadocJar
:geode-old-client-support:sourcesJar
:geode-old-client-support:signArchives SKIPPED
:geode-protobuf:jar
:geode-protobuf:javadoc
:geode-protobuf:javadocJar
:geode-protobuf:sourcesJar
:geode-protobuf:signArchives SKIPPED
:geode-pulse:javadoc
:geode-pulse:javadocJar
:geode-pulse:sourcesJar
:geode-pulse:war
:geode-pulse:signArchives SKIPPED
:geode-rebalancer:jar
:geode-rebalancer:javadoc
:geode-rebalancer:javadocJar
:geode-rebalancer:sourcesJar
:geode-rebalancer:signArchives SKIPPED
:geode-wan:jar
:geode-wan:javadoc
:geode-wan:javadocJar
:geode-wan:sourcesJar
:geode-wan:signArchives SKIPPED
:geode-web:javadoc NO-SOURCE
:geode-web:javadocJar
:geode-web:sourcesJar
:geode-web:war
:geode-web:signArchives SKIPPED
:geode-web-api:javadoc
:geode-web-api:javadocJar
:geode-web-api:sourcesJar
:geode-web-api:war
:geode-web-api:signArchives SKIPPED
:geode-assembly:installDist
:geode-pulse:jar
:geode-assembly:compileTestJava
Download https://repo1.maven.org/maven2/org/codehaus/cargo/cargo-core-uberjar/1.6.3/cargo-core-uberjar-1.6.3.pom
Download https://repo1.maven.org/maven2/org/codehaus/cargo/cargo-core/1.6.3/cargo-core-1.6.3.pom
Download https://repo1.maven.org/maven2/org/codehaus/cargo/codehaus-cargo/1.6.3/codehaus-cargo-1.6.3.pom
Download https://repo1.maven.org/maven2/org/codehaus/cargo/cargo-core-uberjar/1.6.3/cargo-core-uberjar-1.6.3.jar
Note: Some input files use or override a deprecated API.
Note: Recompile with -Xlint:deprecation for details.
Note: Some input files use unchecked or unsafe operations.
Note: Recompile with -Xlint:unchecked for details.
:geode-assembly:processTestResources
:geode-assembly:testClasses
:geode-assembly:flakyTest
:geode-benchmarks:compileTestJava NO-SOURCE
:geode-benchmarks:processTestResources NO-SOURCE
:geode-benchmarks:testClasses UP-TO-DATE
:geode-benchmarks:flakyTest NO-SOURCE
:geode-common:compileTestJava
:geode-common:processTestResources NO-SOURCE
:geode-common:testClasses
:geode-common:flakyTest
:geode-concurrency-test:generateJpfProperties
:geode-concurrency-test:compileTestJava NO-SOURCE
:geode-concurrency-test:processTestResources NO-SOURCE
:geode-concurrency-test:testClasses UP-TO-DATE
:geode-concurrency-test:flakyTest NO-SOURCE
:geode-core:flakyTest
:geode-cq:compileTestJavaNote: Some input files use or override a deprecated API.
Note: Recompile with -Xlint:deprecation for details.
Note: Some input files use unchecked or unsafe operations.
Note: Recompile with -Xlint:unchecked for details.

:geode-cq:processTestResources
:geode-cq:testClasses
:geode-cq:flakyTest
:geode-json:compileTestJava NO-SOURCE
:geode-json:processTestResources
:geode-json:testClasses
:geode-json:flakyTest NO-SOURCE
:geode-junit:compileTestJavaNote: <https://builds.apache.org/job/Geode-nightly-flaky/ws/geode-junit/src/test/java/org/apache/geode/test/compiler/JarBuilderTest.java> uses or overrides a deprecated API.
Note: Recompile with -Xlint:deprecation for details.
Note: <https://builds.apache.org/job/Geode-nightly-flaky/ws/geode-junit/src/test/java/org/apache/geode/test/compiler/ClassNameExtractorTest.java> uses unchecked or unsafe operations.
Note: Recompile with -Xlint:unchecked for details.

:geode-junit:processTestResources
:geode-junit:testClasses
:geode-junit:flakyTest
:geode-lucene:compileTestJava
Download https://repo1.maven.org/maven2/org/apache/lucene/lucene-test-framework/6.4.1/lucene-test-framework-6.4.1.pom
Download https://repo1.maven.org/maven2/org/apache/lucene/lucene-codecs/6.4.1/lucene-codecs-6.4.1.pom
Download https://repo1.maven.org/maven2/com/carrotsearch/randomizedtesting/randomizedtesting-runner/2.4.0/randomizedtesting-runner-2.4.0.pom
Download https://repo1.maven.org/maven2/com/carrotsearch/randomizedtesting/randomizedtesting-parent/2.4.0/randomizedtesting-parent-2.4.0.pom
Download https://repo1.maven.org/maven2/org/apache/lucene/lucene-test-framework/6.4.1/lucene-test-framework-6.4.1.jar
Download https://repo1.maven.org/maven2/org/apache/lucene/lucene-codecs/6.4.1/lucene-codecs-6.4.1.jar
Download https://repo1.maven.org/maven2/com/carrotsearch/randomizedtesting/randomizedtesting-runner/2.4.0/randomizedtesting-runner-2.4.0.jar
Note: Some input files use or override a deprecated API.
Note: Recompile with -Xlint:deprecation for details.
Note: Some input files use unchecked or unsafe operations.
Note: Recompile with -Xlint:unchecked for details.
:geode-lucene:processTestResources
:geode-lucene:testClasses
:geode-lucene:flakyTest
:geode-old-client-support:compileTestJavaNote: <https://builds.apache.org/job/Geode-nightly-flaky/ws/geode-old-client-support/src/test/java/com/gemstone/gemfire/cache/execute/FunctionExceptionTest.java> uses or overrides a deprecated API.
Note: Recompile with -Xlint:deprecation for details.

:geode-old-client-support:processTestResources NO-SOURCE
:geode-old-client-support:testClasses
:geode-old-client-support:flakyTest
:geode-old-versions:compileTestJava NO-SOURCE
:geode-old-versions:processTestResources NO-SOURCE
:geode-old-versions:testClasses UP-TO-DATE
:geode-old-versions:flakyTest NO-SOURCE
:geode-protobuf:extractIncludeTestProto
Download https://repo1.maven.org/maven2/org/powermock/powermock-api-mockito/1.7.1/powermock-api-mockito-1.7.1.pom
Download https://repo1.maven.org/maven2/org/powermock/powermock-api-mockito/1.7.1/powermock-api-mockito-1.7.1.jar
:geode-protobuf:extractTestProto
:geode-protobuf:generateTestProto NO-SOURCE
:geode-protobuf:compileTestJavaNote: Some input files use or override a deprecated API.
Note: Recompile with -Xlint:deprecation for details.
Note: Some input files use unchecked or unsafe operations.
Note: Recompile with -Xlint:unchecked for details.

:geode-protobuf:processTestResources
:geode-protobuf:testClasses
:geode-protobuf:flakyTest

org.apache.geode.internal.protocol.acceptance.CacheMaxConnectionJUnitTest > testNewProtocolRespectsMaxConnectionLimit_notSelector FAILED
    java.lang.AssertionError: expected null, but was:<java.net.SocketException: Broken pipe (Write failed)>
        at org.junit.Assert.fail(Assert.java:88)
        at org.junit.Assert.failNotNull(Assert.java:755)
        at org.junit.Assert.assertNull(Assert.java:737)
        at org.junit.Assert.assertNull(Assert.java:747)
        at org.apache.geode.internal.protocol.acceptance.CacheMaxConnectionJUnitTest.validateSocketCreationAndDestruction(CacheMaxConnectionJUnitTest.java:208)
        at org.apache.geode.internal.protocol.acceptance.CacheMaxConnectionJUnitTest.testNewProtocolRespectsMaxConnectionLimit(CacheMaxConnectionJUnitTest.java:156)
        at org.apache.geode.internal.protocol.acceptance.CacheMaxConnectionJUnitTest.testNewProtocolRespectsMaxConnectionLimit_notSelector(CacheMaxConnectionJUnitTest.java:123)

org.apache.geode.internal.protocol.acceptance.CacheMaxConnectionJUnitTest > testNewProtocolRespectsMaxConnectionLimit_isSelector FAILED
    java.lang.AssertionError: expected null, but was:<org.apache.geode.internal.protocol.exception.InvalidProtocolMessageException: Failed to parse Protobuf Message>
        at org.junit.Assert.fail(Assert.java:88)
        at org.junit.Assert.failNotNull(Assert.java:755)
        at org.junit.Assert.assertNull(Assert.java:737)
        at org.junit.Assert.assertNull(Assert.java:747)
        at org.apache.geode.internal.protocol.acceptance.CacheMaxConnectionJUnitTest.validateSocketCreationAndDestruction(CacheMaxConnectionJUnitTest.java:208)
        at org.apache.geode.internal.protocol.acceptance.CacheMaxConnectionJUnitTest.testNewProtocolRespectsMaxConnectionLimit(CacheMaxConnectionJUnitTest.java:156)
        at org.apache.geode.internal.protocol.acceptance.CacheMaxConnectionJUnitTest.testNewProtocolRespectsMaxConnectionLimit_isSelector(CacheMaxConnectionJUnitTest.java:128)

2 tests completed, 2 failed
:geode-protobuf:flakyTest FAILED
:geode-pulse:compileTestJava
Download https://repo1.maven.org/maven2/com/codeborne/phantomjsdriver/1.3.0/phantomjsdriver-1.3.0.pom
Download https://repo1.maven.org/maven2/com/codeborne/phantomjsdriver/1.3.0/phantomjsdriver-1.3.0.jar
Download https://repo1.maven.org/maven2/org/seleniumhq/selenium/selenium-api/3.0.1/selenium-api-3.0.1.jar
Download https://repo1.maven.org/maven2/org/seleniumhq/selenium/selenium-remote-driver/3.0.1/selenium-remote-driver-3.0.1.jar
Download https://repo1.maven.org/maven2/org/seleniumhq/selenium/selenium-support/3.0.1/selenium-support-3.0.1.jar
Note: Some input files use or override a deprecated API.
Note: Recompile with -Xlint:deprecation for details.
Note: <https://builds.apache.org/job/Geode-nightly-flaky/ws/geode-pulse/src/test/java/org/apache/geode/tools/pulse/controllers/PulseControllerJUnitTest.java> uses unchecked or unsafe operations.
Note: Recompile with -Xlint:unchecked for details.
:geode-pulse:processTestResources
:geode-pulse:testClasses
:geode-pulse:flakyTest
:geode-rebalancer:compileTestJava
:geode-rebalancer:processTestResources NO-SOURCE
:geode-rebalancer:testClasses
:geode-rebalancer:flakyTest
:geode-wan:compileTestJavaNote: Some input files use or override a deprecated API.
Note: Recompile with -Xlint:deprecation for details.
Note: Some input files use unchecked or unsafe operations.
Note: Recompile with -Xlint:unchecked for details.

:geode-wan:processTestResources
:geode-wan:testClasses
:geode-wan:flakyTest
:geode-web:compileTestJavaNote: Some input files use or override a deprecated API.
Note: Recompile with -Xlint:deprecation for details.

:geode-web:processTestResources NO-SOURCE
:geode-web:testClasses
:geode-web:flakyTest
:geode-web-api:compileTestJava
:geode-web-api:processTestResources NO-SOURCE
:geode-web-api:testClasses
:geode-web-api:flakyTest
:combineReports
All test reports at <https://builds.apache.org/job/Geode-nightly-flaky/ws/build/reports/combined>

FAILURE: Build failed with an exception.

* What went wrong:
Execution failed for task ':geode-protobuf:flakyTest'.
> There were failing tests. See the report at: file://<https://builds.apache.org/job/Geode-nightly-flaky/ws/geode-protobuf/build/reports/flakyTest/index.html>

* Try:
Run with --stacktrace option to get the stack trace. Run with --info or --debug option to get more log output.

BUILD FAILED

Total time: 1 hrs 51 mins 15.002 secs
Build step 'Invoke Gradle script' changed build result to FAILURE
Build step 'Invoke Gradle script' marked build as failure
Archiving artifacts
Recording test results