You are viewing a plain text version of this content. The canonical link for it is here.
Posted to issues@tez.apache.org by Apache Jenkins Server <je...@builds.apache.org> on 2017/05/31 20:57:30 UTC

Failed: TEZ-3713 PreCommit Build #2495

Jira: https://issues.apache.org/jira/browse/TEZ-3713
Build: https://builds.apache.org/job/PreCommit-TEZ-Build/2495/

###################################################################################
########################## LAST 60 LINES OF THE CONSOLE ###########################
Started by remote host 127.0.0.1
[EnvInject] - Loading node environment variables.
Building remotely on H9 (Hadoop) in workspace /home/jenkins/jenkins-slave/workspace/PreCommit-TEZ-Build
 > git rev-parse --is-inside-work-tree # timeout=10
Fetching changes from the remote Git repository
 > git config remote.origin.url https://git-wip-us.apache.org/repos/asf/tez.git # timeout=10
Cleaning workspace
 > git rev-parse --verify HEAD # timeout=10
Resetting working tree
 > git reset --hard # timeout=10
 > git clean -fdx # timeout=10
Fetching upstream changes from https://git-wip-us.apache.org/repos/asf/tez.git
 > git --version # timeout=10
 > git fetch --tags --progress https://git-wip-us.apache.org/repos/asf/tez.git +refs/heads/*:refs/remotes/origin/*
 > git rev-parse refs/remotes/origin/master^{commit} # timeout=10
 > git rev-parse refs/remotes/origin/origin/master^{commit} # timeout=10
Checking out Revision 7993156c0ccf209b0c371c1c7cfd805ea721c6f3 (refs/remotes/origin/master)
 > git config core.sparsecheckout # timeout=10
 > git checkout -f 7993156c0ccf209b0c371c1c7cfd805ea721c6f3
 > git rev-list 241a7fab996835163936d148f6fabea7a1537b70 # timeout=10
No emails were triggered.
[PreCommit-TEZ-Build] $ /bin/bash /tmp/hudson7284801125146993814.sh
Running in Jenkins mode


======================================================================
======================================================================
    Testing patch for TEZ-3713.
======================================================================
======================================================================


HEAD is now at 7993156 TEZ-3739. Fair CartesianProduct doesn't works well with huge difference in output size (zhiyuany)
Previous HEAD position was 7993156... TEZ-3739. Fair CartesianProduct doesn't works well with huge difference in output size (zhiyuany)
Switched to branch 'master'
Your branch is behind 'origin/master' by 7 commits, and can be fast-forwarded.
  (use "git pull" to update your local branch)
First, rewinding head to replay your work on top of it...
Fast-forwarded master to 7993156c0ccf209b0c371c1c7cfd805ea721c6f3.
TEZ-3713 is not "Patch Available".  Exiting.


======================================================================
======================================================================
    Finished build.
======================================================================
======================================================================


Archiving artifacts
ERROR: No artifacts found that match the file pattern "patchprocess/*.*". Configuration error?
ERROR: ?patchprocess/*.*? doesn?t match anything, but ?*.*? does. Perhaps that?s what you mean?
Build step 'Archive the artifacts' changed build result to FAILURE
[description-setter] Could not determine description.
Recording test results
ERROR: Step ?Publish JUnit test result report? failed: No test report files were found. Configuration error?
Email was triggered for: Failure - Any
Sending email for trigger: Failure - Any



###################################################################################
############################## FAILED TESTS (if any) ##############################
No tests ran.

Failed: TEZ-3701 PreCommit Build #2501

Posted by Apache Jenkins Server <je...@builds.apache.org>.
Jira: https://issues.apache.org/jira/browse/TEZ-3701
Build: https://builds.apache.org/job/PreCommit-TEZ-Build/2501/

###################################################################################
########################## LAST 60 LINES OF THE CONSOLE ###########################
[...truncated 2.20 KB...]
Switched to branch 'master'
Your branch is behind 'origin/master' by 1 commit, and can be fast-forwarded.
  (use "git pull" to update your local branch)
First, rewinding head to replay your work on top of it...
Fast-forwarded master to 7f026a878e008e08b0142bc73a6dd89e9d990018.
TEZ-3701 patch is being downloaded at Thu Jun  1 03:00:21 UTC 2017 from
http://issues.apache.org/jira/secure/attachment/12870690/TEZ-3701.10.patch


======================================================================
======================================================================
 Pre-build master to verify master stability and javac warnings
======================================================================
======================================================================


Compiling /home/jenkins/jenkins-slave/workspace/PreCommit-TEZ-Build
/home/jenkins/tools/maven/latest/bin/mvn clean test -DskipTests -Ptest-patch > /home/jenkins/jenkins-slave/workspace/PreCommit-TEZ-Build/../patchprocess/masterJavacWarnings.txt 2>&1
master compilation is broken?




{color:red}-1 overall{color}.  Here are the results of testing the latest attachment
  http://issues.apache.org/jira/secure/attachment/12870690/TEZ-3701.10.patch
  against master revision 7f026a8.

    {color:red}-1 patch{color}.  master compilation may be broken.

Console output: https://builds.apache.org/job/PreCommit-TEZ-Build/2501//console

This message is automatically generated.


======================================================================
======================================================================
    Adding comment to Jira.
======================================================================
======================================================================


Comment added.
58851a5565da1755708c5b5322e68ac2538802c7 logged out


======================================================================
======================================================================
    Finished build.
======================================================================
======================================================================


Build step 'Execute shell' marked build as failure
Archiving artifacts
[description-setter] Could not determine description.
Recording test results
ERROR: Step ?Publish JUnit test result report? failed: No test report files were found. Configuration error?
Email was triggered for: Failure - Any
Sending email for trigger: Failure - Any



###################################################################################
############################## FAILED TESTS (if any) ##############################
No tests ran.

Failed: TEZ-3745 PreCommit Build #2500

Posted by Apache Jenkins Server <je...@builds.apache.org>.
Jira: https://issues.apache.org/jira/browse/TEZ-3745
Build: https://builds.apache.org/job/PreCommit-TEZ-Build/2500/

###################################################################################
########################## LAST 60 LINES OF THE CONSOLE ###########################
[...truncated 2.19 KB...]
Switched to branch 'master'
Your branch is behind 'origin/master' by 1 commit, and can be fast-forwarded.
  (use "git pull" to update your local branch)
First, rewinding head to replay your work on top of it...
Fast-forwarded master to 7f026a878e008e08b0142bc73a6dd89e9d990018.
TEZ-3745 patch is being downloaded at Thu Jun  1 01:59:48 UTC 2017 from
http://issues.apache.org/jira/secure/attachment/12870699/TEZ-3745.01.patch


======================================================================
======================================================================
 Pre-build master to verify master stability and javac warnings
======================================================================
======================================================================


Compiling /home/jenkins/jenkins-slave/workspace/PreCommit-TEZ-Build
/home/jenkins/tools/maven/latest/bin/mvn clean test -DskipTests -Ptest-patch > /home/jenkins/jenkins-slave/workspace/PreCommit-TEZ-Build/../patchprocess/masterJavacWarnings.txt 2>&1
master compilation is broken?




{color:red}-1 overall{color}.  Here are the results of testing the latest attachment
  http://issues.apache.org/jira/secure/attachment/12870699/TEZ-3745.01.patch
  against master revision 7f026a8.

    {color:red}-1 patch{color}.  master compilation may be broken.

Console output: https://builds.apache.org/job/PreCommit-TEZ-Build/2500//console

This message is automatically generated.


======================================================================
======================================================================
    Adding comment to Jira.
======================================================================
======================================================================


Comment added.
040e681c74d862cd459edf2dbf6cfcb2061587ea logged out


======================================================================
======================================================================
    Finished build.
======================================================================
======================================================================


Build step 'Execute shell' marked build as failure
Archiving artifacts
[description-setter] Could not determine description.
Recording test results
ERROR: Step ?Publish JUnit test result report? failed: No test report files were found. Configuration error?
Email was triggered for: Failure - Any
Sending email for trigger: Failure - Any



###################################################################################
############################## FAILED TESTS (if any) ##############################
No tests ran.

Failed: TEZ-3745 PreCommit Build #2499

Posted by Apache Jenkins Server <je...@builds.apache.org>.
Jira: https://issues.apache.org/jira/browse/TEZ-3745
Build: https://builds.apache.org/job/PreCommit-TEZ-Build/2499/

###################################################################################
########################## LAST 60 LINES OF THE CONSOLE ###########################
[...truncated 1.82 KB...]

HEAD is now at 7993156 TEZ-3739. Fair CartesianProduct doesn't works well with huge difference in output size (zhiyuany)
Switched to branch 'master'
Your branch is up-to-date with 'origin/master'.
Current branch master is up to date.
TEZ-3745 patch is being downloaded at Thu Jun  1 00:37:07 UTC 2017 from
http://issues.apache.org/jira/secure/attachment/12870699/TEZ-3745.01.patch


======================================================================
======================================================================
 Pre-build master to verify master stability and javac warnings
======================================================================
======================================================================


Compiling /home/jenkins/jenkins-slave/workspace/PreCommit-TEZ-Build
/home/jenkins/tools/maven/latest/bin/mvn clean test -DskipTests -Ptest-patch > /home/jenkins/jenkins-slave/workspace/PreCommit-TEZ-Build/../patchprocess/masterJavacWarnings.txt 2>&1
master compilation is broken?




{color:red}-1 overall{color}.  Here are the results of testing the latest attachment
  http://issues.apache.org/jira/secure/attachment/12870699/TEZ-3745.01.patch
  against master revision 7993156.

    {color:red}-1 patch{color}.  master compilation may be broken.

Console output: https://builds.apache.org/job/PreCommit-TEZ-Build/2499//console

This message is automatically generated.


======================================================================
======================================================================
    Adding comment to Jira.
======================================================================
======================================================================


Comment added.
9e4f33f77e6d3ed25f01e4ff57b8d687281ac06f logged out


======================================================================
======================================================================
    Finished build.
======================================================================
======================================================================


Build step 'Execute shell' marked build as failure
Archiving artifacts
[description-setter] Could not determine description.
Recording test results
ERROR: Step ?Publish JUnit test result report? failed: No test report files were found. Configuration error?
Email was triggered for: Failure - Any
Sending email for trigger: Failure - Any



###################################################################################
############################## FAILED TESTS (if any) ##############################
No tests ran.

Failed: TEZ-3701 PreCommit Build #2498

Posted by Apache Jenkins Server <je...@builds.apache.org>.
Jira: https://issues.apache.org/jira/browse/TEZ-3701
Build: https://builds.apache.org/job/PreCommit-TEZ-Build/2498/

###################################################################################
########################## LAST 60 LINES OF THE CONSOLE ###########################
[...truncated 1.94 KB...]
Switched to branch 'master'
Your branch is behind 'origin/master' by 4 commits, and can be fast-forwarded.
  (use "git pull" to update your local branch)
First, rewinding head to replay your work on top of it...
Fast-forwarded master to 7993156c0ccf209b0c371c1c7cfd805ea721c6f3.
TEZ-3701 patch is being downloaded at Thu Jun  1 00:29:10 UTC 2017 from
http://issues.apache.org/jira/secure/attachment/12870690/TEZ-3701.10.patch


======================================================================
======================================================================
 Pre-build master to verify master stability and javac warnings
======================================================================
======================================================================


Compiling /home/jenkins/jenkins-slave/workspace/PreCommit-TEZ-Build
/home/jenkins/tools/maven/latest/bin/mvn clean test -DskipTests -Ptest-patch > /home/jenkins/jenkins-slave/workspace/PreCommit-TEZ-Build/../patchprocess/masterJavacWarnings.txt 2>&1
master compilation is broken?




{color:red}-1 overall{color}.  Here are the results of testing the latest attachment
  http://issues.apache.org/jira/secure/attachment/12870690/TEZ-3701.10.patch
  against master revision 7993156.

    {color:red}-1 patch{color}.  master compilation may be broken.

Console output: https://builds.apache.org/job/PreCommit-TEZ-Build/2498//console

This message is automatically generated.


======================================================================
======================================================================
    Adding comment to Jira.
======================================================================
======================================================================


Comment added.
f0856a108e7423a2931f7f06c2795ae8fac35c0e logged out


======================================================================
======================================================================
    Finished build.
======================================================================
======================================================================


Build step 'Execute shell' marked build as failure
Archiving artifacts
[description-setter] Could not determine description.
Recording test results
ERROR: Step ?Publish JUnit test result report? failed: No test report files were found. Configuration error?
Email was triggered for: Failure - Any
Sending email for trigger: Failure - Any



###################################################################################
############################## FAILED TESTS (if any) ##############################
No tests ran.

Failed: TEZ-3746 PreCommit Build #2497

Posted by Apache Jenkins Server <je...@builds.apache.org>.
Jira: https://issues.apache.org/jira/browse/TEZ-3746
Build: https://builds.apache.org/job/PreCommit-TEZ-Build/2497/

###################################################################################
########################## LAST 60 LINES OF THE CONSOLE ###########################
[...truncated 346.58 KB...]
[INFO] Total time: 55:56 min
[INFO] Finished at: 2017-06-01T00:20:31+00:00
[INFO] Final Memory: 96M/1392M
[INFO] ------------------------------------------------------------------------




{color:red}-1 overall{color}.  Here are the results of testing the latest attachment
  http://issues.apache.org/jira/secure/attachment/12870683/TEZ-3746.01.patch
  against master revision 7993156.

    {color:green}+1 @author{color}.  The patch does not contain any @author tags.

    {color:red}-1 tests included{color}.  The patch doesn't appear to include any new or modified tests.
                        Please justify why no new tests are needed for this patch.
                        Also please list what manual steps were performed to verify this patch.

    {color:green}+1 javac{color}.  The applied patch does not increase the total number of javac compiler warnings.

    {color:green}+1 javadoc{color}.  There were no new javadoc warning messages.

    {color:green}+1 findbugs{color}.  The patch does not introduce any new Findbugs (version 3.0.1) warnings.

    {color:green}+1 release audit{color}.  The applied patch does not increase the total number of release audit warnings.

    {color:green}+1 core tests{color}.  The patch passed unit tests in .

Test results: https://builds.apache.org/job/PreCommit-TEZ-Build/2497//testReport/
Console output: https://builds.apache.org/job/PreCommit-TEZ-Build/2497//console

This message is automatically generated.


======================================================================
======================================================================
    Adding comment to Jira.
======================================================================
======================================================================


Comment added.
0f8e318e12e7eff99a45679258f4b0fa81cc60ef logged out


======================================================================
======================================================================
    Finished build.
======================================================================
======================================================================


Build step 'Execute shell' marked build as failure
Archiving artifacts
Compressed 3.53 MB of artifacts by 29.3% relative to #2492
[description-setter] Could not determine description.
Recording test results
Email was triggered for: Failure - Any
Sending email for trigger: Failure - Any



###################################################################################
############################## FAILED TESTS (if any) ##############################
All tests passed

Failed: TEZ-3748 PreCommit Build #2496

Posted by Apache Jenkins Server <je...@builds.apache.org>.
Jira: https://issues.apache.org/jira/browse/TEZ-3748
Build: https://builds.apache.org/job/PreCommit-TEZ-Build/2496/

###################################################################################
########################## LAST 60 LINES OF THE CONSOLE ###########################
[...truncated 361.94 KB...]
[ERROR] 
[ERROR] After correcting the problems, you can resume the build with the command
[ERROR]   mvn <goals> -rf :tez-runtime-library
[INFO] Build failures were ignored.




{color:red}-1 overall{color}.  Here are the results of testing the latest attachment
  http://issues.apache.org/jira/secure/attachment/12870640/TEZ-3748.2.patch
  against master revision 7993156.

    {color:green}+1 @author{color}.  The patch does not contain any @author tags.

    {color:red}-1 tests included{color}.  The patch doesn't appear to include any new or modified tests.
                        Please justify why no new tests are needed for this patch.
                        Also please list what manual steps were performed to verify this patch.

    {color:green}+1 javac{color}.  The applied patch does not increase the total number of javac compiler warnings.

    {color:green}+1 javadoc{color}.  There were no new javadoc warning messages.

    {color:green}+1 findbugs{color}.  The patch does not introduce any new Findbugs (version 3.0.1) warnings.

    {color:green}+1 release audit{color}.  The applied patch does not increase the total number of release audit warnings.

    {color:red}-1 core tests{color}.  The patch failed these unit tests in :
                   org.apache.tez.runtime.library.common.writers.TestUnorderedPartitionedKVWriter

Test results: https://builds.apache.org/job/PreCommit-TEZ-Build/2496//testReport/
Console output: https://builds.apache.org/job/PreCommit-TEZ-Build/2496//console

This message is automatically generated.


======================================================================
======================================================================
    Adding comment to Jira.
======================================================================
======================================================================


Comment added.
9c474ba0986da7409d2c4901be89bc609130cc98 logged out


======================================================================
======================================================================
    Finished build.
======================================================================
======================================================================


Build step 'Execute shell' marked build as failure
Archiving artifacts
[description-setter] Could not determine description.
Recording test results
Email was triggered for: Failure - Any
Sending email for trigger: Failure - Any



###################################################################################
############################## FAILED TESTS (if any) ##############################
15 tests failed.
FAILED:  org.apache.tez.runtime.library.common.writers.TestUnorderedPartitionedKVWriter.testSkippedPartitions_WithPipelinedShuffle[test[false, DISABLED]]

Error Message:
Task com.google.common.util.concurrent.ListenableFutureTask@49266e81 rejected from java.util.concurrent.ThreadPoolExecutor@7a20fcab[Running, pool size = 2, active threads = 2, queued tasks = 0, completed tasks = 0]

Stack Trace:
java.util.concurrent.RejectedExecutionException: Task com.google.common.util.concurrent.ListenableFutureTask@49266e81 rejected from java.util.concurrent.ThreadPoolExecutor@7a20fcab[Running, pool size = 2, active threads = 2, queued tasks = 0, completed tasks = 0]
	at java.util.concurrent.ThreadPoolExecutor$AbortPolicy.rejectedExecution(ThreadPoolExecutor.java:2048)
	at java.util.concurrent.ThreadPoolExecutor.reject(ThreadPoolExecutor.java:821)
	at java.util.concurrent.ThreadPoolExecutor.execute(ThreadPoolExecutor.java:1372)
	at com.google.common.util.concurrent.MoreExecutors$ListeningDecorator.execute(MoreExecutors.java:440)
	at com.google.common.util.concurrent.AbstractListeningExecutorService.submit(AbstractListeningExecutorService.java:56)
	at org.apache.tez.runtime.library.common.writers.UnorderedPartitionedKVWriter.setupNextBuffer(UnorderedPartitionedKVWriter.java:437)
	at org.apache.tez.runtime.library.common.writers.UnorderedPartitionedKVWriter.write(UnorderedPartitionedKVWriter.java:379)
	at org.apache.tez.runtime.library.common.writers.UnorderedPartitionedKVWriter.write(UnorderedPartitionedKVWriter.java:330)
	at org.apache.tez.runtime.library.common.writers.TestUnorderedPartitionedKVWriter.baseTestWithPipelinedTransfer(TestUnorderedPartitionedKVWriter.java:639)
	at org.apache.tez.runtime.library.common.writers.TestUnorderedPartitionedKVWriter.testSkippedPartitions_WithPipelinedShuffle(TestUnorderedPartitionedKVWriter.java:582)


FAILED:  org.apache.tez.runtime.library.common.writers.TestUnorderedPartitionedKVWriter.testMultipleSpills[test[false, ENABLED]]

Error Message:
Task com.google.common.util.concurrent.ListenableFutureTask@13577a53 rejected from java.util.concurrent.ThreadPoolExecutor@541fe910[Running, pool size = 2, active threads = 2, queued tasks = 0, completed tasks = 0]

Stack Trace:
java.util.concurrent.RejectedExecutionException: Task com.google.common.util.concurrent.ListenableFutureTask@13577a53 rejected from java.util.concurrent.ThreadPoolExecutor@541fe910[Running, pool size = 2, active threads = 2, queued tasks = 0, completed tasks = 0]
	at java.util.concurrent.ThreadPoolExecutor$AbortPolicy.rejectedExecution(ThreadPoolExecutor.java:2048)
	at java.util.concurrent.ThreadPoolExecutor.reject(ThreadPoolExecutor.java:821)
	at java.util.concurrent.ThreadPoolExecutor.execute(ThreadPoolExecutor.java:1372)
	at com.google.common.util.concurrent.MoreExecutors$ListeningDecorator.execute(MoreExecutors.java:440)
	at com.google.common.util.concurrent.AbstractListeningExecutorService.submit(AbstractListeningExecutorService.java:56)
	at org.apache.tez.runtime.library.common.writers.UnorderedPartitionedKVWriter.setupNextBuffer(UnorderedPartitionedKVWriter.java:437)
	at org.apache.tez.runtime.library.common.writers.UnorderedPartitionedKVWriter.write(UnorderedPartitionedKVWriter.java:379)
	at org.apache.tez.runtime.library.common.writers.UnorderedPartitionedKVWriter.write(UnorderedPartitionedKVWriter.java:330)
	at org.apache.tez.runtime.library.common.writers.TestUnorderedPartitionedKVWriter.baseTest(TestUnorderedPartitionedKVWriter.java:832)
	at org.apache.tez.runtime.library.common.writers.TestUnorderedPartitionedKVWriter.testMultipleSpills(TestUnorderedPartitionedKVWriter.java:258)


FAILED:  org.apache.tez.runtime.library.common.writers.TestUnorderedPartitionedKVWriter.testSkippedPartitions[test[false, NONE]]

Error Message:
Task com.google.common.util.concurrent.ListenableFutureTask@48f98163 rejected from java.util.concurrent.ThreadPoolExecutor@749db002[Running, pool size = 2, active threads = 2, queued tasks = 0, completed tasks = 0]

Stack Trace:
java.util.concurrent.RejectedExecutionException: Task com.google.common.util.concurrent.ListenableFutureTask@48f98163 rejected from java.util.concurrent.ThreadPoolExecutor@749db002[Running, pool size = 2, active threads = 2, queued tasks = 0, completed tasks = 0]
	at java.util.concurrent.ThreadPoolExecutor$AbortPolicy.rejectedExecution(ThreadPoolExecutor.java:2048)
	at java.util.concurrent.ThreadPoolExecutor.reject(ThreadPoolExecutor.java:821)
	at java.util.concurrent.ThreadPoolExecutor.execute(ThreadPoolExecutor.java:1372)
	at com.google.common.util.concurrent.MoreExecutors$ListeningDecorator.execute(MoreExecutors.java:440)
	at com.google.common.util.concurrent.AbstractListeningExecutorService.submit(AbstractListeningExecutorService.java:56)
	at org.apache.tez.runtime.library.common.writers.UnorderedPartitionedKVWriter.setupNextBuffer(UnorderedPartitionedKVWriter.java:437)
	at org.apache.tez.runtime.library.common.writers.UnorderedPartitionedKVWriter.write(UnorderedPartitionedKVWriter.java:379)
	at org.apache.tez.runtime.library.common.writers.UnorderedPartitionedKVWriter.write(UnorderedPartitionedKVWriter.java:330)
	at org.apache.tez.runtime.library.common.writers.TestUnorderedPartitionedKVWriter.baseTest(TestUnorderedPartitionedKVWriter.java:832)
	at org.apache.tez.runtime.library.common.writers.TestUnorderedPartitionedKVWriter.testSkippedPartitions(TestUnorderedPartitionedKVWriter.java:273)


FAILED:  org.apache.tez.runtime.library.common.writers.TestUnorderedPartitionedKVWriter.testMultipleSpills_WithPipelinedShuffle[test[false, NONE]]

Error Message:
Task com.google.common.util.concurrent.ListenableFutureTask@62a7fa9a rejected from java.util.concurrent.ThreadPoolExecutor@235c710[Running, pool size = 2, active threads = 2, queued tasks = 0, completed tasks = 1]

Stack Trace:
java.util.concurrent.RejectedExecutionException: Task com.google.common.util.concurrent.ListenableFutureTask@62a7fa9a rejected from java.util.concurrent.ThreadPoolExecutor@235c710[Running, pool size = 2, active threads = 2, queued tasks = 0, completed tasks = 1]
	at java.util.concurrent.ThreadPoolExecutor$AbortPolicy.rejectedExecution(ThreadPoolExecutor.java:2048)
	at java.util.concurrent.ThreadPoolExecutor.reject(ThreadPoolExecutor.java:821)
	at java.util.concurrent.ThreadPoolExecutor.execute(ThreadPoolExecutor.java:1372)
	at com.google.common.util.concurrent.MoreExecutors$ListeningDecorator.execute(MoreExecutors.java:440)
	at com.google.common.util.concurrent.AbstractListeningExecutorService.submit(AbstractListeningExecutorService.java:56)
	at org.apache.tez.runtime.library.common.writers.UnorderedPartitionedKVWriter.setupNextBuffer(UnorderedPartitionedKVWriter.java:437)
	at org.apache.tez.runtime.library.common.writers.UnorderedPartitionedKVWriter.write(UnorderedPartitionedKVWriter.java:379)
	at org.apache.tez.runtime.library.common.writers.UnorderedPartitionedKVWriter.write(UnorderedPartitionedKVWriter.java:330)
	at org.apache.tez.runtime.library.common.writers.TestUnorderedPartitionedKVWriter.baseTestWithPipelinedTransfer(TestUnorderedPartitionedKVWriter.java:639)
	at org.apache.tez.runtime.library.common.writers.TestUnorderedPartitionedKVWriter.testMultipleSpills_WithPipelinedShuffle(TestUnorderedPartitionedKVWriter.java:572)


FAILED:  org.apache.tez.runtime.library.common.writers.TestUnorderedPartitionedKVWriter.testMergeBuffersAndSpill[test[false, NONE]]

Error Message:
Task com.google.common.util.concurrent.ListenableFutureTask@595bf0ac rejected from java.util.concurrent.ThreadPoolExecutor@2315da09[Running, pool size = 2, active threads = 2, queued tasks = 0, completed tasks = 0]

Stack Trace:
java.util.concurrent.RejectedExecutionException: Task com.google.common.util.concurrent.ListenableFutureTask@595bf0ac rejected from java.util.concurrent.ThreadPoolExecutor@2315da09[Running, pool size = 2, active threads = 2, queued tasks = 0, completed tasks = 0]
	at java.util.concurrent.ThreadPoolExecutor$AbortPolicy.rejectedExecution(ThreadPoolExecutor.java:2048)
	at java.util.concurrent.ThreadPoolExecutor.reject(ThreadPoolExecutor.java:821)
	at java.util.concurrent.ThreadPoolExecutor.execute(ThreadPoolExecutor.java:1372)
	at com.google.common.util.concurrent.MoreExecutors$ListeningDecorator.execute(MoreExecutors.java:440)
	at com.google.common.util.concurrent.AbstractListeningExecutorService.submit(AbstractListeningExecutorService.java:56)
	at org.apache.tez.runtime.library.common.writers.UnorderedPartitionedKVWriter.setupNextBuffer(UnorderedPartitionedKVWriter.java:437)
	at org.apache.tez.runtime.library.common.writers.UnorderedPartitionedKVWriter.write(UnorderedPartitionedKVWriter.java:379)
	at org.apache.tez.runtime.library.common.writers.UnorderedPartitionedKVWriter.write(UnorderedPartitionedKVWriter.java:330)
	at org.apache.tez.runtime.library.common.writers.TestUnorderedPartitionedKVWriter.baseTest(TestUnorderedPartitionedKVWriter.java:832)
	at org.apache.tez.runtime.library.common.writers.TestUnorderedPartitionedKVWriter.testMergeBuffersAndSpill(TestUnorderedPartitionedKVWriter.java:263)


FAILED:  org.apache.tez.runtime.library.common.writers.TestUnorderedPartitionedKVWriter.testSkippedPartitions_WithPipelinedShuffle[test[false, MEMORY_OPTIMIZED]]

Error Message:
Task com.google.common.util.concurrent.ListenableFutureTask@7c299e34 rejected from java.util.concurrent.ThreadPoolExecutor@1051a79b[Running, pool size = 2, active threads = 2, queued tasks = 0, completed tasks = 0]

Stack Trace:
java.util.concurrent.RejectedExecutionException: Task com.google.common.util.concurrent.ListenableFutureTask@7c299e34 rejected from java.util.concurrent.ThreadPoolExecutor@1051a79b[Running, pool size = 2, active threads = 2, queued tasks = 0, completed tasks = 0]
	at java.util.concurrent.ThreadPoolExecutor$AbortPolicy.rejectedExecution(ThreadPoolExecutor.java:2048)
	at java.util.concurrent.ThreadPoolExecutor.reject(ThreadPoolExecutor.java:821)
	at java.util.concurrent.ThreadPoolExecutor.execute(ThreadPoolExecutor.java:1372)
	at com.google.common.util.concurrent.MoreExecutors$ListeningDecorator.execute(MoreExecutors.java:440)
	at com.google.common.util.concurrent.AbstractListeningExecutorService.submit(AbstractListeningExecutorService.java:56)
	at org.apache.tez.runtime.library.common.writers.UnorderedPartitionedKVWriter.setupNextBuffer(UnorderedPartitionedKVWriter.java:437)
	at org.apache.tez.runtime.library.common.writers.UnorderedPartitionedKVWriter.write(UnorderedPartitionedKVWriter.java:379)
	at org.apache.tez.runtime.library.common.writers.UnorderedPartitionedKVWriter.write(UnorderedPartitionedKVWriter.java:330)
	at org.apache.tez.runtime.library.common.writers.TestUnorderedPartitionedKVWriter.baseTestWithPipelinedTransfer(TestUnorderedPartitionedKVWriter.java:639)
	at org.apache.tez.runtime.library.common.writers.TestUnorderedPartitionedKVWriter.testSkippedPartitions_WithPipelinedShuffle(TestUnorderedPartitionedKVWriter.java:582)


FAILED:  org.apache.tez.runtime.library.common.writers.TestUnorderedPartitionedKVWriter.testSkippedPartitions[test[false, MEMORY_OPTIMIZED]]

Error Message:
Task com.google.common.util.concurrent.ListenableFutureTask@684528a3 rejected from java.util.concurrent.ThreadPoolExecutor@146f1ad0[Running, pool size = 2, active threads = 2, queued tasks = 0, completed tasks = 0]

Stack Trace:
java.util.concurrent.RejectedExecutionException: Task com.google.common.util.concurrent.ListenableFutureTask@684528a3 rejected from java.util.concurrent.ThreadPoolExecutor@146f1ad0[Running, pool size = 2, active threads = 2, queued tasks = 0, completed tasks = 0]
	at java.util.concurrent.ThreadPoolExecutor$AbortPolicy.rejectedExecution(ThreadPoolExecutor.java:2048)
	at java.util.concurrent.ThreadPoolExecutor.reject(ThreadPoolExecutor.java:821)
	at java.util.concurrent.ThreadPoolExecutor.execute(ThreadPoolExecutor.java:1372)
	at com.google.common.util.concurrent.MoreExecutors$ListeningDecorator.execute(MoreExecutors.java:440)
	at com.google.common.util.concurrent.AbstractListeningExecutorService.submit(AbstractListeningExecutorService.java:56)
	at org.apache.tez.runtime.library.common.writers.UnorderedPartitionedKVWriter.setupNextBuffer(UnorderedPartitionedKVWriter.java:437)
	at org.apache.tez.runtime.library.common.writers.UnorderedPartitionedKVWriter.write(UnorderedPartitionedKVWriter.java:379)
	at org.apache.tez.runtime.library.common.writers.UnorderedPartitionedKVWriter.write(UnorderedPartitionedKVWriter.java:330)
	at org.apache.tez.runtime.library.common.writers.TestUnorderedPartitionedKVWriter.baseTest(TestUnorderedPartitionedKVWriter.java:832)
	at org.apache.tez.runtime.library.common.writers.TestUnorderedPartitionedKVWriter.testSkippedPartitions(TestUnorderedPartitionedKVWriter.java:273)


FAILED:  org.apache.tez.runtime.library.common.writers.TestUnorderedPartitionedKVWriter.testMultipleSpills_WithPipelinedShuffle[test[false, MEMORY_OPTIMIZED]]

Error Message:
Task com.google.common.util.concurrent.ListenableFutureTask@3b596684 rejected from java.util.concurrent.ThreadPoolExecutor@6a59828c[Running, pool size = 2, active threads = 2, queued tasks = 0, completed tasks = 1]

Stack Trace:
java.util.concurrent.RejectedExecutionException: Task com.google.common.util.concurrent.ListenableFutureTask@3b596684 rejected from java.util.concurrent.ThreadPoolExecutor@6a59828c[Running, pool size = 2, active threads = 2, queued tasks = 0, completed tasks = 1]
	at java.util.concurrent.ThreadPoolExecutor$AbortPolicy.rejectedExecution(ThreadPoolExecutor.java:2048)
	at java.util.concurrent.ThreadPoolExecutor.reject(ThreadPoolExecutor.java:821)
	at java.util.concurrent.ThreadPoolExecutor.execute(ThreadPoolExecutor.java:1372)
	at com.google.common.util.concurrent.MoreExecutors$ListeningDecorator.execute(MoreExecutors.java:440)
	at com.google.common.util.concurrent.AbstractListeningExecutorService.submit(AbstractListeningExecutorService.java:56)
	at org.apache.tez.runtime.library.common.writers.UnorderedPartitionedKVWriter.setupNextBuffer(UnorderedPartitionedKVWriter.java:437)
	at org.apache.tez.runtime.library.common.writers.UnorderedPartitionedKVWriter.write(UnorderedPartitionedKVWriter.java:379)
	at org.apache.tez.runtime.library.common.writers.UnorderedPartitionedKVWriter.write(UnorderedPartitionedKVWriter.java:330)
	at org.apache.tez.runtime.library.common.writers.TestUnorderedPartitionedKVWriter.baseTestWithPipelinedTransfer(TestUnorderedPartitionedKVWriter.java:639)
	at org.apache.tez.runtime.library.common.writers.TestUnorderedPartitionedKVWriter.testMultipleSpills_WithPipelinedShuffle(TestUnorderedPartitionedKVWriter.java:572)


FAILED:  org.apache.tez.runtime.library.common.writers.TestUnorderedPartitionedKVWriter.testMergeBuffersAndSpill[test[false, MEMORY_OPTIMIZED]]

Error Message:
Task com.google.common.util.concurrent.ListenableFutureTask@a9b03af rejected from java.util.concurrent.ThreadPoolExecutor@470edb99[Running, pool size = 2, active threads = 2, queued tasks = 0, completed tasks = 0]

Stack Trace:
java.util.concurrent.RejectedExecutionException: Task com.google.common.util.concurrent.ListenableFutureTask@a9b03af rejected from java.util.concurrent.ThreadPoolExecutor@470edb99[Running, pool size = 2, active threads = 2, queued tasks = 0, completed tasks = 0]
	at java.util.concurrent.ThreadPoolExecutor$AbortPolicy.rejectedExecution(ThreadPoolExecutor.java:2048)
	at java.util.concurrent.ThreadPoolExecutor.reject(ThreadPoolExecutor.java:821)
	at java.util.concurrent.ThreadPoolExecutor.execute(ThreadPoolExecutor.java:1372)
	at com.google.common.util.concurrent.MoreExecutors$ListeningDecorator.execute(MoreExecutors.java:440)
	at com.google.common.util.concurrent.AbstractListeningExecutorService.submit(AbstractListeningExecutorService.java:56)
	at org.apache.tez.runtime.library.common.writers.UnorderedPartitionedKVWriter.setupNextBuffer(UnorderedPartitionedKVWriter.java:437)
	at org.apache.tez.runtime.library.common.writers.UnorderedPartitionedKVWriter.write(UnorderedPartitionedKVWriter.java:379)
	at org.apache.tez.runtime.library.common.writers.UnorderedPartitionedKVWriter.write(UnorderedPartitionedKVWriter.java:330)
	at org.apache.tez.runtime.library.common.writers.TestUnorderedPartitionedKVWriter.baseTest(TestUnorderedPartitionedKVWriter.java:832)
	at org.apache.tez.runtime.library.common.writers.TestUnorderedPartitionedKVWriter.testMergeBuffersAndSpill(TestUnorderedPartitionedKVWriter.java:263)


FAILED:  org.apache.tez.runtime.library.common.writers.TestUnorderedPartitionedKVWriter.testMultipleSpills[test[false, MEMORY_OPTIMIZED]]

Error Message:
Task com.google.common.util.concurrent.ListenableFutureTask@455fcabc rejected from java.util.concurrent.ThreadPoolExecutor@13f72039[Running, pool size = 2, active threads = 2, queued tasks = 0, completed tasks = 1]

Stack Trace:
java.util.concurrent.RejectedExecutionException: Task com.google.common.util.concurrent.ListenableFutureTask@455fcabc rejected from java.util.concurrent.ThreadPoolExecutor@13f72039[Running, pool size = 2, active threads = 2, queued tasks = 0, completed tasks = 1]
	at java.util.concurrent.ThreadPoolExecutor$AbortPolicy.rejectedExecution(ThreadPoolExecutor.java:2048)
	at java.util.concurrent.ThreadPoolExecutor.reject(ThreadPoolExecutor.java:821)
	at java.util.concurrent.ThreadPoolExecutor.execute(ThreadPoolExecutor.java:1372)
	at com.google.common.util.concurrent.MoreExecutors$ListeningDecorator.execute(MoreExecutors.java:440)
	at com.google.common.util.concurrent.AbstractListeningExecutorService.submit(AbstractListeningExecutorService.java:56)
	at org.apache.tez.runtime.library.common.writers.UnorderedPartitionedKVWriter.setupNextBuffer(UnorderedPartitionedKVWriter.java:437)
	at org.apache.tez.runtime.library.common.writers.UnorderedPartitionedKVWriter.write(UnorderedPartitionedKVWriter.java:379)
	at org.apache.tez.runtime.library.common.writers.UnorderedPartitionedKVWriter.write(UnorderedPartitionedKVWriter.java:330)
	at org.apache.tez.runtime.library.common.writers.TestUnorderedPartitionedKVWriter.baseTest(TestUnorderedPartitionedKVWriter.java:832)
	at org.apache.tez.runtime.library.common.writers.TestUnorderedPartitionedKVWriter.testMultipleSpills(TestUnorderedPartitionedKVWriter.java:258)


FAILED:  org.apache.tez.runtime.library.common.writers.TestUnorderedPartitionedKVWriter.testMultipleSpills[test[false, PRECISE]]

Error Message:
Task com.google.common.util.concurrent.ListenableFutureTask@182365fe rejected from java.util.concurrent.ThreadPoolExecutor@3bfd1313[Running, pool size = 2, active threads = 2, queued tasks = 0, completed tasks = 1]

Stack Trace:
java.util.concurrent.RejectedExecutionException: Task com.google.common.util.concurrent.ListenableFutureTask@182365fe rejected from java.util.concurrent.ThreadPoolExecutor@3bfd1313[Running, pool size = 2, active threads = 2, queued tasks = 0, completed tasks = 1]
	at java.util.concurrent.ThreadPoolExecutor$AbortPolicy.rejectedExecution(ThreadPoolExecutor.java:2048)
	at java.util.concurrent.ThreadPoolExecutor.reject(ThreadPoolExecutor.java:821)
	at java.util.concurrent.ThreadPoolExecutor.execute(ThreadPoolExecutor.java:1372)
	at com.google.common.util.concurrent.MoreExecutors$ListeningDecorator.execute(MoreExecutors.java:440)
	at com.google.common.util.concurrent.AbstractListeningExecutorService.submit(AbstractListeningExecutorService.java:56)
	at org.apache.tez.runtime.library.common.writers.UnorderedPartitionedKVWriter.setupNextBuffer(UnorderedPartitionedKVWriter.java:437)
	at org.apache.tez.runtime.library.common.writers.UnorderedPartitionedKVWriter.write(UnorderedPartitionedKVWriter.java:379)
	at org.apache.tez.runtime.library.common.writers.UnorderedPartitionedKVWriter.write(UnorderedPartitionedKVWriter.java:330)
	at org.apache.tez.runtime.library.common.writers.TestUnorderedPartitionedKVWriter.baseTest(TestUnorderedPartitionedKVWriter.java:832)
	at org.apache.tez.runtime.library.common.writers.TestUnorderedPartitionedKVWriter.testMultipleSpills(TestUnorderedPartitionedKVWriter.java:258)


FAILED:  org.apache.tez.runtime.library.common.writers.TestUnorderedPartitionedKVWriter.testMultipleSpills_WithPipelinedShuffle[test[true, DISABLED]]

Error Message:
Task com.google.common.util.concurrent.ListenableFutureTask@68cb669d rejected from java.util.concurrent.ThreadPoolExecutor@1be032b[Running, pool size = 2, active threads = 2, queued tasks = 0, completed tasks = 0]

Stack Trace:
java.util.concurrent.RejectedExecutionException: Task com.google.common.util.concurrent.ListenableFutureTask@68cb669d rejected from java.util.concurrent.ThreadPoolExecutor@1be032b[Running, pool size = 2, active threads = 2, queued tasks = 0, completed tasks = 0]
	at java.util.concurrent.ThreadPoolExecutor$AbortPolicy.rejectedExecution(ThreadPoolExecutor.java:2048)
	at java.util.concurrent.ThreadPoolExecutor.reject(ThreadPoolExecutor.java:821)
	at java.util.concurrent.ThreadPoolExecutor.execute(ThreadPoolExecutor.java:1372)
	at com.google.common.util.concurrent.MoreExecutors$ListeningDecorator.execute(MoreExecutors.java:440)
	at com.google.common.util.concurrent.AbstractListeningExecutorService.submit(AbstractListeningExecutorService.java:56)
	at org.apache.tez.runtime.library.common.writers.UnorderedPartitionedKVWriter.setupNextBuffer(UnorderedPartitionedKVWriter.java:437)
	at org.apache.tez.runtime.library.common.writers.UnorderedPartitionedKVWriter.write(UnorderedPartitionedKVWriter.java:379)
	at org.apache.tez.runtime.library.common.writers.UnorderedPartitionedKVWriter.write(UnorderedPartitionedKVWriter.java:330)
	at org.apache.tez.runtime.library.common.writers.TestUnorderedPartitionedKVWriter.baseTestWithPipelinedTransfer(TestUnorderedPartitionedKVWriter.java:639)
	at org.apache.tez.runtime.library.common.writers.TestUnorderedPartitionedKVWriter.testMultipleSpills_WithPipelinedShuffle(TestUnorderedPartitionedKVWriter.java:572)


FAILED:  org.apache.tez.runtime.library.common.writers.TestUnorderedPartitionedKVWriter.testMergeBuffersAndSpill[test[true, DISABLED]]

Error Message:
Task com.google.common.util.concurrent.ListenableFutureTask@3e44adb2 rejected from java.util.concurrent.ThreadPoolExecutor@ee7a10e[Running, pool size = 2, active threads = 2, queued tasks = 0, completed tasks = 0]

Stack Trace:
java.util.concurrent.RejectedExecutionException: Task com.google.common.util.concurrent.ListenableFutureTask@3e44adb2 rejected from java.util.concurrent.ThreadPoolExecutor@ee7a10e[Running, pool size = 2, active threads = 2, queued tasks = 0, completed tasks = 0]
	at java.util.concurrent.ThreadPoolExecutor$AbortPolicy.rejectedExecution(ThreadPoolExecutor.java:2048)
	at java.util.concurrent.ThreadPoolExecutor.reject(ThreadPoolExecutor.java:821)
	at java.util.concurrent.ThreadPoolExecutor.execute(ThreadPoolExecutor.java:1372)
	at com.google.common.util.concurrent.MoreExecutors$ListeningDecorator.execute(MoreExecutors.java:440)
	at com.google.common.util.concurrent.AbstractListeningExecutorService.submit(AbstractListeningExecutorService.java:56)
	at org.apache.tez.runtime.library.common.writers.UnorderedPartitionedKVWriter.setupNextBuffer(UnorderedPartitionedKVWriter.java:437)
	at org.apache.tez.runtime.library.common.writers.UnorderedPartitionedKVWriter.write(UnorderedPartitionedKVWriter.java:379)
	at org.apache.tez.runtime.library.common.writers.UnorderedPartitionedKVWriter.write(UnorderedPartitionedKVWriter.java:330)
	at org.apache.tez.runtime.library.common.writers.TestUnorderedPartitionedKVWriter.baseTest(TestUnorderedPartitionedKVWriter.java:832)
	at org.apache.tez.runtime.library.common.writers.TestUnorderedPartitionedKVWriter.testMergeBuffersAndSpill(TestUnorderedPartitionedKVWriter.java:263)


FAILED:  org.apache.tez.runtime.library.common.writers.TestUnorderedPartitionedKVWriter.testSkippedPartitions_WithPipelinedShuffle[test[true, ENABLED]]

Error Message:
Task com.google.common.util.concurrent.ListenableFutureTask@7659657a rejected from java.util.concurrent.ThreadPoolExecutor@67156949[Running, pool size = 2, active threads = 2, queued tasks = 0, completed tasks = 0]

Stack Trace:
java.util.concurrent.RejectedExecutionException: Task com.google.common.util.concurrent.ListenableFutureTask@7659657a rejected from java.util.concurrent.ThreadPoolExecutor@67156949[Running, pool size = 2, active threads = 2, queued tasks = 0, completed tasks = 0]
	at java.util.concurrent.ThreadPoolExecutor$AbortPolicy.rejectedExecution(ThreadPoolExecutor.java:2048)
	at java.util.concurrent.ThreadPoolExecutor.reject(ThreadPoolExecutor.java:821)
	at java.util.concurrent.ThreadPoolExecutor.execute(ThreadPoolExecutor.java:1372)
	at com.google.common.util.concurrent.MoreExecutors$ListeningDecorator.execute(MoreExecutors.java:440)
	at com.google.common.util.concurrent.AbstractListeningExecutorService.submit(AbstractListeningExecutorService.java:56)
	at org.apache.tez.runtime.library.common.writers.UnorderedPartitionedKVWriter.setupNextBuffer(UnorderedPartitionedKVWriter.java:437)
	at org.apache.tez.runtime.library.common.writers.UnorderedPartitionedKVWriter.write(UnorderedPartitionedKVWriter.java:379)
	at org.apache.tez.runtime.library.common.writers.UnorderedPartitionedKVWriter.write(UnorderedPartitionedKVWriter.java:330)
	at org.apache.tez.runtime.library.common.writers.TestUnorderedPartitionedKVWriter.baseTestWithPipelinedTransfer(TestUnorderedPartitionedKVWriter.java:639)
	at org.apache.tez.runtime.library.common.writers.TestUnorderedPartitionedKVWriter.testSkippedPartitions_WithPipelinedShuffle(TestUnorderedPartitionedKVWriter.java:582)


FAILED:  org.apache.tez.runtime.library.common.writers.TestUnorderedPartitionedKVWriter.testMultipleSpills_WithPipelinedShuffle[test[true, ENABLED]]

Error Message:
Task com.google.common.util.concurrent.ListenableFutureTask@45ce49c9 rejected from java.util.concurrent.ThreadPoolExecutor@6a4e4eec[Running, pool size = 2, active threads = 2, queued tasks = 0, completed tasks = 0]

Stack Trace:
java.util.concurrent.RejectedExecutionException: Task com.google.common.util.concurrent.ListenableFutureTask@45ce49c9 rejected from java.util.concurrent.ThreadPoolExecutor@6a4e4eec[Running, pool size = 2, active threads = 2, queued tasks = 0, completed tasks = 0]
	at java.util.concurrent.ThreadPoolExecutor$AbortPolicy.rejectedExecution(ThreadPoolExecutor.java:2048)
	at java.util.concurrent.ThreadPoolExecutor.reject(ThreadPoolExecutor.java:821)
	at java.util.concurrent.ThreadPoolExecutor.execute(ThreadPoolExecutor.java:1372)
	at com.google.common.util.concurrent.MoreExecutors$ListeningDecorator.execute(MoreExecutors.java:440)
	at com.google.common.util.concurrent.AbstractListeningExecutorService.submit(AbstractListeningExecutorService.java:56)
	at org.apache.tez.runtime.library.common.writers.UnorderedPartitionedKVWriter.setupNextBuffer(UnorderedPartitionedKVWriter.java:437)
	at org.apache.tez.runtime.library.common.writers.UnorderedPartitionedKVWriter.write(UnorderedPartitionedKVWriter.java:379)
	at org.apache.tez.runtime.library.common.writers.UnorderedPartitionedKVWriter.write(UnorderedPartitionedKVWriter.java:330)
	at org.apache.tez.runtime.library.common.writers.TestUnorderedPartitionedKVWriter.baseTestWithPipelinedTransfer(TestUnorderedPartitionedKVWriter.java:639)
	at org.apache.tez.runtime.library.common.writers.TestUnorderedPartitionedKVWriter.testMultipleSpills_WithPipelinedShuffle(TestUnorderedPartitionedKVWriter.java:572)