You are viewing a plain text version of this content. The canonical link for it is here.
Posted to commits@beam.apache.org by Apache Jenkins Server <je...@builds.apache.org> on 2018/08/20 06:28:18 UTC
Build failed in Jenkins: beam_PostCommit_Py_VR_Dataflow #846
See <https://builds.apache.org/job/beam_PostCommit_Py_VR_Dataflow/846/display/redirect>
------------------------------------------
[...truncated 78.15 KB...]
Collecting funcsigs>=1 (from mock->-r postcommit_requirements.txt (line 2))
File was already downloaded /tmp/dataflow-requirements-cache/funcsigs-1.0.2.tar.gz
File was already downloaded /tmp/dataflow-requirements-cache/funcsigs-1.0.2.tar.gz
File was already downloaded /tmp/dataflow-requirements-cache/funcsigs-1.0.2.tar.gz
File was already downloaded /tmp/dataflow-requirements-cache/funcsigs-1.0.2.tar.gz
File was already downloaded /tmp/dataflow-requirements-cache/funcsigs-1.0.2.tar.gz
File was already downloaded /tmp/dataflow-requirements-cache/funcsigs-1.0.2.tar.gz
Collecting funcsigs>=1 (from mock->-r postcommit_requirements.txt (line 2))
File was already downloaded /tmp/dataflow-requirements-cache/funcsigs-1.0.2.tar.gz
Collecting funcsigs>=1 (from mock->-r postcommit_requirements.txt (line 2))
File was already downloaded /tmp/dataflow-requirements-cache/funcsigs-1.0.2.tar.gz
Collecting pbr>=0.11 (from mock->-r postcommit_requirements.txt (line 2))
Collecting pbr>=0.11 (from mock->-r postcommit_requirements.txt (line 2))
Collecting pbr>=0.11 (from mock->-r postcommit_requirements.txt (line 2))
Collecting pbr>=0.11 (from mock->-r postcommit_requirements.txt (line 2))
Collecting pbr>=0.11 (from mock->-r postcommit_requirements.txt (line 2))
Collecting pbr>=0.11 (from mock->-r postcommit_requirements.txt (line 2))
File was already downloaded /tmp/dataflow-requirements-cache/pbr-4.2.0.tar.gz
File was already downloaded /tmp/dataflow-requirements-cache/pbr-4.2.0.tar.gz
File was already downloaded /tmp/dataflow-requirements-cache/pbr-4.2.0.tar.gz
File was already downloaded /tmp/dataflow-requirements-cache/pbr-4.2.0.tar.gz
File was already downloaded /tmp/dataflow-requirements-cache/pbr-4.2.0.tar.gz
File was already downloaded /tmp/dataflow-requirements-cache/pbr-4.2.0.tar.gz
Collecting pbr>=0.11 (from mock->-r postcommit_requirements.txt (line 2))
Collecting pbr>=0.11 (from mock->-r postcommit_requirements.txt (line 2))
File was already downloaded /tmp/dataflow-requirements-cache/pbr-4.2.0.tar.gz
File was already downloaded /tmp/dataflow-requirements-cache/pbr-4.2.0.tar.gz
Successfully downloaded pyhamcrest mock setuptools six funcsigs pbr
Successfully downloaded pyhamcrest mock setuptools six funcsigs pbr
Successfully downloaded pyhamcrest mock setuptools six funcsigs pbr
Successfully downloaded pyhamcrest mock setuptools six funcsigs pbr
Successfully downloaded pyhamcrest mock setuptools six funcsigs pbr
Successfully downloaded pyhamcrest mock setuptools six funcsigs pbr
Successfully downloaded pyhamcrest mock setuptools six funcsigs pbr
Successfully downloaded pyhamcrest mock setuptools six funcsigs pbr
<https://builds.apache.org/job/beam_PostCommit_Py_VR_Dataflow/ws/src/sdks/python/apache_beam/runners/dataflow/test_dataflow_runner.py>:54: DeprecationWarning: options is deprecated since First stable release. References to <pipeline>.options will not be supported
print('Found: %s.' % self.build_console_url(pipeline.options))
<https://builds.apache.org/job/beam_PostCommit_Py_VR_Dataflow/ws/src/sdks/python/apache_beam/runners/dataflow/test_dataflow_runner.py>:54: DeprecationWarning: options is deprecated since First stable release. References to <pipeline>.options will not be supported
print('Found: %s.' % self.build_console_url(pipeline.options))
<https://builds.apache.org/job/beam_PostCommit_Py_VR_Dataflow/ws/src/sdks/python/apache_beam/runners/dataflow/test_dataflow_runner.py>:54: DeprecationWarning: options is deprecated since First stable release. References to <pipeline>.options will not be supported
print('Found: %s.' % self.build_console_url(pipeline.options))
<https://builds.apache.org/job/beam_PostCommit_Py_VR_Dataflow/ws/src/sdks/python/apache_beam/runners/dataflow/test_dataflow_runner.py>:54: DeprecationWarning: options is deprecated since First stable release. References to <pipeline>.options will not be supported
print('Found: %s.' % self.build_console_url(pipeline.options))
<https://builds.apache.org/job/beam_PostCommit_Py_VR_Dataflow/ws/src/sdks/python/apache_beam/runners/dataflow/test_dataflow_runner.py>:54: DeprecationWarning: options is deprecated since First stable release. References to <pipeline>.options will not be supported
print('Found: %s.' % self.build_console_url(pipeline.options))
<https://builds.apache.org/job/beam_PostCommit_Py_VR_Dataflow/ws/src/sdks/python/apache_beam/runners/dataflow/test_dataflow_runner.py>:54: DeprecationWarning: options is deprecated since First stable release. References to <pipeline>.options will not be supported
print('Found: %s.' % self.build_console_url(pipeline.options))
<https://builds.apache.org/job/beam_PostCommit_Py_VR_Dataflow/ws/src/sdks/python/apache_beam/runners/dataflow/test_dataflow_runner.py>:54: DeprecationWarning: options is deprecated since First stable release. References to <pipeline>.options will not be supported
print('Found: %s.' % self.build_console_url(pipeline.options))
<https://builds.apache.org/job/beam_PostCommit_Py_VR_Dataflow/ws/src/sdks/python/apache_beam/runners/dataflow/test_dataflow_runner.py>:54: DeprecationWarning: options is deprecated since First stable release. References to <pipeline>.options will not be supported
print('Found: %s.' % self.build_console_url(pipeline.options))
WARNING:root:Waiting indefinitely for streaming job.
WARNING:root:Waiting indefinitely for streaming job.
WARNING:root:Waiting indefinitely for streaming job.
WARNING:root:Waiting indefinitely for streaming job.
WARNING:root:Waiting indefinitely for streaming job.
WARNING:root:Waiting indefinitely for streaming job.
WARNING:root:Waiting indefinitely for streaming job.
test_as_list_twice (apache_beam.transforms.sideinputs_test.SideInputsTest) ... ERROR
Collecting pyhamcrest (from -r postcommit_requirements.txt (line 1))
File was already downloaded /tmp/dataflow-requirements-cache/PyHamcrest-1.9.0.tar.gz
Collecting mock (from -r postcommit_requirements.txt (line 2))
File was already downloaded /tmp/dataflow-requirements-cache/mock-2.0.0.tar.gz
Collecting setuptools (from pyhamcrest->-r postcommit_requirements.txt (line 1))
File was already downloaded /tmp/dataflow-requirements-cache/setuptools-40.1.0.zip
Collecting six (from pyhamcrest->-r postcommit_requirements.txt (line 1))
File was already downloaded /tmp/dataflow-requirements-cache/six-1.11.0.tar.gz
Collecting funcsigs>=1 (from mock->-r postcommit_requirements.txt (line 2))
File was already downloaded /tmp/dataflow-requirements-cache/funcsigs-1.0.2.tar.gz
Collecting pbr>=0.11 (from mock->-r postcommit_requirements.txt (line 2))
File was already downloaded /tmp/dataflow-requirements-cache/pbr-4.2.0.tar.gz
Successfully downloaded pyhamcrest mock setuptools six funcsigs pbr
WARNING:root:Waiting indefinitely for streaming job.
test_undeclared_outputs (apache_beam.transforms.ptransform_test.PTransformTest) ... ok
Collecting pyhamcrest (from -r postcommit_requirements.txt (line 1))
File was already downloaded /tmp/dataflow-requirements-cache/PyHamcrest-1.9.0.tar.gz
Collecting mock (from -r postcommit_requirements.txt (line 2))
File was already downloaded /tmp/dataflow-requirements-cache/mock-2.0.0.tar.gz
Collecting setuptools (from pyhamcrest->-r postcommit_requirements.txt (line 1))
File was already downloaded /tmp/dataflow-requirements-cache/setuptools-40.1.0.zip
Collecting six (from pyhamcrest->-r postcommit_requirements.txt (line 1))
File was already downloaded /tmp/dataflow-requirements-cache/six-1.11.0.tar.gz
Collecting funcsigs>=1 (from mock->-r postcommit_requirements.txt (line 2))
File was already downloaded /tmp/dataflow-requirements-cache/funcsigs-1.0.2.tar.gz
Collecting pbr>=0.11 (from mock->-r postcommit_requirements.txt (line 2))
File was already downloaded /tmp/dataflow-requirements-cache/pbr-4.2.0.tar.gz
Successfully downloaded pyhamcrest mock setuptools six funcsigs pbr
test_multiple_empty_outputs (apache_beam.transforms.ptransform_test.PTransformTest) ... ok
Collecting pyhamcrest (from -r postcommit_requirements.txt (line 1))
File was already downloaded /tmp/dataflow-requirements-cache/PyHamcrest-1.9.0.tar.gz
Collecting mock (from -r postcommit_requirements.txt (line 2))
File was already downloaded /tmp/dataflow-requirements-cache/mock-2.0.0.tar.gz
Collecting setuptools (from pyhamcrest->-r postcommit_requirements.txt (line 1))
File was already downloaded /tmp/dataflow-requirements-cache/setuptools-40.1.0.zip
Collecting six (from pyhamcrest->-r postcommit_requirements.txt (line 1))
File was already downloaded /tmp/dataflow-requirements-cache/six-1.11.0.tar.gz
Collecting funcsigs>=1 (from mock->-r postcommit_requirements.txt (line 2))
File was already downloaded /tmp/dataflow-requirements-cache/funcsigs-1.0.2.tar.gz
Collecting pbr>=0.11 (from mock->-r postcommit_requirements.txt (line 2))
File was already downloaded /tmp/dataflow-requirements-cache/pbr-4.2.0.tar.gz
Successfully downloaded pyhamcrest mock setuptools six funcsigs pbr
WARNING:root:Waiting indefinitely for streaming job.
WARNING:root:Waiting indefinitely for streaming job.
test_par_do_with_multiple_outputs_and_using_yield (apache_beam.transforms.ptransform_test.PTransformTest) ... ok
test_flatten_multiple_pcollections_having_multiple_consumers (apache_beam.transforms.ptransform_test.PTransformTest) ... ok
Collecting pyhamcrest (from -r postcommit_requirements.txt (line 1))
File was already downloaded /tmp/dataflow-requirements-cache/PyHamcrest-1.9.0.tar.gz
Collecting mock (from -r postcommit_requirements.txt (line 2))
File was already downloaded /tmp/dataflow-requirements-cache/mock-2.0.0.tar.gz
Collecting pyhamcrest (from -r postcommit_requirements.txt (line 1))
File was already downloaded /tmp/dataflow-requirements-cache/PyHamcrest-1.9.0.tar.gz
Collecting setuptools (from pyhamcrest->-r postcommit_requirements.txt (line 1))
Collecting mock (from -r postcommit_requirements.txt (line 2))
File was already downloaded /tmp/dataflow-requirements-cache/setuptools-40.1.0.zip
File was already downloaded /tmp/dataflow-requirements-cache/mock-2.0.0.tar.gz
Collecting six (from pyhamcrest->-r postcommit_requirements.txt (line 1))
File was already downloaded /tmp/dataflow-requirements-cache/six-1.11.0.tar.gz
Collecting setuptools (from pyhamcrest->-r postcommit_requirements.txt (line 1))
Collecting funcsigs>=1 (from mock->-r postcommit_requirements.txt (line 2))
File was already downloaded /tmp/dataflow-requirements-cache/funcsigs-1.0.2.tar.gz
File was already downloaded /tmp/dataflow-requirements-cache/setuptools-40.1.0.zip
Collecting pbr>=0.11 (from mock->-r postcommit_requirements.txt (line 2))
File was already downloaded /tmp/dataflow-requirements-cache/pbr-4.2.0.tar.gz
Collecting six (from pyhamcrest->-r postcommit_requirements.txt (line 1))
File was already downloaded /tmp/dataflow-requirements-cache/six-1.11.0.tar.gz
Collecting funcsigs>=1 (from mock->-r postcommit_requirements.txt (line 2))
File was already downloaded /tmp/dataflow-requirements-cache/funcsigs-1.0.2.tar.gz
Successfully downloaded pyhamcrest mock setuptools six funcsigs pbr
Collecting pbr>=0.11 (from mock->-r postcommit_requirements.txt (line 2))
File was already downloaded /tmp/dataflow-requirements-cache/pbr-4.2.0.tar.gz
Successfully downloaded pyhamcrest mock setuptools six funcsigs pbr
test_as_dict_twice (apache_beam.transforms.sideinputs_test.SideInputsTest) ... ok
Collecting pyhamcrest (from -r postcommit_requirements.txt (line 1))
File was already downloaded /tmp/dataflow-requirements-cache/PyHamcrest-1.9.0.tar.gz
Collecting mock (from -r postcommit_requirements.txt (line 2))
File was already downloaded /tmp/dataflow-requirements-cache/mock-2.0.0.tar.gz
Collecting setuptools (from pyhamcrest->-r postcommit_requirements.txt (line 1))
File was already downloaded /tmp/dataflow-requirements-cache/setuptools-40.1.0.zip
Collecting six (from pyhamcrest->-r postcommit_requirements.txt (line 1))
File was already downloaded /tmp/dataflow-requirements-cache/six-1.11.0.tar.gz
Collecting funcsigs>=1 (from mock->-r postcommit_requirements.txt (line 2))
File was already downloaded /tmp/dataflow-requirements-cache/funcsigs-1.0.2.tar.gz
Collecting pbr>=0.11 (from mock->-r postcommit_requirements.txt (line 2))
File was already downloaded /tmp/dataflow-requirements-cache/pbr-4.2.0.tar.gz
WARNING:root:Waiting indefinitely for streaming job.
Successfully downloaded pyhamcrest mock setuptools six funcsigs pbr
WARNING:root:Waiting indefinitely for streaming job.
WARNING:root:Waiting indefinitely for streaming job.
test_as_list_and_as_dict_side_inputs (apache_beam.transforms.sideinputs_test.SideInputsTest) ... ok
test_as_singleton_with_different_defaults (apache_beam.transforms.sideinputs_test.SideInputsTest) ... ok
test_par_do_with_multiple_outputs_and_using_return (apache_beam.transforms.ptransform_test.PTransformTest) ... ok
test_default_value_singleton_side_input (apache_beam.transforms.sideinputs_test.SideInputsTest) ... ok
test_as_singleton_without_unique_labels (apache_beam.transforms.sideinputs_test.SideInputsTest) ... ok
test_empty_singleton_side_input (apache_beam.transforms.sideinputs_test.SideInputsTest) ... ok
test_flattened_side_input (apache_beam.transforms.sideinputs_test.SideInputsTest) ... ok
test_iterable_side_input (apache_beam.transforms.sideinputs_test.SideInputsTest) ... ok
======================================================================
ERROR: test_as_list_twice (apache_beam.transforms.sideinputs_test.SideInputsTest)
----------------------------------------------------------------------
Traceback (most recent call last):
File "<https://builds.apache.org/job/beam_PostCommit_Py_VR_Dataflow/ws/src/sdks/python/apache_beam/transforms/sideinputs_test.py",> line 274, in test_as_list_twice
pipeline.run()
File "<https://builds.apache.org/job/beam_PostCommit_Py_VR_Dataflow/ws/src/sdks/python/apache_beam/testing/test_pipeline.py",> line 104, in run
result = super(TestPipeline, self).run(test_runner_api)
File "<https://builds.apache.org/job/beam_PostCommit_Py_VR_Dataflow/ws/src/sdks/python/apache_beam/pipeline.py",> line 394, in run
self.to_runner_api(), self.runner, self._options).run(False)
File "<https://builds.apache.org/job/beam_PostCommit_Py_VR_Dataflow/ws/src/sdks/python/apache_beam/pipeline.py",> line 407, in run
return self.runner.run_pipeline(self)
File "<https://builds.apache.org/job/beam_PostCommit_Py_VR_Dataflow/ws/src/sdks/python/apache_beam/runners/dataflow/test_dataflow_runner.py",> line 68, in run_pipeline
self.result.cancel()
File "<https://builds.apache.org/job/beam_PostCommit_Py_VR_Dataflow/ws/src/sdks/python/apache_beam/runners/dataflow/dataflow_runner.py",> line 1160, in cancel
self.job_id(), 'JOB_STATE_CANCELLED'):
File "<https://builds.apache.org/job/beam_PostCommit_Py_VR_Dataflow/ws/src/sdks/python/apache_beam/utils/retry.py",> line 184, in wrapper
return fun(*args, **kwargs)
File "<https://builds.apache.org/job/beam_PostCommit_Py_VR_Dataflow/ws/src/sdks/python/apache_beam/runners/dataflow/internal/apiclient.py",> line 600, in modify_job_state
self._client.projects_locations_jobs.Update(request)
File "<https://builds.apache.org/job/beam_PostCommit_Py_VR_Dataflow/ws/src/sdks/python/apache_beam/runners/dataflow/internal/clients/dataflow/dataflow_v1b3_client.py",> line 698, in Update
config, request, global_params=global_params)
File "<https://builds.apache.org/job/beam_PostCommit_Py_VR_Dataflow/ws/src/sdks/python/build/gradleenv/local/lib/python2.7/site-packages/apitools/base/py/base_api.py",> line 722, in _RunMethod
return self.ProcessHttpResponse(method_config, http_response, request)
File "<https://builds.apache.org/job/beam_PostCommit_Py_VR_Dataflow/ws/src/sdks/python/build/gradleenv/local/lib/python2.7/site-packages/apitools/base/py/base_api.py",> line 728, in ProcessHttpResponse
self.__ProcessHttpResponse(method_config, http_response, request))
File "<https://builds.apache.org/job/beam_PostCommit_Py_VR_Dataflow/ws/src/sdks/python/build/gradleenv/local/lib/python2.7/site-packages/apitools/base/py/base_api.py",> line 599, in __ProcessHttpResponse
http_response, method_config=method_config, request=request)
HttpBadRequestError: HttpError accessing <https://dataflow.googleapis.com/v1b3/projects/apache-beam-testing/locations/us-central1/jobs/2018-08-19_23_14_42-1804720440713419352?alt=json>: response: <{'status': '400', 'content-length': '315', 'x-xss-protection': '1; mode=block', 'x-content-type-options': 'nosniff', 'transfer-encoding': 'chunked', 'vary': 'Origin, X-Origin, Referer', 'server': 'ESF', '-content-encoding': 'gzip', 'cache-control': 'private', 'date': 'Mon, 20 Aug 2018 06:16:45 GMT', 'x-frame-options': 'SAMEORIGIN', 'content-type': 'application/json; charset=UTF-8'}>, content <{
"error": {
"code": 400,
"message": "(e875fbe8c04cbfc5): Workflow modification failed. Causes: (86bdfc0df7050a5a): Operation cancel not allowed for job 2018-08-19_23_14_42-1804720440713419352. Job is not yet ready for canceling. Please retry in a few minutes.",
"status": "FAILED_PRECONDITION"
}
}
>
-------------------- >> begin captured stdout << ---------------------
Found: https://console.cloud.google.com/dataflow/jobsDetail/locations/us-central1/jobs/2018-08-19_23_14_42-1804720440713419352?project=apache-beam-testing.
--------------------- >> end captured stdout << ----------------------
----------------------------------------------------------------------
XML: <https://builds.apache.org/job/beam_PostCommit_Py_VR_Dataflow/ws/src/sdks/python/nosetests.xml>
----------------------------------------------------------------------
Ran 14 tests in 822.427s
FAILED (errors=1)
> Task :beam-sdks-python:validatesRunnerStreamingTests FAILED
:beam-sdks-python:validatesRunnerStreamingTests (Thread[Task worker for ':',5,main]) completed. Took 13 mins 43.93 secs.
FAILURE: Build completed with 2 failures.
1: Task failed with an exception.
-----------
* Where:
Build file '<https://builds.apache.org/job/beam_PostCommit_Py_VR_Dataflow/ws/src/sdks/python/build.gradle'> line: 242
* What went wrong:
Execution failed for task ':beam-sdks-python:validatesRunnerBatchTests'.
> Process 'command 'sh'' finished with non-zero exit value 1
* Try:
Run with --stacktrace option to get the stack trace. Run with --debug option to get more log output. Run with --scan to get full insights.
==============================================================================
2: Task failed with an exception.
-----------
* Where:
Build file '<https://builds.apache.org/job/beam_PostCommit_Py_VR_Dataflow/ws/src/sdks/python/build.gradle'> line: 251
* What went wrong:
Execution failed for task ':beam-sdks-python:validatesRunnerStreamingTests'.
> Process 'command 'sh'' finished with non-zero exit value 1
* Try:
Run with --stacktrace option to get the stack trace. Run with --debug option to get more log output. Run with --scan to get full insights.
==============================================================================
* Get more help at https://help.gradle.org
Deprecated Gradle features were used in this build, making it incompatible with Gradle 5.0.
See https://docs.gradle.org/4.8/userguide/command_line_interface.html#sec:command_line_warnings
BUILD FAILED in 28m 10s
4 actionable tasks: 4 executed
Publishing build scan...
https://gradle.com/s/o5zfs3qg7v2da
Build step 'Invoke Gradle script' changed build result to FAILURE
Build step 'Invoke Gradle script' marked build as failure
Jenkins build is back to normal : beam_PostCommit_Py_VR_Dataflow
#847
Posted by Apache Jenkins Server <je...@builds.apache.org>.
See <https://builds.apache.org/job/beam_PostCommit_Py_VR_Dataflow/847/display/redirect?page=changes>