You are viewing a plain text version of this content. The canonical link for it is here.
Posted to dev@lucene.apache.org by Apache Jenkins Server <je...@builds.apache.org> on 2013/01/15 01:24:15 UTC

[JENKINS] Lucene-Solr-Tests-4.x-Java6 - Build # 1234 - Failure

Build: https://builds.apache.org/job/Lucene-Solr-Tests-4.x-Java6/1234/

1 tests failed.
REGRESSION:  org.apache.solr.cloud.SyncSliceTest.testDistribSearch

Error Message:
shard1 should have just been set up to be inconsistent - but it's still consistent

Stack Trace:
java.lang.AssertionError: shard1 should have just been set up to be inconsistent - but it's still consistent
	at __randomizedtesting.SeedInfo.seed([408ACDF6F69A1ACC:C16C43EE81C57AF0]:0)
	at org.junit.Assert.fail(Assert.java:93)
	at org.junit.Assert.assertTrue(Assert.java:43)
	at org.junit.Assert.assertNotNull(Assert.java:526)
	at org.apache.solr.cloud.SyncSliceTest.doTest(SyncSliceTest.java:214)
	at org.apache.solr.BaseDistributedSearchTestCase.testDistribSearch(BaseDistributedSearchTestCase.java:794)
	at sun.reflect.NativeMethodAccessorImpl.invoke0(Native Method)
	at sun.reflect.NativeMethodAccessorImpl.invoke(NativeMethodAccessorImpl.java:57)
	at sun.reflect.DelegatingMethodAccessorImpl.invoke(DelegatingMethodAccessorImpl.java:43)
	at java.lang.reflect.Method.invoke(Method.java:616)
	at com.carrotsearch.randomizedtesting.RandomizedRunner.invoke(RandomizedRunner.java:1559)
	at com.carrotsearch.randomizedtesting.RandomizedRunner.access$600(RandomizedRunner.java:79)
	at com.carrotsearch.randomizedtesting.RandomizedRunner$6.evaluate(RandomizedRunner.java:737)
	at com.carrotsearch.randomizedtesting.RandomizedRunner$7.evaluate(RandomizedRunner.java:773)
	at com.carrotsearch.randomizedtesting.RandomizedRunner$8.evaluate(RandomizedRunner.java:787)
	at com.carrotsearch.randomizedtesting.rules.SystemPropertiesRestoreRule$1.evaluate(SystemPropertiesRestoreRule.java:53)
	at org.apache.lucene.util.TestRuleSetupTeardownChained$1.evaluate(TestRuleSetupTeardownChained.java:50)
	at org.apache.lucene.util.TestRuleFieldCacheSanity$1.evaluate(TestRuleFieldCacheSanity.java:51)
	at org.apache.lucene.util.AbstractBeforeAfterRule$1.evaluate(AbstractBeforeAfterRule.java:46)
	at com.carrotsearch.randomizedtesting.rules.SystemPropertiesInvariantRule$1.evaluate(SystemPropertiesInvariantRule.java:55)
	at org.apache.lucene.util.TestRuleThreadAndTestName$1.evaluate(TestRuleThreadAndTestName.java:49)
	at org.apache.lucene.util.TestRuleIgnoreAfterMaxFailures$1.evaluate(TestRuleIgnoreAfterMaxFailures.java:70)
	at org.apache.lucene.util.TestRuleMarkFailure$1.evaluate(TestRuleMarkFailure.java:48)
	at com.carrotsearch.randomizedtesting.rules.StatementAdapter.evaluate(StatementAdapter.java:36)
	at com.carrotsearch.randomizedtesting.ThreadLeakControl$StatementRunner.run(ThreadLeakControl.java:358)
	at com.carrotsearch.randomizedtesting.ThreadLeakControl.forkTimeoutingTask(ThreadLeakControl.java:782)
	at com.carrotsearch.randomizedtesting.ThreadLeakControl$3.evaluate(ThreadLeakControl.java:442)
	at com.carrotsearch.randomizedtesting.RandomizedRunner.runSingleTest(RandomizedRunner.java:746)
	at com.carrotsearch.randomizedtesting.RandomizedRunner$3.evaluate(RandomizedRunner.java:648)
	at com.carrotsearch.randomizedtesting.RandomizedRunner$4.evaluate(RandomizedRunner.java:682)
	at com.carrotsearch.randomizedtesting.RandomizedRunner$5.evaluate(RandomizedRunner.java:693)
	at com.carrotsearch.randomizedtesting.rules.StatementAdapter.evaluate(StatementAdapter.java:36)
	at com.carrotsearch.randomizedtesting.rules.SystemPropertiesRestoreRule$1.evaluate(SystemPropertiesRestoreRule.java:53)
	at org.apache.lucene.util.AbstractBeforeAfterRule$1.evaluate(AbstractBeforeAfterRule.java:46)
	at org.apache.lucene.util.TestRuleStoreClassName$1.evaluate(TestRuleStoreClassName.java:42)
	at com.carrotsearch.randomizedtesting.rules.SystemPropertiesInvariantRule$1.evaluate(SystemPropertiesInvariantRule.java:55)
	at com.carrotsearch.randomizedtesting.rules.NoShadowingOrOverridesOnMethodsRule$1.evaluate(NoShadowingOrOverridesOnMethodsRule.java:39)
	at com.carrotsearch.randomizedtesting.rules.NoShadowingOrOverridesOnMethodsRule$1.evaluate(NoShadowingOrOverridesOnMethodsRule.java:39)
	at com.carrotsearch.randomizedtesting.rules.StatementAdapter.evaluate(StatementAdapter.java:36)
	at org.apache.lucene.util.TestRuleAssertionsRequired$1.evaluate(TestRuleAssertionsRequired.java:43)
	at org.apache.lucene.util.TestRuleMarkFailure$1.evaluate(TestRuleMarkFailure.java:48)
	at org.apache.lucene.util.TestRuleIgnoreAfterMaxFailures$1.evaluate(TestRuleIgnoreAfterMaxFailures.java:70)
	at org.apache.lucene.util.TestRuleIgnoreTestSuites$1.evaluate(TestRuleIgnoreTestSuites.java:55)
	at com.carrotsearch.randomizedtesting.rules.StatementAdapter.evaluate(StatementAdapter.java:36)
	at com.carrotsearch.randomizedtesting.ThreadLeakControl$StatementRunner.run(ThreadLeakControl.java:358)
	at java.lang.Thread.run(Thread.java:679)




Build Log:
[...truncated 8142 lines...]
[junit4:junit4] Suite: org.apache.solr.cloud.SyncSliceTest
[junit4:junit4]   2> 0 T1257 oas.BaseDistributedSearchTestCase.initHostContext Setting hostContext system property: /
[junit4:junit4]   2> 3 T1257 oas.SolrTestCaseJ4.setUp ###Starting testDistribSearch
[junit4:junit4]   2> Creating dataDir: /usr/home/hudson/hudson-slave/workspace/Lucene-Solr-Tests-4.x-Java6/solr/build/solr-core/test/J1/./solrtest-SyncSliceTest-1358208618815
[junit4:junit4]   2> 4 T1257 oasc.ZkTestServer.run STARTING ZK TEST SERVER
[junit4:junit4]   2> 4 T1258 oasc.ZkTestServer$ZKServerMain.runFromConfig Starting server
[junit4:junit4]   2> 6 T1258 oazs.ZooKeeperServer.setTickTime tickTime set to 1000
[junit4:junit4]   2> 6 T1258 oazs.ZooKeeperServer.setMinSessionTimeout minSessionTimeout set to -1
[junit4:junit4]   2> 6 T1258 oazs.ZooKeeperServer.setMaxSessionTimeout maxSessionTimeout set to -1
[junit4:junit4]   2> 7 T1258 oazs.NIOServerCnxnFactory.configure binding to port 0.0.0.0/0.0.0.0:0
[junit4:junit4]   2> 9 T1258 oazsp.FileTxnSnapLog.save Snapshotting: 0x0 to /usr/home/hudson/hudson-slave/workspace/Lucene-Solr-Tests-4.x-Java6/solr/build/solr-core/test/J1/./org.apache.solr.cloud.SyncSliceTest-1358208618814/zookeeper/server1/data/version-2/snapshot.0
[junit4:junit4]   2> 105 T1257 oasc.ZkTestServer.run start zk server on port:36585
[junit4:junit4]   2> 105 T1257 oaz.ZooKeeper.<init> Initiating client connection, connectString=127.0.0.1:36585 sessionTimeout=10000 watcher=org.apache.solr.common.cloud.ConnectionManager@1decdf9d
[junit4:junit4]   2> 106 T1257 oascc.ConnectionManager.waitForConnected Waiting for client to connect to ZooKeeper
[junit4:junit4]   2> 106 T1263 oaz.ClientCnxn$SendThread.logStartConnect Opening socket connection to server localhost/127.0.0.1:36585. Will not attempt to authenticate using SASL (access denied (javax.security.auth.AuthPermission getLoginConfiguration))
[junit4:junit4]   2> 107 T1263 oaz.ClientCnxn$SendThread.primeConnection Socket connection established to localhost/127.0.0.1:36585, initiating session
[junit4:junit4]   2> 107 T1259 oazs.NIOServerCnxnFactory.run Accepted socket connection from /140.211.11.196:36586
[junit4:junit4]   2> 107 T1259 oazs.ZooKeeperServer.processConnectRequest Client attempting to establish new session at /140.211.11.196:36586
[junit4:junit4]   2> 108 T1261 oazsp.FileTxnLog.append Creating new log file: log.1
[junit4:junit4]   2> 110 T1261 oazs.ZooKeeperServer.finishSessionInit Established session 0x13c3b8ad1450000 with negotiated timeout 10000 for client /140.211.11.196:36586
[junit4:junit4]   2> 110 T1263 oaz.ClientCnxn$SendThread.onConnected Session establishment complete on server localhost/127.0.0.1:36585, sessionid = 0x13c3b8ad1450000, negotiated timeout = 10000
[junit4:junit4]   2> 110 T1264 oascc.ConnectionManager.process Watcher org.apache.solr.common.cloud.ConnectionManager@1decdf9d name:ZooKeeperConnection Watcher:127.0.0.1:36585 got event WatchedEvent state:SyncConnected type:None path:null path:null type:None
[junit4:junit4]   2> 110 T1257 oascc.ConnectionManager.waitForConnected Client is connected to ZooKeeper
[junit4:junit4]   2> 111 T1257 oascc.SolrZkClient.makePath makePath: /solr
[junit4:junit4]   2> 113 T1262 oazs.PrepRequestProcessor.pRequest2Txn Processed session termination for sessionid: 0x13c3b8ad1450000
[junit4:junit4]   2> 121 T1264 oaz.ClientCnxn$EventThread.run EventThread shut down
[junit4:junit4]   2> 121 T1259 oazs.NIOServerCnxn.closeSock Closed socket connection for client /140.211.11.196:36586 which had sessionid 0x13c3b8ad1450000
[junit4:junit4]   2> 121 T1257 oaz.ZooKeeper.close Session: 0x13c3b8ad1450000 closed
[junit4:junit4]   2> 122 T1257 oaz.ZooKeeper.<init> Initiating client connection, connectString=127.0.0.1:36585/solr sessionTimeout=10000 watcher=org.apache.solr.common.cloud.ConnectionManager@5c1f7fd0
[junit4:junit4]   2> 122 T1257 oascc.ConnectionManager.waitForConnected Waiting for client to connect to ZooKeeper
[junit4:junit4]   2> 123 T1265 oaz.ClientCnxn$SendThread.logStartConnect Opening socket connection to server localhost/127.0.0.1:36585. Will not attempt to authenticate using SASL (access denied (javax.security.auth.AuthPermission getLoginConfiguration))
[junit4:junit4]   2> 123 T1265 oaz.ClientCnxn$SendThread.primeConnection Socket connection established to localhost/127.0.0.1:36585, initiating session
[junit4:junit4]   2> 123 T1259 oazs.NIOServerCnxnFactory.run Accepted socket connection from /140.211.11.196:36587
[junit4:junit4]   2> 123 T1259 oazs.ZooKeeperServer.processConnectRequest Client attempting to establish new session at /140.211.11.196:36587
[junit4:junit4]   2> 124 T1261 oazs.ZooKeeperServer.finishSessionInit Established session 0x13c3b8ad1450001 with negotiated timeout 10000 for client /140.211.11.196:36587
[junit4:junit4]   2> 124 T1265 oaz.ClientCnxn$SendThread.onConnected Session establishment complete on server localhost/127.0.0.1:36585, sessionid = 0x13c3b8ad1450001, negotiated timeout = 10000
[junit4:junit4]   2> 125 T1266 oascc.ConnectionManager.process Watcher org.apache.solr.common.cloud.ConnectionManager@5c1f7fd0 name:ZooKeeperConnection Watcher:127.0.0.1:36585/solr got event WatchedEvent state:SyncConnected type:None path:null path:null type:None
[junit4:junit4]   2> 125 T1257 oascc.ConnectionManager.waitForConnected Client is connected to ZooKeeper
[junit4:junit4]   2> 125 T1257 oascc.SolrZkClient.makePath makePath: /collections/collection1
[junit4:junit4]   2> 128 T1257 oascc.SolrZkClient.makePath makePath: /collections/collection1/shards
[junit4:junit4]   2> 136 T1257 oascc.SolrZkClient.makePath makePath: /collections/control_collection
[junit4:junit4]   2> 138 T1257 oascc.SolrZkClient.makePath makePath: /collections/control_collection/shards
[junit4:junit4]   2> 141 T1257 oasc.AbstractZkTestCase.putConfig put /usr/home/hudson/hudson-slave/workspace/Lucene-Solr-Tests-4.x-Java6/solr/build/solr-core/test-files/solr/collection1/conf/solrconfig.xml to /configs/conf1/solrconfig.xml
[junit4:junit4]   2> 142 T1257 oascc.SolrZkClient.makePath makePath: /configs/conf1/solrconfig.xml
[junit4:junit4]   2> 157 T1257 oasc.AbstractZkTestCase.putConfig put /usr/home/hudson/hudson-slave/workspace/Lucene-Solr-Tests-4.x-Java6/solr/build/solr-core/test-files/solr/collection1/conf/schema.xml to /configs/conf1/schema.xml
[junit4:junit4]   2> 158 T1257 oascc.SolrZkClient.makePath makePath: /configs/conf1/schema.xml
[junit4:junit4]   2> 261 T1257 oasc.AbstractZkTestCase.putConfig put /usr/home/hudson/hudson-slave/workspace/Lucene-Solr-Tests-4.x-Java6/solr/build/solr-core/test-files/solr/collection1/conf/stopwords.txt to /configs/conf1/stopwords.txt
[junit4:junit4]   2> 262 T1257 oascc.SolrZkClient.makePath makePath: /configs/conf1/stopwords.txt
[junit4:junit4]   2> 264 T1257 oasc.AbstractZkTestCase.putConfig put /usr/home/hudson/hudson-slave/workspace/Lucene-Solr-Tests-4.x-Java6/solr/build/solr-core/test-files/solr/collection1/conf/protwords.txt to /configs/conf1/protwords.txt
[junit4:junit4]   2> 265 T1257 oascc.SolrZkClient.makePath makePath: /configs/conf1/protwords.txt
[junit4:junit4]   2> 296 T1257 oasc.AbstractZkTestCase.putConfig put /usr/home/hudson/hudson-slave/workspace/Lucene-Solr-Tests-4.x-Java6/solr/build/solr-core/test-files/solr/collection1/conf/currency.xml to /configs/conf1/currency.xml
[junit4:junit4]   2> 297 T1257 oascc.SolrZkClient.makePath makePath: /configs/conf1/currency.xml
[junit4:junit4]   2> 300 T1257 oasc.AbstractZkTestCase.putConfig put /usr/home/hudson/hudson-slave/workspace/Lucene-Solr-Tests-4.x-Java6/solr/build/solr-core/test-files/solr/collection1/conf/open-exchange-rates.json to /configs/conf1/open-exchange-rates.json
[junit4:junit4]   2> 301 T1257 oascc.SolrZkClient.makePath makePath: /configs/conf1/open-exchange-rates.json
[junit4:junit4]   2> 311 T1257 oasc.AbstractZkTestCase.putConfig put /usr/home/hudson/hudson-slave/workspace/Lucene-Solr-Tests-4.x-Java6/solr/build/solr-core/test-files/solr/collection1/conf/mapping-ISOLatin1Accent.txt to /configs/conf1/mapping-ISOLatin1Accent.txt
[junit4:junit4]   2> 312 T1257 oascc.SolrZkClient.makePath makePath: /configs/conf1/mapping-ISOLatin1Accent.txt
[junit4:junit4]   2> 315 T1257 oasc.AbstractZkTestCase.putConfig put /usr/home/hudson/hudson-slave/workspace/Lucene-Solr-Tests-4.x-Java6/solr/build/solr-core/test-files/solr/collection1/conf/old_synonyms.txt to /configs/conf1/old_synonyms.txt
[junit4:junit4]   2> 315 T1257 oascc.SolrZkClient.makePath makePath: /configs/conf1/old_synonyms.txt
[junit4:junit4]   2> 318 T1257 oasc.AbstractZkTestCase.putConfig put /usr/home/hudson/hudson-slave/workspace/Lucene-Solr-Tests-4.x-Java6/solr/build/solr-core/test-files/solr/collection1/conf/synonyms.txt to /configs/conf1/synonyms.txt
[junit4:junit4]   2> 318 T1257 oascc.SolrZkClient.makePath makePath: /configs/conf1/synonyms.txt
[junit4:junit4]   2> 326 T1262 oazs.PrepRequestProcessor.pRequest2Txn Processed session termination for sessionid: 0x13c3b8ad1450001
[junit4:junit4]   2> 327 T1266 oaz.ClientCnxn$EventThread.run EventThread shut down
[junit4:junit4]   2> 327 T1259 oazs.NIOServerCnxn.closeSock Closed socket connection for client /140.211.11.196:36587 which had sessionid 0x13c3b8ad1450001
[junit4:junit4]   2> 327 T1257 oaz.ZooKeeper.close Session: 0x13c3b8ad1450001 closed
[junit4:junit4]   2> 465 T1257 oejs.Server.doStart jetty-8.1.8.v20121106
[junit4:junit4]   2> 468 T1257 oejs.AbstractConnector.doStart Started SocketConnector@127.0.0.1:36590
[junit4:junit4]   2> 468 T1257 oass.SolrDispatchFilter.init SolrDispatchFilter.init()
[junit4:junit4]   2> 469 T1257 oasc.SolrResourceLoader.locateSolrHome JNDI not configured for solr (NoInitialContextEx)
[junit4:junit4]   2> 469 T1257 oasc.SolrResourceLoader.locateSolrHome using system property solr.solr.home: /usr/home/hudson/hudson-slave/workspace/Lucene-Solr-Tests-4.x-Java6/solr/build/solr-core/test/J1/./org.apache.solr.cloud.SyncSliceTest-controljetty-1358208619139
[junit4:junit4]   2> 469 T1257 oasc.CoreContainer$Initializer.initialize looking for solr.xml: /usr/home/hudson/hudson-slave/workspace/Lucene-Solr-Tests-4.x-Java6/solr/build/solr-core/test/J1/./org.apache.solr.cloud.SyncSliceTest-controljetty-1358208619139/solr.xml
[junit4:junit4]   2> 470 T1257 oasc.CoreContainer.<init> New CoreContainer 1748656601
[junit4:junit4]   2> 470 T1257 oasc.CoreContainer.load Loading CoreContainer using Solr Home: '/usr/home/hudson/hudson-slave/workspace/Lucene-Solr-Tests-4.x-Java6/solr/build/solr-core/test/J1/./org.apache.solr.cloud.SyncSliceTest-controljetty-1358208619139/'
[junit4:junit4]   2> 470 T1257 oasc.SolrResourceLoader.<init> new SolrResourceLoader for directory: '/usr/home/hudson/hudson-slave/workspace/Lucene-Solr-Tests-4.x-Java6/solr/build/solr-core/test/J1/./org.apache.solr.cloud.SyncSliceTest-controljetty-1358208619139/'
[junit4:junit4]   2> 504 T1257 oashc.HttpShardHandlerFactory.getParameter Setting socketTimeout to: 60000
[junit4:junit4]   2> 504 T1257 oashc.HttpShardHandlerFactory.getParameter Setting urlScheme to: http://
[junit4:junit4]   2> 505 T1257 oashc.HttpShardHandlerFactory.getParameter Setting connTimeout to: 15000
[junit4:junit4]   2> 505 T1257 oashc.HttpShardHandlerFactory.getParameter Setting maxConnectionsPerHost to: 20
[junit4:junit4]   2> 506 T1257 oashc.HttpShardHandlerFactory.getParameter Setting corePoolSize to: 0
[junit4:junit4]   2> 506 T1257 oashc.HttpShardHandlerFactory.getParameter Setting maximumPoolSize to: 2147483647
[junit4:junit4]   2> 507 T1257 oashc.HttpShardHandlerFactory.getParameter Setting maxThreadIdleTime to: 5
[junit4:junit4]   2> 507 T1257 oashc.HttpShardHandlerFactory.getParameter Setting sizeOfQueue to: -1
[junit4:junit4]   2> 508 T1257 oashc.HttpShardHandlerFactory.getParameter Setting fairnessPolicy to: false
[junit4:junit4]   2> 508 T1257 oascsi.HttpClientUtil.createClient Creating new http client, config:maxConnectionsPerHost=20&maxConnections=10000&socketTimeout=60000&connTimeout=15000&retry=false
[junit4:junit4]   2> 531 T1257 oasc.CoreContainer.load Registering Log Listener
[junit4:junit4]   2> 548 T1257 oasc.CoreContainer.initZooKeeper Zookeeper client=127.0.0.1:36585/solr
[junit4:junit4]   2> 549 T1257 oasc.ZkController.checkChrootPath zkHost includes chroot
[junit4:junit4]   2> 549 T1257 oaz.ZooKeeper.<init> Initiating client connection, connectString=127.0.0.1:36585 sessionTimeout=60000 watcher=org.apache.solr.common.cloud.ConnectionManager@423d051e
[junit4:junit4]   2> 550 T1257 oascc.ConnectionManager.waitForConnected Waiting for client to connect to ZooKeeper
[junit4:junit4]   2> 550 T1276 oaz.ClientCnxn$SendThread.logStartConnect Opening socket connection to server localhost/127.0.0.1:36585. Will not attempt to authenticate using SASL (access denied (javax.security.auth.AuthPermission getLoginConfiguration))
[junit4:junit4]   2> 551 T1276 oaz.ClientCnxn$SendThread.primeConnection Socket connection established to localhost/127.0.0.1:36585, initiating session
[junit4:junit4]   2> 551 T1259 oazs.NIOServerCnxnFactory.run Accepted socket connection from /140.211.11.196:36591
[junit4:junit4]   2> 551 T1259 oazs.ZooKeeperServer.processConnectRequest Client attempting to establish new session at /140.211.11.196:36591
[junit4:junit4]   2> 553 T1261 oazs.ZooKeeperServer.finishSessionInit Established session 0x13c3b8ad1450002 with negotiated timeout 20000 for client /140.211.11.196:36591
[junit4:junit4]   2> 553 T1276 oaz.ClientCnxn$SendThread.onConnected Session establishment complete on server localhost/127.0.0.1:36585, sessionid = 0x13c3b8ad1450002, negotiated timeout = 20000
[junit4:junit4]   2> 553 T1277 oascc.ConnectionManager.process Watcher org.apache.solr.common.cloud.ConnectionManager@423d051e name:ZooKeeperConnection Watcher:127.0.0.1:36585 got event WatchedEvent state:SyncConnected type:None path:null path:null type:None
[junit4:junit4]   2> 553 T1257 oascc.ConnectionManager.waitForConnected Client is connected to ZooKeeper
[junit4:junit4]   2> 554 T1262 oazs.PrepRequestProcessor.pRequest2Txn Processed session termination for sessionid: 0x13c3b8ad1450002
[junit4:junit4]   2> 555 T1277 oaz.ClientCnxn$EventThread.run EventThread shut down
[junit4:junit4]   2> 555 T1259 oazs.NIOServerCnxn.closeSock Closed socket connection for client /140.211.11.196:36591 which had sessionid 0x13c3b8ad1450002
[junit4:junit4]   2> 555 T1257 oaz.ZooKeeper.close Session: 0x13c3b8ad1450002 closed
[junit4:junit4]   2> 556 T1257 oascsi.HttpClientUtil.createClient Creating new http client, config:maxConnections=500&maxConnectionsPerHost=16&socketTimeout=60000&connTimeout=15000
[junit4:junit4]   2> 564 T1257 oaz.ZooKeeper.<init> Initiating client connection, connectString=127.0.0.1:36585/solr sessionTimeout=30000 watcher=org.apache.solr.common.cloud.ConnectionManager@3286a78b
[junit4:junit4]   2> 565 T1257 oascc.ConnectionManager.waitForConnected Waiting for client to connect to ZooKeeper
[junit4:junit4]   2> 565 T1278 oaz.ClientCnxn$SendThread.logStartConnect Opening socket connection to server localhost/127.0.0.1:36585. Will not attempt to authenticate using SASL (access denied (javax.security.auth.AuthPermission getLoginConfiguration))
[junit4:junit4]   2> 566 T1278 oaz.ClientCnxn$SendThread.primeConnection Socket connection established to localhost/127.0.0.1:36585, initiating session
[junit4:junit4]   2> 566 T1259 oazs.NIOServerCnxnFactory.run Accepted socket connection from /140.211.11.196:36592
[junit4:junit4]   2> 566 T1259 oazs.ZooKeeperServer.processConnectRequest Client attempting to establish new session at /140.211.11.196:36592
[junit4:junit4]   2> 567 T1261 oazs.ZooKeeperServer.finishSessionInit Established session 0x13c3b8ad1450003 with negotiated timeout 20000 for client /140.211.11.196:36592
[junit4:junit4]   2> 567 T1278 oaz.ClientCnxn$SendThread.onConnected Session establishment complete on server localhost/127.0.0.1:36585, sessionid = 0x13c3b8ad1450003, negotiated timeout = 20000
[junit4:junit4]   2> 568 T1279 oascc.ConnectionManager.process Watcher org.apache.solr.common.cloud.ConnectionManager@3286a78b name:ZooKeeperConnection Watcher:127.0.0.1:36585/solr got event WatchedEvent state:SyncConnected type:None path:null path:null type:None
[junit4:junit4]   2> 568 T1257 oascc.ConnectionManager.waitForConnected Client is connected to ZooKeeper
[junit4:junit4]   2> 570 T1262 oazs.PrepRequestProcessor.pRequest Got user-level KeeperException when processing sessionid:0x13c3b8ad1450003 type:create cxid:0x2 zxid:0x1a txntype:-1 reqpath:n/a Error Path:/solr/overseer Error:KeeperErrorCode = NodeExists for /solr/overseer
[junit4:junit4]   2> 579 T1257 oascc.SolrZkClient.makePath makePath: /live_nodes
[junit4:junit4]   2> 581 T1257 oasc.ZkController.createEphemeralLiveNode Register node as live in ZooKeeper:/live_nodes/127.0.0.1:36590_
[junit4:junit4]   2> 582 T1262 oazs.PrepRequestProcessor.pRequest Got user-level KeeperException when processing sessionid:0x13c3b8ad1450003 type:delete cxid:0x7 zxid:0x1c txntype:-1 reqpath:n/a Error Path:/solr/live_nodes/127.0.0.1:36590_ Error:KeeperErrorCode = NoNode for /solr/live_nodes/127.0.0.1:36590_
[junit4:junit4]   2> 583 T1257 oascc.SolrZkClient.makePath makePath: /live_nodes/127.0.0.1:36590_
[junit4:junit4]   2> 593 T1257 oascc.SolrZkClient.makePath makePath: /overseer_elect/election
[junit4:junit4]   2> 604 T1262 oazs.PrepRequestProcessor.pRequest Got user-level KeeperException when processing sessionid:0x13c3b8ad1450003 type:delete cxid:0x15 zxid:0x21 txntype:-1 reqpath:n/a Error Path:/solr/overseer_elect/leader Error:KeeperErrorCode = NoNode for /solr/overseer_elect/leader
[junit4:junit4]   2> 606 T1257 oascc.SolrZkClient.makePath makePath: /overseer_elect/leader
[junit4:junit4]   2> 609 T1257 oasc.Overseer.start Overseer (id=89011560043053059-127.0.0.1:36590_-n_0000000000) starting
[junit4:junit4]   2> 610 T1262 oazs.PrepRequestProcessor.pRequest Got user-level KeeperException when processing sessionid:0x13c3b8ad1450003 type:create cxid:0x1a zxid:0x23 txntype:-1 reqpath:n/a Error Path:/solr/overseer Error:KeeperErrorCode = NodeExists for /solr/overseer
[junit4:junit4]   2> 619 T1262 oazs.PrepRequestProcessor.pRequest Got user-level KeeperException when processing sessionid:0x13c3b8ad1450003 type:create cxid:0x1b zxid:0x24 txntype:-1 reqpath:n/a Error Path:/solr/overseer Error:KeeperErrorCode = NodeExists for /solr/overseer
[junit4:junit4]   2> 620 T1262 oazs.PrepRequestProcessor.pRequest Got user-level KeeperException when processing sessionid:0x13c3b8ad1450003 type:create cxid:0x1c zxid:0x25 txntype:-1 reqpath:n/a Error Path:/solr/overseer Error:KeeperErrorCode = NodeExists for /solr/overseer
[junit4:junit4]   2> 627 T1262 oazs.PrepRequestProcessor.pRequest Got user-level KeeperException when processing sessionid:0x13c3b8ad1450003 type:create cxid:0x1d zxid:0x26 txntype:-1 reqpath:n/a Error Path:/solr/overseer Error:KeeperErrorCode = NodeExists for /solr/overseer
[junit4:junit4]   2> 628 T1281 oasc.OverseerCollectionProcessor.run Process current queue of collection messages
[junit4:junit4]   2> 629 T1257 oascc.SolrZkClient.makePath makePath: /clusterstate.json
[junit4:junit4]   2> 640 T1257 oascc.ZkStateReader.createClusterStateWatchersAndUpdate Updating cluster state from ZooKeeper... 
[junit4:junit4]   2> 642 T1280 oasc.Overseer$ClusterStateUpdater.run Starting to work on the main queue
[junit4:junit4]   2> 646 T1282 oasc.CoreContainer.create Creating SolrCore 'collection1' using instanceDir: /usr/home/hudson/hudson-slave/workspace/Lucene-Solr-Tests-4.x-Java6/solr/build/solr-core/test/J1/./org.apache.solr.cloud.SyncSliceTest-controljetty-1358208619139/collection1
[junit4:junit4]   2> 646 T1282 oasc.ZkController.createCollectionZkNode Check for collection zkNode:control_collection
[junit4:junit4]   2> 646 T1282 oasc.ZkController.createCollectionZkNode Collection zkNode exists
[junit4:junit4]   2> 647 T1282 oasc.ZkController.readConfigName Load collection config from:/collections/control_collection
[junit4:junit4]   2> 648 T1282 oasc.SolrResourceLoader.<init> new SolrResourceLoader for directory: '/usr/home/hudson/hudson-slave/workspace/Lucene-Solr-Tests-4.x-Java6/solr/build/solr-core/test/J1/./org.apache.solr.cloud.SyncSliceTest-controljetty-1358208619139/collection1/'
[junit4:junit4]   2> 649 T1282 oasc.SolrResourceLoader.replaceClassLoader Adding 'file:/usr/home/hudson/hudson-slave/workspace/Lucene-Solr-Tests-4.x-Java6/solr/build/solr-core/test/J1/org.apache.solr.cloud.SyncSliceTest-controljetty-1358208619139/collection1/lib/classes/' to classloader
[junit4:junit4]   2> 650 T1282 oasc.SolrResourceLoader.replaceClassLoader Adding 'file:/usr/home/hudson/hudson-slave/workspace/Lucene-Solr-Tests-4.x-Java6/solr/build/solr-core/test/J1/org.apache.solr.cloud.SyncSliceTest-controljetty-1358208619139/collection1/lib/README' to classloader
[junit4:junit4]   2> 700 T1282 oasc.SolrConfig.<init> Using Lucene MatchVersion: LUCENE_42
[junit4:junit4]   2> 768 T1282 oasc.SolrConfig.<init> Loaded SolrConfig: solrconfig.xml
[junit4:junit4]   2> 869 T1282 oass.IndexSchema.readSchema Reading Solr Schema
[junit4:junit4]   2> 875 T1282 oass.IndexSchema.readSchema Schema name=test
[junit4:junit4]   2> 1454 T1282 oass.OpenExchangeRatesOrgProvider.init Initialized with rates=open-exchange-rates.json, refreshInterval=1440.
[junit4:junit4]   2> 1465 T1282 oass.IndexSchema.readSchema default search field in schema is text
[junit4:junit4]   2> 1471 T1282 oass.IndexSchema.readSchema unique key field: id
[junit4:junit4]   2> 1485 T1282 oass.FileExchangeRateProvider.reload Reloading exchange rates from file currency.xml
[junit4:junit4]   2> 1490 T1282 oass.FileExchangeRateProvider.reload Reloading exchange rates from file currency.xml
[junit4:junit4]   2> 1494 T1282 oass.OpenExchangeRatesOrgProvider.reload Reloading exchange rates from open-exchange-rates.json
[junit4:junit4]   2> 1496 T1282 oass.OpenExchangeRatesOrgProvider.reload Reloading exchange rates from open-exchange-rates.json
[junit4:junit4]   2> 1497 T1282 oasc.SolrCore.<init> [collection1] Opening new SolrCore at /usr/home/hudson/hudson-slave/workspace/Lucene-Solr-Tests-4.x-Java6/solr/build/solr-core/test/J1/./org.apache.solr.cloud.SyncSliceTest-controljetty-1358208619139/collection1/, dataDir=./org.apache.solr.cloud.SyncSliceTest-1358208618814/control/data/
[junit4:junit4]   2> 1497 T1282 oasc.JmxMonitoredMap.<init> JMX monitoring is enabled. Adding Solr mbeans to JMX Server: com.sun.jmx.mbeanserver.JmxMBeanServer@2bd9e282
[junit4:junit4]   2> 1498 T1282 oasc.SolrCore.initDirectoryFactory solr.StandardDirectoryFactory
[junit4:junit4]   2> 1532 T1282 oasc.CachingDirectoryFactory.get return new directory for /usr/home/hudson/hudson-slave/workspace/Lucene-Solr-Tests-4.x-Java6/solr/build/solr-core/test/J1/./org.apache.solr.cloud.SyncSliceTest-1358208618814/control/data forceNew:false
[junit4:junit4]   2> 1533 T1282 oasc.CachingDirectoryFactory.close Releasing directory:/usr/home/hudson/hudson-slave/workspace/Lucene-Solr-Tests-4.x-Java6/solr/build/solr-core/test/J1/./org.apache.solr.cloud.SyncSliceTest-1358208618814/control/data
[junit4:junit4]   2> 1533 T1282 oasc.SolrCore.getNewIndexDir New index directory detected: old=null new=./org.apache.solr.cloud.SyncSliceTest-1358208618814/control/data/index/
[junit4:junit4]   2> 1534 T1282 oasc.SolrCore.initIndex WARNING [collection1] Solr index directory './org.apache.solr.cloud.SyncSliceTest-1358208618814/control/data/index' doesn't exist. Creating new index...
[junit4:junit4]   2> 1534 T1282 oasc.CachingDirectoryFactory.get return new directory for /usr/home/hudson/hudson-slave/workspace/Lucene-Solr-Tests-4.x-Java6/solr/build/solr-core/test/J1/./org.apache.solr.cloud.SyncSliceTest-1358208618814/control/data/index forceNew:false
[junit4:junit4]   2> 1581 T1282 oasc.SolrDeletionPolicy.onCommit SolrDeletionPolicy.onCommit: commits:num=1
[junit4:junit4]   2> 		commit{dir=RateLimitedDirectoryWrapper(org.apache.lucene.store.NIOFSDirectory@/usr/home/hudson/hudson-slave/workspace/Lucene-Solr-Tests-4.x-Java6/solr/build/solr-core/test/J1/org.apache.solr.cloud.SyncSliceTest-1358208618814/control/data/index lockFactory=org.apache.lucene.store.NativeFSLockFactory@7b8c3169),segFN=segments_1,generation=1,filenames=[segments_1]
[junit4:junit4]   2> 1582 T1282 oasc.SolrDeletionPolicy.updateCommits newest commit = 1[segments_1]
[junit4:junit4]   2> 1583 T1282 oasc.CachingDirectoryFactory.close Releasing directory:/usr/home/hudson/hudson-slave/workspace/Lucene-Solr-Tests-4.x-Java6/solr/build/solr-core/test/J1/./org.apache.solr.cloud.SyncSliceTest-1358208618814/control/data/index
[junit4:junit4]   2> 1583 T1282 oasc.SolrCore.initWriters created xml: solr.XMLResponseWriter
[junit4:junit4]   2> 1585 T1282 oasup.UpdateRequestProcessorChain.init inserting DistributedUpdateProcessorFactory into updateRequestProcessorChain "dedupe"
[junit4:junit4]   2> 1586 T1282 oasup.UpdateRequestProcessorChain.init inserting DistributedUpdateProcessorFactory into updateRequestProcessorChain "dedupe-allfields"
[junit4:junit4]   2> 1586 T1282 oasup.UpdateRequestProcessorChain.init inserting DistributedUpdateProcessorFactory into updateRequestProcessorChain "stored_sig"
[junit4:junit4]   2> 1586 T1282 oasup.UpdateRequestProcessorChain.init inserting DistributedUpdateProcessorFactory into updateRequestProcessorChain "uniq-fields"
[junit4:junit4]   2> 1587 T1282 oasup.UpdateRequestProcessorChain.init inserting DistributedUpdateProcessorFactory into updateRequestProcessorChain "distrib-dup-test-chain-implicit"
[junit4:junit4]   2> 1587 T1282 oasc.RequestHandlers.initHandlersFromConfig adding lazy requestHandler: solr.ReplicationHandler
[junit4:junit4]   2> 1588 T1282 oasc.RequestHandlers.initHandlersFromConfig created /replication: solr.ReplicationHandler
[junit4:junit4]   2> 1588 T1282 oasc.RequestHandlers.initHandlersFromConfig created standard: solr.StandardRequestHandler
[junit4:junit4]   2> 1588 T1282 oasc.RequestHandlers.initHandlersFromConfig created /get: solr.RealTimeGetHandler
[junit4:junit4]   2> 1589 T1282 oasc.RequestHandlers.initHandlersFromConfig created dismax: solr.SearchHandler
[junit4:junit4]   2> 1589 T1282 oasc.RequestHandlers.initHandlersFromConfig created mock: org.apache.solr.core.MockQuerySenderListenerReqHandler
[junit4:junit4]   2> 1590 T1282 oasc.RequestHandlers.initHandlersFromConfig created /admin/: org.apache.solr.handler.admin.AdminHandlers
[junit4:junit4]   2> 1590 T1282 oasc.RequestHandlers.initHandlersFromConfig created defaults: solr.StandardRequestHandler
[junit4:junit4]   2> 1590 T1282 oasc.RequestHandlers.initHandlersFromConfig adding lazy requestHandler: solr.StandardRequestHandler
[junit4:junit4]   2> 1591 T1282 oasc.RequestHandlers.initHandlersFromConfig created lazy: solr.StandardRequestHandler
[junit4:junit4]   2> 1591 T1282 oasc.RequestHandlers.initHandlersFromConfig created /update: solr.UpdateRequestHandler
[junit4:junit4]   2> 1595 T1282 oasc.RequestHandlers.initHandlersFromConfig created /terms: org.apache.solr.handler.component.SearchHandler
[junit4:junit4]   2> 1596 T1282 oasc.RequestHandlers.initHandlersFromConfig created spellCheckCompRH: org.apache.solr.handler.component.SearchHandler
[junit4:junit4]   2> 1596 T1282 oasc.RequestHandlers.initHandlersFromConfig created spellCheckCompRH_Direct: org.apache.solr.handler.component.SearchHandler
[junit4:junit4]   2> 1597 T1282 oasc.RequestHandlers.initHandlersFromConfig created spellCheckWithWordbreak: org.apache.solr.handler.component.SearchHandler
[junit4:junit4]   2> 1597 T1282 oasc.RequestHandlers.initHandlersFromConfig created spellCheckWithWordbreak_Direct: org.apache.solr.handler.component.SearchHandler
[junit4:junit4]   2> 1597 T1282 oasc.RequestHandlers.initHandlersFromConfig created spellCheckCompRH1: org.apache.solr.handler.component.SearchHandler
[junit4:junit4]   2> 1598 T1282 oasc.RequestHandlers.initHandlersFromConfig created mltrh: org.apache.solr.handler.component.SearchHandler
[junit4:junit4]   2> 1598 T1282 oasc.RequestHandlers.initHandlersFromConfig created tvrh: org.apache.solr.handler.component.SearchHandler
[junit4:junit4]   2> 1599 T1282 oasc.RequestHandlers.initHandlersFromConfig created /mlt: solr.MoreLikeThisHandler
[junit4:junit4]   2> 1599 T1282 oasc.RequestHandlers.initHandlersFromConfig created /debug/dump: solr.DumpRequestHandler
[junit4:junit4]   2> 1606 T1282 oashl.XMLLoader.init xsltCacheLifetimeSeconds=60
[junit4:junit4]   2> 1610 T1282 oasc.SolrCore.initDeprecatedSupport WARNING solrconfig.xml uses deprecated <admin/gettableFiles>, Please update your config to use the ShowFileRequestHandler.
[junit4:junit4]   2> 1612 T1282 oasc.SolrCore.initDeprecatedSupport WARNING adding ShowFileRequestHandler with hidden files: [SCHEMA.XML, OLD_SYNONYMS.TXT, STOPWORDS.TXT, PROTWORDS.TXT, OPEN-EXCHANGE-RATES.JSON, SYNONYMS.TXT, CURRENCY.XML, MAPPING-ISOLATIN1ACCENT.TXT]
[junit4:junit4]   2> 1614 T1282 oasc.CachingDirectoryFactory.close Releasing directory:/usr/home/hudson/hudson-slave/workspace/Lucene-Solr-Tests-4.x-Java6/solr/build/solr-core/test/J1/./org.apache.solr.cloud.SyncSliceTest-1358208618814/control/data
[junit4:junit4]   2> 1616 T1282 oass.SolrIndexSearcher.<init> Opening Searcher@4dc938e7 main
[junit4:junit4]   2> 1617 T1282 oasu.CommitTracker.<init> Hard AutoCommit: disabled
[junit4:junit4]   2> 1617 T1282 oasu.CommitTracker.<init> Soft AutoCommit: disabled
[junit4:junit4]   2> 1618 T1282 oashc.SpellCheckComponent.inform Initializing spell checkers
[junit4:junit4]   2> 1635 T1282 oass.DirectSolrSpellChecker.init init: {name=direct,classname=DirectSolrSpellChecker,field=lowerfilt,minQueryLength=3}
[junit4:junit4]   2> 1687 T1283 oasc.SolrCore.registerSearcher [collection1] Registered new searcher Searcher@4dc938e7 main{StandardDirectoryReader(segments_1:1)}
[junit4:junit4]   2> 1691 T1282 oasc.ZkController.publish publishing core=collection1 state=down
[junit4:junit4]   2> 1691 T1282 oasc.ZkController.publish numShards not found on descriptor - reading it from system property
[junit4:junit4]   2> 1692 T1262 oazs.PrepRequestProcessor.pRequest Got user-level KeeperException when processing sessionid:0x13c3b8ad1450003 type:create cxid:0x50 zxid:0x29 txntype:-1 reqpath:n/a Error Path:/solr/overseer/queue Error:KeeperErrorCode = NoNode for /solr/overseer/queue
[junit4:junit4]   2> 2146 T1280 oascc.ZkStateReader.updateClusterState Updating cloud state from ZooKeeper... 
[junit4:junit4]   2> 2147 T1280 oasc.Overseer$ClusterStateUpdater.updateState Update state numShards=1 message={
[junit4:junit4]   2> 	  "operation":"state",
[junit4:junit4]   2> 	  "numShards":"1",
[junit4:junit4]   2> 	  "shard":null,
[junit4:junit4]   2> 	  "roles":null,
[junit4:junit4]   2> 	  "state":"down",
[junit4:junit4]   2> 	  "core":"collection1",
[junit4:junit4]   2> 	  "collection":"control_collection",
[junit4:junit4]   2> 	  "node_name":"127.0.0.1:36590_",
[junit4:junit4]   2> 	  "base_url":"http://127.0.0.1:36590"}
[junit4:junit4]   2> 2147 T1280 oasc.Overseer$ClusterStateUpdater.createCollection Create collection control_collection with numShards 1
[junit4:junit4]   2> 2147 T1280 oasc.Overseer$ClusterStateUpdater.updateState Assigning new node to shard shard=shard1
[junit4:junit4]   2> 2147 T1262 oazs.PrepRequestProcessor.pRequest Got user-level KeeperException when processing sessionid:0x13c3b8ad1450003 type:create cxid:0x58 zxid:0x2c txntype:-1 reqpath:n/a Error Path:/solr/overseer/queue-work Error:KeeperErrorCode = NoNode for /solr/overseer/queue-work
[junit4:junit4]   2> 2165 T1279 oascc.ZkStateReader$2.process A cluster state change: WatchedEvent state:SyncConnected type:NodeDataChanged path:/clusterstate.json, has occurred - updating... (live nodes size: 1)
[junit4:junit4]   2> 2704 T1282 oasc.CoreContainer.registerCore registering core: collection1
[junit4:junit4]   2> 2704 T1282 oasc.ZkController.register Register replica - core:collection1 address:http://127.0.0.1:36590 collection:control_collection shard:shard1
[junit4:junit4]   2> 2705 T1282 oascc.SolrZkClient.makePath makePath: /collections/control_collection/leader_elect/shard1/election
[junit4:junit4]   2> 2726 T1262 oazs.PrepRequestProcessor.pRequest Got user-level KeeperException when processing sessionid:0x13c3b8ad1450003 type:delete cxid:0x72 zxid:0x36 txntype:-1 reqpath:n/a Error Path:/solr/collections/control_collection/leaders Error:KeeperErrorCode = NoNode for /solr/collections/control_collection/leaders
[junit4:junit4]   2> 2726 T1282 oasc.ShardLeaderElectionContext.runLeaderProcess Running the leader process.
[junit4:junit4]   2> 2727 T1262 oazs.PrepRequestProcessor.pRequest Got user-level KeeperException when processing sessionid:0x13c3b8ad1450003 type:create cxid:0x73 zxid:0x37 txntype:-1 reqpath:n/a Error Path:/solr/overseer Error:KeeperErrorCode = NodeExists for /solr/overseer
[junit4:junit4]   2> 2728 T1282 oasc.ShardLeaderElectionContext.waitForReplicasToComeUp Enough replicas found to continue.
[junit4:junit4]   2> 2728 T1282 oasc.ShardLeaderElectionContext.runLeaderProcess I may be the new leader - try and sync
[junit4:junit4]   2> 2729 T1282 oasc.SyncStrategy.sync Sync replicas to http://127.0.0.1:36590/collection1/
[junit4:junit4]   2> 2729 T1282 oasc.SyncStrategy.syncReplicas Sync Success - now sync replicas to me
[junit4:junit4]   2> 2729 T1282 oasc.SyncStrategy.syncToMe http://127.0.0.1:36590/collection1/ has no replicas
[junit4:junit4]   2> 2729 T1282 oasc.ShardLeaderElectionContext.runLeaderProcess I am the new leader: http://127.0.0.1:36590/collection1/
[junit4:junit4]   2> 2729 T1282 oascc.SolrZkClient.makePath makePath: /collections/control_collection/leaders/shard1
[junit4:junit4]   2> 2732 T1262 oazs.PrepRequestProcessor.pRequest Got user-level KeeperException when processing sessionid:0x13c3b8ad1450003 type:create cxid:0x7d zxid:0x3b txntype:-1 reqpath:n/a Error Path:/solr/overseer Error:KeeperErrorCode = NodeExists for /solr/overseer
[junit4:junit4]   2> 3669 T1280 oascc.ZkStateReader.updateClusterState Updating cloud state from ZooKeeper... 
[junit4:junit4]   2> 3710 T1279 oascc.ZkStateReader$2.process A cluster state change: WatchedEvent state:SyncConnected type:NodeDataChanged path:/clusterstate.json, has occurred - updating... (live nodes size: 1)
[junit4:junit4]   2> 3757 T1282 oasc.ZkController.register We are http://127.0.0.1:36590/collection1/ and leader is http://127.0.0.1:36590/collection1/
[junit4:junit4]   2> 3758 T1282 oasc.ZkController.register No LogReplay needed for core=collection1 baseURL=http://127.0.0.1:36590
[junit4:junit4]   2> 3758 T1282 oasc.ZkController.checkRecovery I am the leader, no recovery necessary
[junit4:junit4]   2> 3758 T1282 oasc.ZkController.publish publishing core=collection1 state=active
[junit4:junit4]   2> 3758 T1282 oasc.ZkController.publish numShards not found on descriptor - reading it from system property
[junit4:junit4]   2> 3760 T1282 oascc.ZkStateReader.updateClusterState Updating cloud state from ZooKeeper... 
[junit4:junit4]   2> 3760 T1257 oass.SolrDispatchFilter.init user.dir=/usr/home/hudson/hudson-slave/workspace/Lucene-Solr-Tests-4.x-Java6/solr/build/solr-core/test/J1
[junit4:junit4]   2> 3761 T1257 oass.SolrDispatchFilter.init SolrDispatchFilter.init() done
[junit4:junit4]   2> 3761 T1257 oascsi.HttpClientUtil.createClient Creating new http client, config:maxConnections=128&maxConnectionsPerHost=32&followRedirects=false
[junit4:junit4]   2> 3770 T1257 oascsi.HttpClientUtil.createClient Creating new http client, config:
[junit4:junit4]   2> 3777 T1257 oaz.ZooKeeper.<init> Initiating client connection, connectString=127.0.0.1:36585/solr sessionTimeout=10000 watcher=org.apache.solr.common.cloud.ConnectionManager@48b4721b
[junit4:junit4]   2> 3778 T1257 oascc.ConnectionManager.waitForConnected Waiting for client to connect to ZooKeeper
[junit4:junit4]   2> 3778 T1284 oaz.ClientCnxn$SendThread.logStartConnect Opening socket connection to server localhost/127.0.0.1:36585. Will not attempt to authenticate using SASL (access denied (javax.security.auth.AuthPermission getLoginConfiguration))
[junit4:junit4]   2> 3779 T1284 oaz.ClientCnxn$SendThread.primeConnection Socket connection established to localhost/127.0.0.1:36585, initiating session
[junit4:junit4]   2> 3779 T1259 oazs.NIOServerCnxnFactory.run Accepted socket connection from /140.211.11.196:36601
[junit4:junit4]   2> 3779 T1259 oazs.ZooKeeperServer.processConnectRequest Client attempting to establish new session at /140.211.11.196:36601
[junit4:junit4]   2> 3781 T1261 oazs.ZooKeeperServer.finishSessionInit Established session 0x13c3b8ad1450004 with negotiated timeout 10000 for client /140.211.11.196:36601
[junit4:junit4]   2> 3781 T1284 oaz.ClientCnxn$SendThread.onConnected Session establishment complete on server localhost/127.0.0.1:36585, sessionid = 0x13c3b8ad1450004, negotiated timeout = 10000
[junit4:junit4]   2> 3782 T1285 oascc.ConnectionManager.process Watcher org.apache.solr.common.cloud.ConnectionManager@48b4721b name:ZooKeeperConnection Watcher:127.0.0.1:36585/solr got event WatchedEvent state:SyncConnected type:None path:null path:null type:None
[junit4:junit4]   2> 3782 T1257 oascc.ConnectionManager.waitForConnected Client is connected to ZooKeeper
[junit4:junit4]   2> 3782 T1257 oascc.ZkStateReader.createClusterStateWatchersAndUpdate Updating cluster state from ZooKeeper... 
[junit4:junit4]   2> 3783 T1257 oasc.ChaosMonkey.monkeyLog monkey: init - expire sessions:true cause connection loss:true
[junit4:junit4]   2> 3893 T1257 oejs.Server.doStart jetty-8.1.8.v20121106
[junit4:junit4]   2> 3895 T1257 oejs.AbstractConnector.doStart Started SocketConnector@127.0.0.1:36602
[junit4:junit4]   2> 3896 T1257 oass.SolrDispatchFilter.init SolrDispatchFilter.init()
[junit4:junit4]   2> 3896 T1257 oasc.SolrResourceLoader.locateSolrHome JNDI not configured for solr (NoInitialContextEx)
[junit4:junit4]   2> 3896 T1257 oasc.SolrResourceLoader.locateSolrHome using system property solr.solr.home: /usr/home/hudson/hudson-slave/workspace/Lucene-Solr-Tests-4.x-Java6/solr/build/solr-core/test/J1/./org.apache.solr.cloud.SyncSliceTest-jetty1-1358208622595
[junit4:junit4]   2> 3897 T1257 oasc.CoreContainer$Initializer.initialize looking for solr.xml: /usr/home/hudson/hudson-slave/workspace/Lucene-Solr-Tests-4.x-Java6/solr/build/solr-core/test/J1/./org.apache.solr.cloud.SyncSliceTest-jetty1-1358208622595/solr.xml
[junit4:junit4]   2> 3897 T1257 oasc.CoreContainer.<init> New CoreContainer 1755879016
[junit4:junit4]   2> 3898 T1257 oasc.CoreContainer.load Loading CoreContainer using Solr Home: '/usr/home/hudson/hudson-slave/workspace/Lucene-Solr-Tests-4.x-Java6/solr/build/solr-core/test/J1/./org.apache.solr.cloud.SyncSliceTest-jetty1-1358208622595/'
[junit4:junit4]   2> 3898 T1257 oasc.SolrResourceLoader.<init> new SolrResourceLoader for directory: '/usr/home/hudson/hudson-slave/workspace/Lucene-Solr-Tests-4.x-Java6/solr/build/solr-core/test/J1/./org.apache.solr.cloud.SyncSliceTest-jetty1-1358208622595/'
[junit4:junit4]   2> 3927 T1257 oashc.HttpShardHandlerFactory.getParameter Setting socketTimeout to: 60000
[junit4:junit4]   2> 3927 T1257 oashc.HttpShardHandlerFactory.getParameter Setting urlScheme to: http://
[junit4:junit4]   2> 3928 T1257 oashc.HttpShardHandlerFactory.getParameter Setting connTimeout to: 15000
[junit4:junit4]   2> 3928 T1257 oashc.HttpShardHandlerFactory.getParameter Setting maxConnectionsPerHost to: 20
[junit4:junit4]   2> 3928 T1257 oashc.HttpShardHandlerFactory.getParameter Setting corePoolSize to: 0
[junit4:junit4]   2> 3928 T1257 oashc.HttpShardHandlerFactory.getParameter Setting maximumPoolSize to: 2147483647
[junit4:junit4]   2> 3929 T1257 oashc.HttpShardHandlerFactory.getParameter Setting maxThreadIdleTime to: 5
[junit4:junit4]   2> 3929 T1257 oashc.HttpShardHandlerFactory.getParameter Setting sizeOfQueue to: -1
[junit4:junit4]   2> 3929 T1257 oashc.HttpShardHandlerFactory.getParameter Setting fairnessPolicy to: false
[junit4:junit4]   2> 3930 T1257 oascsi.HttpClientUtil.createClient Creating new http client, config:maxConnectionsPerHost=20&maxConnections=10000&socketTimeout=60000&connTimeout=15000&retry=false
[junit4:junit4]   2> 3943 T1257 oasc.CoreContainer.load Registering Log Listener
[junit4:junit4]   2> 3955 T1257 oasc.CoreContainer.initZooKeeper Zookeeper client=127.0.0.1:36585/solr
[junit4:junit4]   2> 3956 T1257 oasc.ZkController.checkChrootPath zkHost includes chroot
[junit4:junit4]   2> 3956 T1257 oaz.ZooKeeper.<init> Initiating client connection, connectString=127.0.0.1:36585 sessionTimeout=60000 watcher=org.apache.solr.common.cloud.ConnectionManager@17d64c2
[junit4:junit4]   2> 3957 T1257 oascc.ConnectionManager.waitForConnected Waiting for client to connect to ZooKeeper
[junit4:junit4]   2> 3957 T1295 oaz.ClientCnxn$SendThread.logStartConnect Opening socket connection to server localhost/127.0.0.1:36585. Will not attempt to authenticate using SASL (access denied (javax.security.auth.AuthPermission getLoginConfiguration))
[junit4:junit4]   2> 3958 T1295 oaz.ClientCnxn$SendThread.primeConnection Socket connection established to localhost/127.0.0.1:36585, initiating session
[junit4:junit4]   2> 3958 T1259 oazs.NIOServerCnxnFactory.run Accepted socket connection from /140.211.11.196:36603
[junit4:junit4]   2> 3958 T1259 oazs.ZooKeeperServer.processConnectRequest Client attempting to establish new session at /140.211.11.196:36603
[junit4:junit4]   2> 3960 T1261 oazs.ZooKeeperServer.finishSessionInit Established session 0x13c3b8ad1450005 with negotiated timeout 20000 for client /140.211.11.196:36603
[junit4:junit4]   2> 3960 T1295 oaz.ClientCnxn$SendThread.onConnected Session establishment complete on server localhost/127.0.0.1:36585, sessionid = 0x13c3b8ad1450005, negotiated timeout = 20000
[junit4:junit4]   2> 3960 T1296 oascc.ConnectionManager.process Watcher org.apache.solr.common.cloud.ConnectionManager@17d64c2 name:ZooKeeperConnection Watcher:127.0.0.1:36585 got event WatchedEvent state:SyncConnected type:None path:null path:null type:None
[junit4:junit4]   2> 3960 T1257 oascc.ConnectionManager.waitForConnected Client is connected to ZooKeeper
[junit4:junit4]   2> 3961 T1262 oazs.PrepRequestProcessor.pRequest2Txn Processed session termination for sessionid: 0x13c3b8ad1450005
[junit4:junit4]   2> 3971 T1296 oaz.ClientCnxn$EventThread.run EventThread shut down
[junit4:junit4]   2> 3972 T1259 oazs.NIOServerCnxn.closeSock Closed socket connection for client /140.211.11.196:36603 which had sessionid 0x13c3b8ad1450005
[junit4:junit4]   2> 3971 T1257 oaz.ZooKeeper.close Session: 0x13c3b8ad1450005 closed
[junit4:junit4]   2> 3972 T1257 oascsi.HttpClientUtil.createClient Creating new http client, config:maxConnections=500&maxConnectionsPerHost=16&socketTimeout=60000&connTimeout=15000
[junit4:junit4]   2> 3979 T1257 oaz.ZooKeeper.<init> Initiating client connection, connectString=127.0.0.1:36585/solr sessionTimeout=30000 watcher=org.apache.solr.common.cloud.ConnectionManager@3181b4a2
[junit4:junit4]   2> 3980 T1257 oascc.ConnectionManager.waitForConnected Waiting for client to connect to ZooKeeper
[junit4:junit4]   2> 3980 T1297 oaz.ClientCnxn$SendThread.logStartConnect Opening socket connection to server localhost/127.0.0.1:36585. Will not attempt to authenticate using SASL (access denied (javax.security.auth.AuthPermission getLoginConfiguration))
[junit4:junit4]   2> 3981 T1297 oaz.ClientCnxn$SendThread.primeConnection Socket connection established to localhost/127.0.0.1:36585, initiating session
[junit4:junit4]   2> 3981 T1259 oazs.NIOServerCnxnFactory.run Accepted socket connection from /140.211.11.196:36604
[junit4:junit4]   2> 3981 T1259 oazs.ZooKeeperServer.processConnectRequest Client attempting to establish new session at /140.211.11.196:36604
[junit4:junit4]   2> 3982 T1261 oazs.ZooKeeperServer.finishSessionInit Established session 0x13c3b8ad1450006 with negotiated timeout 20000 for client /140.211.11.196:36604
[junit4:junit4]   2> 3982 T1297 oaz.ClientCnxn$SendThread.onConnected Session establishment complete on server localhost/127.0.0.1:36585, sessionid = 0x13c3b8ad1450006, negotiated timeout = 20000
[junit4:junit4]   2> 3983 T1298 oascc.ConnectionManager.process Watcher org.apache.solr.common.cloud.ConnectionManager@3181b4a2 name:ZooKeeperConnection Watcher:127.0.0.1:36585/solr got event WatchedEvent state:SyncConnected type:None path:null path:null type:None
[junit4:junit4]   2> 3983 T1257 oascc.ConnectionManager.waitForConnected Client is connected to ZooKeeper
[junit4:junit4]   2> 3983 T1262 oazs.PrepRequestProcessor.pRequest Got user-level KeeperException when processing sessionid:0x13c3b8ad1450006 type:create cxid:0x1 zxid:0x49 txntype:-1 reqpath:n/a Error Path:/solr/overseer Error:KeeperErrorCode = NodeExists for /solr/overseer
[junit4:junit4]   2> 3985 T1262 oazs.PrepRequestProcessor.pRequest Got user-level KeeperException when processing sessionid:0x13c3b8ad1450006 type:create cxid:0x2 zxid:0x4a txntype:-1 reqpath:n/a Error Path:/solr/overseer Error:KeeperErrorCode = NodeExists for /solr/overseer
[junit4:junit4]   2> 3994 T1257 oasc.ZkController.createEphemeralLiveNode Register node as live in ZooKeeper:/live_nodes/127.0.0.1:36602_
[junit4:junit4]   2> 3994 T1262 oazs.PrepRequestProcessor.pRequest Got user-level KeeperException when processing sessionid:0x13c3b8ad1450006 type:delete cxid:0x4 zxid:0x4b txntype:-1 reqpath:n/a Error Path:/solr/live_nodes/127.0.0.1:36602_ Error:KeeperErrorCode = NoNode for /solr/live_nodes/127.0.0.1:36602_
[junit4:junit4]   2> 3995 T1257 oascc.SolrZkClient.makePath makePath: /live_nodes/127.0.0.1:36602_
[junit4:junit4]   2> 3999 T1285 oascc.ZkStateReader$3.process Updating live nodes... (2)
[junit4:junit4]   2> 3999 T1279 oascc.ZkStateReader$3.process Updating live nodes... (2)
[junit4:junit4]   2> 3999 T1279 oascc.ZkStateReader$2.process A cluster state change: WatchedEvent state:SyncConnected type:NodeChildrenChanged path:/live_nodes, has occurred - updating... (live nodes size: 2)
[junit4:junit4]   2> 4007 T1257 oascc.ZkStateReader.createClusterStateWatchersAndUpdate Updating cluster state from ZooKeeper... 
[junit4:junit4]   2> 4012 T1299 oasc.CoreContainer.create Creating SolrCore 'collection1' using instanceDir: /usr/home/hudson/hudson-slave/workspace/Lucene-Solr-Tests-4.x-Java6/solr/build/solr-core/test/J1/./org.apache.solr.cloud.SyncSliceTest-jetty1-1358208622595/collection1
[junit4:junit4]   2> 4013 T1299 oasc.ZkController.createCollectionZkNode Check for collection zkNode:collection1
[junit4:junit4]   2> 4013 T1299 oasc.ZkController.createCollectionZkNode Collection zkNode exists
[junit4:junit4]   2> 4013 T1299 oasc.ZkController.readConfigName Load collection config from:/collections/collection1
[junit4:junit4]   2> 4015 T1299 oasc.SolrResourceLoader.<init> new SolrResourceLoader for directory: '/usr/home/hudson/hudson-slave/workspace/Lucene-Solr-Tests-4.x-Java6/solr/build/solr-core/test/J1/./org.apache.solr.cloud.SyncSliceTest-jetty1-1358208622595/collection1/'
[junit4:junit4]   2> 4016 T1299 oasc.SolrResourceLoader.replaceClassLoader Adding 'file:/usr/home/hudson/hudson-slave/workspace/Lucene-Solr-Tests-4.x-Java6/solr/build/solr-core/test/J1/org.apache.solr.cloud.SyncSliceTest-jetty1-1358208622595/collection1/lib/README' to classloader
[junit4:junit4]   2> 4016 T1299 oasc.SolrResourceLoader.replaceClassLoader Adding 'file:/usr/home/hudson/hudson-slave/workspace/Lucene-Solr-Tests-4.x-Java6/solr/build/solr-core/test/J1/org.apache.solr.cloud.SyncSliceTest-jetty1-1358208622595/collection1/lib/classes/' to classloader
[junit4:junit4]   2> 4071 T1299 oasc.SolrConfig.<init> Using Lucene MatchVersion: LUCENE_42
[junit4:junit4]   2> 4137 T1299 oasc.SolrConfig.<init> Loaded SolrConfig: solrconfig.xml
[junit4:junit4]   2> 4238 T1299 oass.IndexSchema.readSchema Reading Solr Schema
[junit4:junit4]   2> 4242 T1299 oass.IndexSchema.readSchema Schema name=test
[junit4:junit4]   2> 4680 T1299 oass.OpenExchangeRatesOrgProvider.init Initialized with rates=open-exchange-rates.json, refreshInterval=1440.
[junit4:junit4]   2> 4687 T1299 oass.IndexSchema.readSchema default search field in schema is text
[junit4:junit4]   2> 4690 T1299 oass.IndexSchema.readSchema unique key field: id
[junit4:junit4]   2> 4701 T1299 oass.FileExchangeRateProvider.reload Reloading exchange rates from file currency.xml
[junit4:junit4]   2> 4704 T1299 oass.FileExchangeRateProvider.reload Reloading exchange rates from file currency.xml
[junit4:junit4]   2> 4708 T1299 oass.OpenExchangeRatesOrgProvider.reload Reloading exchange rates from open-exchange-rates.json
[junit4:junit4]   2> 4709 T1299 oass.OpenExchangeRatesOrgProvider.reload Reloading exchange rates from open-exchange-rates.json
[junit4:junit4]   2> 4710 T1299 oasc.SolrCore.<init> [collection1] Opening new SolrCore at /usr/home/hudson/hudson-slave/workspace/Lucene-Solr-Tests-4.x-Java6/solr/build/solr-core/test/J1/./org.apache.solr.cloud.SyncSliceTest-jetty1-1358208622595/collection1/, dataDir=./org.apache.solr.cloud.SyncSliceTest-1358208618814/jetty1/
[junit4:junit4]   2> 4710 T1299 oasc.JmxMonitoredMap.<init> JMX monitoring is enabled. Adding Solr mbeans to JMX Server: com.sun.jmx.mbeanserver.JmxMBeanServer@2bd9e282
[junit4:junit4]   2> 4710 T1299 oasc.SolrCore.initDirectoryFactory solr.StandardDirectoryFactory
[junit4:junit4]   2> 4711 T1299 oasc.CachingDirectoryFactory.get return new directory for /usr/home/hudson/hudson-slave/workspace/Lucene-Solr-Tests-4.x-Java6/solr/build/solr-core/test/J1/./org.apache.solr.cloud.SyncSliceTest-1358208618814/jetty1 forceNew:false
[junit4:junit4]   2> 4711 T1299 oasc.CachingDirectoryFactory.close Releasing directory:/usr/home/hudson/hudson-slave/workspace/Lucene-Solr-Tests-4.x-Java6/solr/build/solr-core/test/J1/./org.apache.solr.cloud.SyncSliceTest-1358208618814/jetty1
[junit4:junit4]   2> 4711 T1299 oasc.SolrCore.getNewIndexDir New index directory detected: old=null new=./org.apache.solr.cloud.SyncSliceTest-1358208618814/jetty1/index/
[junit4:junit4]   2> 4712 T1299 oasc.SolrCore.initIndex WARNING [collection1] Solr index directory './org.apache.solr.cloud.SyncSliceTest-1358208618814/jetty1/index' doesn't exist. Creating new index...
[junit4:junit4]   2> 4712 T1299 oasc.CachingDirectoryFactory.get return new directory for /usr/home/hudson/hudson-slave/workspace/Lucene-Solr-Tests-4.x-Java6/solr/build/solr-core/test/J1/./org.apache.solr.cloud.SyncSliceTest-1358208618814/jetty1/index forceNew:false
[junit4:junit4]   2> 4716 T1299 oasc.SolrDeletionPolicy.onCommit SolrDeletionPolicy.onCommit: commits:num=1
[junit4:junit4]   2> 		commit{dir=RateLimitedDirectoryWrapper(org.apache.lucene.store.NIOFSDirectory@/usr/home/hudson/hudson-slave/workspace/Lucene-Solr-Tests-4.x-Java6/solr/build/solr-core/test/J1/org.apache.solr.cloud.SyncSliceTest-1358208618814/jetty1/index lockFactory=org.apache.lucene.store.NativeFSLockFactory@5489f951),segFN=segments_1,generation=1,filenames=[segments_1]
[junit4:junit4]   2> 4716 T1299 oasc.SolrDeletionPolicy.updateCommits newest commit = 1[segments_1]
[junit4:junit4]   2> 4717 T1299 oasc.CachingDirectoryFactory.close Releasing directory:/usr/home/hudson/hudson-slave/workspace/Lucene-Solr-Tests-4.x-Java6/solr/build/solr-core/test/J1/./org.apache.solr.cloud.SyncSliceTest-1358208618814/jetty1/index
[junit4:junit4]   2> 4717 T1299 oasc.SolrCore.initWriters created xml: solr.XMLResponseWriter
[junit4:junit4]   2> 4719 T1299 oasup.UpdateRequestProcessorChain.init inserting DistributedUpdateProcessorFactory into updateRequestProcessorChain "dedupe"
[junit4:junit4]   2> 4719 T1299 oasup.UpdateRequestProcessorChain.init inserting DistributedUpdateProcessorFactory into updateRequestProcessorChain "dedupe-allfields"
[junit4:junit4]   2> 4719 T1299 oasup.UpdateRequestProcessorChain.init inserting DistributedUpdateProcessorFactory into updateRequestProcessorChain "stored_sig"
[junit4:junit4]   2> 4719 T1299 oasup.UpdateRequestProcessorChain.init inserting DistributedUpdateProcessorFactory into updateRequestProcessorChain "uniq-fields"
[junit4:junit4]   2> 4720 T1299 oasup.UpdateRequestProcessorChain.init inserting DistributedUpdateProcessorFactory into updateRequestProcessorChain "distrib-dup-test-chain-implicit"
[junit4:junit4]   2> 4720 T1299 oasc.RequestHandlers.initHandlersFromConfig adding lazy requestHandler: solr.ReplicationHandler
[junit4:junit4]   2> 4720 T1299 oasc.RequestHandlers.initHandlersFromConfig created /replication: solr.ReplicationHandler
[junit4:junit4]   2> 4720 T1299 oasc.RequestHandlers.initHandlersFromConfig created standard: solr.StandardRequestHandler
[junit4:junit4]   2> 4721 T1299 oasc.RequestHandlers.initHandlersFromConfig created /get: solr.RealTimeGetHandler
[junit4:junit4]   2> 4721 T1299 oasc.RequestHandlers.initHandlersFromConfig created dismax: solr.SearchHandler
[junit4:junit4]   2> 4722 T1299 oasc.RequestHandlers.initHandlersFromConfig created mock: org.apache.solr.core.MockQuerySenderListenerReqHandler
[junit4:junit4]   2> 4722 T1299 oasc.RequestHandlers.initHandlersFromConfig created /admin/: org.apache.solr.handler.admin.AdminHandlers
[junit4:junit4]   2> 4722 T1299 oasc.RequestHandlers.initHandlersFromConfig created defaults: solr.StandardRequestHandler
[junit4:junit4]   2> 4722 T1299 oasc.RequestHandlers.initHandlersFromConfig adding lazy requestHandler: solr.StandardRequestHandler
[junit4:junit4]   2> 4723 T1299 oasc.RequestHandlers.initHandlersFromConfig created lazy: solr.StandardRequestHandler
[junit4:junit4]   2> 4723 T1299 oasc.RequestHandlers.initHandlersFromConfig created /update: solr.UpdateRequestHandler
[junit4:junit4]   2> 4723 T1299 oasc.RequestHandlers.initHandlersFromConfig created /terms: org.apache.solr.handler.component.SearchHandler
[junit4:junit4]   2> 4724 T1299 oasc.RequestHandlers.initHandlersFromConfig created spellCheckCompRH: org.apache.solr.handler.component.SearchHandler
[junit4:junit4]   2> 4724 T1299 oasc.RequestHandlers.initHandlersFromConfig created spellCheckCompRH_Direct: org.apache.solr.handler.component.SearchHandler
[junit4:junit4]   2> 4725 T1299 oasc.RequestHandlers.initHandlersFromConfig created spellCheckWithWordbreak: org.apache.solr.handler.component.SearchHandler
[junit4:junit4]   2> 4725 T1299 oasc.RequestHandlers.initHandlersFromConfig created spellCheckWithWordbreak_Direct: org.apache.solr.handler.component.SearchHandler
[junit4:junit4]   2> 4725 T1299 oasc.RequestHandlers.initHandlersFromConfig created spellCheckCompRH1: org.apache.solr.handler.component.SearchHandler
[junit4:junit4]   2> 4726 T1299 oasc.RequestHandlers.initHandlersFromConfig created mltrh: org.apache.solr.handler.component.SearchHandler
[junit4:junit4]   2> 4726 T1299 oasc.RequestHandlers.initHandlersFromConfig created tvrh: org.apache.solr.handler.component.SearchHandler
[junit4:junit4]   2> 4726 T1299 oasc.RequestHandlers.initHandlersFromConfig created /mlt: solr.MoreLikeThisHandler
[junit4:junit4]   2> 4727 T1299 oasc.RequestHandlers.initHandlersFromConfig created /debug/dump: solr.DumpRequestHandler
[junit4:junit4]   2> 4732 T1299 oashl.XMLLoader.init xsltCacheLifetimeSeconds=60
[junit4:junit4]   2> 4735 T1299 oasc.SolrCore.initDeprecatedSupport WARNING solrconfig.xml uses deprecated <admin/gettableFiles>, Please update your config to use the ShowFileRequestHandler.
[junit4:junit4]   2> 4736 T1299 oasc.SolrCore.initDeprecatedSupport WARNING adding ShowFileRequestHandler with hidden files: [SCHEMA.XML, OLD_SYNONYMS.TXT, STOPWORDS.TXT, PROTWORDS.TXT, OPEN-EXCHANGE-RATES.JSON, SYNONYMS.TXT, CURRENCY.XML, MAPPING-ISOLATIN1ACCENT.TXT]
[junit4:junit4]   2> 4738 T1299 oasc.CachingDirectoryFactory.close Releasing directory:/usr/home/hudson/hudson-slave/workspace/Lucene-Solr-Tests-4.x-Java6/solr/build/solr-core/test/J1/./org.apache.solr.cloud.SyncSliceTest-1358208618814/jetty1
[junit4:junit4]   2> 4739 T1299 oass.SolrIndexSearcher.<init> Opening Searcher@65a73e9c main
[junit4:junit4]   2> 4740 T1299 oasu.CommitTracker.<init> Hard AutoCommit: disabled
[junit4:junit4]   2> 4740 T1299 oasu.CommitTracker.<init> Soft AutoCommit: disabled
[junit4:junit4]   2> 4740 T1299 oashc.SpellCheckComponent.inform Initializing spell checkers
[junit4:junit4]   2> 4749 T1299 oass.DirectSolrSpellChecker.init init: {name=direct,classname=DirectSolrSpellChecker,field=lowerfilt,minQueryLength=3}
[junit4:junit4]   2> 4797 T1300 oasc.SolrCore.registerSearcher [collection1] Registered new searcher Searcher@65a73e9c main{StandardDirectoryReader(segments_1:1)}
[junit4:junit4]   2> 4804 T1299 oasc.ZkController.publish publishing core=collection1 state=down
[junit4:junit4]   2> 4804 T1299 oasc.ZkController.publish numShards not found on descriptor - reading it from system property
[junit4:junit4]   2> 5227 T1280 oascc.ZkStateReader.updateClusterState Updating cloud state from ZooKeeper... 
[junit4:junit4]   2> 5227 T1280 oasc.Overseer$ClusterStateUpdater.updateState Update state numShards=1 message={
[junit4:junit4]   2> 	  "operation":"state",
[junit4:junit4]   2> 	  "numShards":"1",
[junit4:junit4]   2> 	  "shard":"shard1",
[junit4:junit4]   2> 	  "roles":null,
[junit4:junit4]   2> 	  "state":"active",
[junit4:junit4]   2> 	  "core":"collection1",
[junit4:junit4]   2> 	  "collection":"control_collection",
[junit4:junit4]   2> 	  "node_name":"127.0.0.1:36590_",
[junit4:junit4]   2> 	  "base_url":"http://127.0.0.1:36590"}
[junit4:junit4]   2> 5230 T1280 oasc.Overseer$ClusterStateUpdater.updateState Update state numShards=1 message={
[junit4:junit4]   2> 	  "operation":"state",
[junit4:junit4]   2> 	  "numShards":"1",
[junit4:junit4]   2> 	  "shard":null,
[junit4:junit4]   2> 	  "roles":null,
[junit4:junit4]   2> 	  "state":"down",
[junit4:junit4]   2> 	  "core":"collection1",
[junit4:junit4]   2> 	  "collection":"collection1",
[junit4:junit4]   2> 	  "node_name":"127.0.0.1:36602_",
[junit4:junit4]   2> 	  "base_url":"http://127.0.0.1:36602"}
[junit4:junit4]   2> 5230 T1280 oasc.Overseer$ClusterStateUpdater.createCollection Create collection collection1 with numShards 1
[junit4:junit4]   2> 5231 T1280 oasc.Overseer$ClusterStateUpdater.updateState Assigning new node to shard shard=shard1
[junit4:junit4]   2> 5243 T1298 oascc.ZkStateReader$2.process A cluster state change: WatchedEvent state:SyncConnected type:NodeDataChanged path:/clusterstate.json, has occurred - updating... (live nodes size: 2)
[junit4:junit4]   2> 5243 T1285 oascc.ZkStateReader$2.process A cluster state change: WatchedEvent state:SyncConnected type:NodeDataChanged path:/clusterstate.json, has occurred - updating... (live nodes size: 2)
[junit4:junit4]   2> 5243 T1279 oascc.ZkStateReader$2.process A cluster state change: WatchedEvent state:SyncConnected type:NodeDataChanged path:/clusterstate.json, has occurred - updating... (live nodes size: 2)
[junit4:junit4]   2> 5806 T1299 oasc.CoreContainer.registerCore registering core: collection1
[junit4:junit4]   2> 5806 T1299 oasc.ZkController.register Register replica - core:collection1 address:http://127.0.0.1:36602 collection:collection1 shard:shard1
[junit4:junit4]   2> 5807 T1299 oascc.SolrZkClient.makePath makePath: /collections/collection1/leader_elect/shard1/election
[junit4:junit4]   2> 5825 T1262 oazs.PrepRequestProcessor.pRequest Got user-level KeeperException when processing sessionid:0x13c3b8ad1450006 type:delete cxid:0x43 zxid:0x5a txntype:-1 reqpath:n/a Error Path:/solr/collections/collection1/leaders Error:KeeperErrorCode = NoNode for /solr/collections/collection1/leaders
[junit4:junit4]   2> 5826 T1299 oasc.ShardLeaderElectionContext.runLeaderProcess Running the leader process.
[junit4:junit4]   2> 5826 T1262 oazs.PrepRequestProcessor.pRequest Got user-level KeeperException when processing sessionid:0x13c3b8ad1450006 type:create cxid:0x44 zxid:0x5b txntype:-1 reqpath:n/a Error Path:/solr/overseer Error:KeeperErrorCode = NodeExists for /solr/overseer
[junit4:junit4]   2> 5835 T1299 oasc.ShardLeaderElectionContext.waitForReplicasToComeUp Enough replicas found to continue.
[junit4:junit4]   2> 5836 T1299 oasc.ShardLeaderElectionContext.runLeaderProcess I may be the new leader - try and sync
[junit4:junit4]   2> 5836 T1299 oasc.SyncStrategy.sync Sync replicas to http://127.0.0.1:36602/collection1/
[junit4:junit4]   2> 5836 T1299 oasc.SyncStrategy.syncReplicas Sync Success - now sync replicas to me
[junit4:junit4]   2> 5836 T1299 oasc.SyncStrategy.syncToMe http://127.0.0.1:36602/collection1/ has no replicas
[junit4:junit4]   2> 5836 T1299 oasc.ShardLeaderElectionContext.runLeaderProcess I am the new leader: http://127.0.0.1:36602/collection1/
[junit4:junit4]   2> 5836 T1299 oascc.SolrZkClient.makePath makePath: /collections/collection1/leaders/shard1
[junit4:junit4]   2> 5840 T1262 oazs.PrepRequestProcessor.pRequest Got user-level KeeperException when processing sessionid:0x13c3b8ad1450006 type:create cxid:0x4e zxid:0x5f txntype:-1 reqpath:n/a Error Path:/solr/overseer Error:KeeperErrorCode = NodeExists for /solr/overseer
[junit4:junit4]   2> 6756 T1280 oascc.ZkStateReader.updateClusterState Updating cloud state from ZooKeeper... 
[junit4:junit4]   2> 6800 T1279 oascc.ZkStateReader$2.process A cluster state change: WatchedEvent state:SyncConnected type:NodeDataChanged path:/clusterstate.json, has occurred - updating... (live nodes size: 2)
[junit4:junit4]   2> 6800 T1298 oascc.ZkStateReader$2.process A cluster state change: WatchedEvent state:SyncConnected type:NodeDataChanged path:/clusterstate.json, has occurred - updating... (live nodes size: 2)
[junit4:junit4]   2> 6800 T1285 oascc.ZkStateReader$2.process A cluster state change: WatchedEvent state:SyncConnected type:NodeDataChanged path:/clusterstate.json, has occurred - updating... (live nodes size: 2)
[junit4:junit4]   2> 6818 T1299 oasc.ZkController.register We are http://127.0.0.1:36602/collection1/ and leader is http://127.0.0.1:36602/collection1/
[junit4:junit4]   2> 6818 T1299 oasc.ZkController.register No LogReplay needed for core=collection1 baseURL=http://127.0.0.1:36602
[junit4:junit4]   2> 6818 T1299 oasc.ZkController.checkRecovery I am the leader, no recovery necessary
[junit4:junit4]   2> 6818 T1299 oasc.ZkController.publish publishing core=collection1 state=active
[junit4:junit4]   2> 6818 T1299 oasc.ZkController.publish numShards not found on descriptor - reading it from system property
[junit4:junit4]   2> 6820 T1299 oascc.ZkStateReader.updateClusterState Updating cloud state from ZooKeeper... 
[junit4:junit4]   2> 6821 T1257 oass.SolrDispatchFilter.init user.dir=/usr/home/hudson/hudson-slave/workspace/Lucene-Solr-Tests-4.x-Java6/solr/build/solr-core/test/J1
[junit4:junit4]   2> 6821 T1257 oass.SolrDispatchFilter.init SolrDispatchFilter.init() done
[junit4:junit4]   2> 6822 T1257 oascsi.HttpClientUtil.createClient Creating new http client, config:maxConnections=128&maxConnectionsPerHost=32&followRedirects=false
[junit4:junit4]   2> 7001 T1257 oejs.Server.doStart jetty-8.1.8.v20121106
[junit4:junit4]   2> 7004 T1257 oejs.AbstractConnector.doStart Started SocketConnector@127.0.0.1:36606
[junit4:junit4]   2> 7005 T1257 oass.SolrDispatchFilter.init SolrDispatchFilter.init()
[junit4:junit4]   2> 7005 T1257 oasc.SolrResourceLoader.locateSolrHome JNDI not configured for solr (NoInitialContextEx)
[junit4:junit4]   2> 7006 T1257 oasc.SolrResourceLoader.locateSolrHome using system property solr.solr.home: /usr/home/hudson/hudson-slave/workspace/Lucene-Solr-Tests-4.x-Java6/solr/build/solr-core/test/J1/./org.apache.solr.cloud.SyncSliceTest-jetty2-1358208625648
[junit4:junit4]   2> 7006 T1257 oasc.CoreContainer$Initializer.initialize looking for solr.xml: /usr/home/hudson/hudson-slave/workspace/Lucene-Solr-Tests-4.x-Java6/solr/build/solr-core/test/J1/./org.apache.solr.cloud.SyncSliceTest-jetty2-1358208625648/solr.xml
[junit4:junit4]   2> 7007 T1257 oasc.CoreContainer.<init> New CoreContainer 1788345734
[junit4:junit4]   2> 7007 T1257 oasc.CoreContainer.load Loading CoreContainer using Solr Home: '/usr/home/hudson/hudson-slave/workspace/Lucene-Solr-Tests-4.x-Java6/solr/build/solr-core/test/J1/./org.apache.solr.cloud.SyncSliceTest-jetty2-1358208625648/'
[junit4:junit4]   2> 7008 T1257 oasc.SolrResourceLoader.<init> new SolrResourceLoader for directory: '/usr/home/hudson/hudson-slave/workspace/Lucene-Solr-Tests-4.x-Java6/solr/build/solr-core/test/J1/./org.apache.solr.cloud.SyncSliceTest-jetty2-1358208625648/'
[junit4:junit4]   2> 7064 T1257 oashc.HttpShardHandlerFactory.getParameter Setting socketTimeout to: 60000
[junit4:junit4]   2> 7065 T1257 oashc.HttpShardHandlerFactory.getParameter Setting urlScheme to: http://
[junit4:junit4]   2> 7066 T1257 oashc.HttpShardHandlerFactory.getParameter Setting connTimeout to: 15000
[junit4:junit4]   2> 7066 T1257 oashc.HttpShardHandlerFactory.getParameter Setting maxConnectionsPerHost to: 20
[junit4:junit4]   2> 7066 T1257 oashc.HttpShardHandlerFactory.getParameter Setting corePoolSize to: 0
[junit4:junit4]   2> 7067 T1257 oashc.HttpShardHandlerFactory.getParameter Setting maximumPoolSize to: 2147483647
[junit4:junit4]   2> 7067 T1257 oashc.HttpShardHandlerFactory.getParameter Setting maxThreadIdleTime to: 5
[junit4:junit4]   2> 7068 T1257 oashc.HttpShardHandlerFactory.getParameter Setting sizeOfQueue to: -1
[junit4:junit4]   2> 7068 T1257 oashc.HttpShardHandlerFactory.getParameter Setting fairnessPolicy to: false
[junit4:junit4]   2> 7069 T1257 oascsi.HttpClientUtil.createClient Creating new http client, config:maxConnectionsPerHost=20&maxConnections=10000&socketTimeout=60000&connTimeout=15000&retry=false
[junit4:junit4]   2> 7091 T1257 oasc.CoreContainer.load Registering Log Listener
[junit4:junit4]   2> 7111 T1257 oasc.CoreContainer.initZooKeeper Zookeeper client=127.0.0.1:36585/solr
[junit4:junit4]   2> 7112 T1257 oasc.ZkController.checkChrootPath zkHost includes chroot
[junit4:junit4]   2> 7112 T1257 oaz.ZooKeeper.<init> Initiating client connection, connectString=127.0.0.1:36585 sessionTimeout=60000 watcher=org.apache.solr.common.cloud.ConnectionManager@248f6e08
[junit4:junit4]   2> 7113 T1257 oascc.ConnectionManager.waitForConnected Waiting for client to connect to ZooKeeper
[junit4:junit4]   2> 7114 T1310 oaz.ClientCnxn$SendThread.logStartConnect Opening socket connection to server localhost/127.0.0.1:36585. Will not attempt to authenticate using SASL (access denied (javax.security.auth.AuthPermission getLoginConfiguration))
[junit4:junit4]   2> 7114 T1310 oaz.ClientCnxn$SendThread.primeConnection Socket connection established to localhost/127.0.0.1:36585, initiating session
[junit4:junit4]   2> 7114 T1259 oazs.NIOServerCnxnFactory.run Accepted socket connection from /140.211.11.196:36607
[junit4:junit4]   2> 7115 T1259 oazs.ZooKeeperServer.processConnectRequest Client attempting to establish new session at /140.211.11.196:36607
[junit4:junit4]   2> 7116 T1261 oazs.ZooKeeperServer.finishSessionInit Established session 0x13c3b8ad1450007 with negotiated timeout 20000 for client /140.211.11.196:36607
[junit4:junit4]   2> 7116 T1310 oaz.ClientCnxn$SendThread.onConnected Session establishment complete on server localhost/127.0.0.1:36585, sessionid = 0x13c3b8ad1450007, negotiated timeout = 20000
[junit4:junit4]   2> 7117 T1311 oascc.ConnectionManager.process Watcher org.apache.solr.common.cloud.ConnectionManager@248f6e08 name:ZooKeeperConnection Watcher:127.0.0.1:36585 got event WatchedEvent state:SyncConnected type:None path:null path:null type:None
[junit4:junit4]   2> 7117 T1257 oascc.ConnectionManager.waitForConnected Client is connected to ZooKeeper
[junit4:junit4]   2> 7118 T1262 oazs.PrepRequestProcessor.pRequest2Txn Processed session termination for sessionid: 0x13c3b8ad1450007
[junit4:junit4]   2> 7138 T1311 oaz.ClientCnxn$EventThread.run EventThread shut down
[junit4:junit4]   2> 7138 T1259 oazs.NIOServerCnxn.closeSock Closed socket connection for client /140.211.11.196:36607 which had sessionid 0x13c3b8ad1450007
[junit4:junit4]   2> 7138 T1257 oaz.ZooKeeper.close Session: 0x13c3b8ad1450007 closed
[junit4:junit4]   2> 7139 T1257 oascsi.HttpClientUtil.createClient Creating new http client, config:maxConnections=500&maxConnectionsPerHost=16&socketTimeout=60000&connTimeout=15000
[junit4:junit4]   2> 7147 T1257 oaz.ZooKeeper.<init> Initiating client connection, connectString=127.0.0.1:36585/solr sessionTimeout=30000 watcher=org.apache.solr.common.cloud.ConnectionManager@7273d53
[junit4:junit4]   2> 7148 T1257 oascc.ConnectionManager.waitForConnected Waiting for client to connect to ZooKeeper
[junit4:junit4]   2> 7148 T1312 oaz.ClientCnxn$SendThread.logStartConnect Opening socket connection to server localhost/127.0.0.1:36585. Will not attempt to authenticate using SASL (access denied (javax.security.auth.AuthPermission getLoginConfiguration))
[junit4:junit4]   2> 7148 T1312 oaz.ClientCnxn$SendThread.primeConnection Socket connection established to localhost/127.0.0.1:36585, initiating session
[junit4:junit4]   2> 7149 T1259 oazs.NIOServerCnxnFactory.run Accepted socket connection from /140.211.11.196:36608
[junit4:junit4]   2> 7149 T1259 oazs.ZooKeeperServer.processConnectRequest Client attempting to establish new session at /140.211.11.196:36608
[junit4:junit4]   2> 7150 T1261 oazs.ZooKeeperServer.finishSessionInit Established session 0x13c3b8ad1450008 with negotiated timeout 20000 for client /140.211.11.196:36608
[junit4:junit4]   2> 7150 T1312 oaz.ClientCnxn$SendThread.onConnected Session establishment complete on server localhost/127.0.0.1:36585, sessionid = 0x13c3b8ad1450008, negotiated timeout = 20000
[junit4:junit4]   2> 7150 T1313 oascc.ConnectionManager.process Watcher org.apache.solr.common.cloud.ConnectionManager@7273d53 name:ZooKeeperConnection Watcher:127.0.0.1:36585/solr got event WatchedEvent state:SyncConnected type:None path:null path:null type:None
[junit4:junit4]   2> 7151 T1257 oascc.ConnectionManager.waitForConnected Client is connected to ZooKeeper
[junit4:junit4]   2> 7151 T1262 oazs.PrepRequestProcessor.pRequest Got user-level KeeperException when processing sessionid:0x13c3b8ad1450008 type:create cxid:0x1 zxid:0x6c txntype:-1 reqpath:n/a Error Path:/solr/overseer Error:KeeperErrorCode = NodeExists for /solr/overseer
[junit4:junit4]   2> 7152 T1262 oazs.PrepRequestProcessor.pRequest Got user-level KeeperException when processing sessionid:0x13c3b8ad1450008 type:create cxid:0x2 zxid:0x6d txntype:-1 reqpath:n/a Error Path:/solr/overseer Error:KeeperErrorCode = NodeExists for /solr/overseer
[junit4:junit4]   2> 7160 T1257 oasc.ZkController.createEphemeralLiveNode Register node as live in ZooKeeper:/live_nodes/127.0.0.1:36606_
[junit4:junit4]   2> 7161 T1262 oazs.PrepRequestProcessor.pRequest Got user-level KeeperException when processing sessionid:0x13c3b8ad1450008 type:delete cxid:0x4 zxid:0x6e txntype:-1 reqpath:n/a Error Path:/solr/live_nodes/127.0.0.1:36606_ Error:KeeperErrorCode = NoNode for /solr/live_nodes/127.0.0.1:36606_
[junit4:junit4]   2> 7162 T1257 oascc.SolrZkClient.makePath makePath: /live_nodes/127.0.0.1:36606_
[junit4:junit4]   2> 7164 T1298 oascc.ZkStateReader$2.process A cluster state change: WatchedEvent state:SyncConnected type:NodeChildrenChanged path:/live_nodes, has occurred - updating... (live nodes size: 2)
[junit4:junit4]   2> 7164 T1285 oascc.ZkStateReader$3.process Updating live nodes... (3)
[junit4:junit4]   2> 7164 T1279 oascc.ZkStateReader$3.process Updating live nodes... (3)
[junit4:junit4]   2> 7164 T1285 oascc.ZkStateReader$2.process A cluster state change: WatchedEvent state:SyncConnected type:NodeChildrenChanged path:/live_nodes, has occurred - updating... (live nodes size: 3)
[junit4:junit4]   2> 7165 T1279 oascc.ZkStateReader$2.process A cluster state change: WatchedEvent state:SyncConnected type:NodeChildrenChanged path:/live_nodes, has occurred - updating... (live nodes size: 3)
[junit4:junit4]   2> 7165 T1298 oascc.ZkStateReader$3.process Updating live nodes... (3)
[junit4:junit4]   2> 7167 T1257 oascc.ZkStateReader.createClusterStateWatchersAndUpdate Updating cluster state from ZooKeeper... 
[junit4:junit4]   2> 7172 T1314 oasc.CoreContainer.create Creating SolrCore 'collection1' using instanceDir: /usr/home/hudson/hudson-slave/workspace/Lucene-Solr-Tests-4.x-Java6/solr/build/solr-core/test/J1/./org.apache.solr.cloud.SyncSliceTest-jetty2-1358208625648/collection1
[junit4:junit4]   2> 7172 T1314 oasc.ZkController.createCollectionZkNode Check for collection zkNode:collection1
[junit4:junit4]   2> 7172 T1314 oasc.ZkController.createCollectionZkNode Collection zkNode exists
[junit4:junit4]   2> 7173 T1314 oasc.ZkController.readConfigName Load collection config from:/collections/collection1
[junit4:junit4]   2> 7173 T1314 oasc.SolrResourceLoader.<init> new SolrResourceLoader for directory: '/usr/home/hudson/hudson-slave/workspace/Lucene-Solr-Tests-4.x-Java6/solr/build/solr-core/test/J1/./org.apache.solr.cloud.SyncSliceTest-jetty2-1358208625648/collection1/'
[junit4:junit4]   2> 7174 T1314 oasc.SolrResourceLoader.replaceClassLoader Adding 'file:/usr/home/hudson/hudson-slave/workspace/Lucene-Solr-Tests-4.x-Java6/solr/build/solr-core/test/J1/org.apache.solr.cloud.SyncSliceTest-jetty2-1358208625648/collection1/lib/classes/' to classloader
[junit4:junit4]   2> 7175 T1314 oasc.SolrResourceLoader.replaceClassLoader Adding 'file:/usr/home/hudson/hudson-slave/workspace/Lucene-Solr-Tests-4.x-Java6/solr/build/solr-core/test/J1/org.apache.solr.cloud.SyncSliceTest-jetty2-1358208625648/collection1/lib/README' to classloader
[junit4:junit4]   2> 7210 T1314 oasc.SolrConfig.<init> Using Lucene MatchVersion: LUCENE_42
[junit4:junit4]   2> 7256 T1314 oasc.SolrConfig.<init> Loaded SolrConfig: solrconfig.xml
[junit4:junit4]   2> 7356 T1314 oass.IndexSchema.readSchema Reading Solr Schema
[junit4:junit4]   2> 7360 T1314 oass.IndexSchema.readSchema Schema name=test
[junit4:junit4]   2> 7883 T1314 oass.OpenExchangeRatesOrgProvider.init Initialized with rates=open-exchange-rates.json, refreshInterval=1440.
[junit4:junit4]   2> 7894 T1314 oass.IndexSchema.readSchema default search field in schema is text
[junit4:junit4]   2> 7898 T1314 oass.IndexSchema.readSchema unique key field: id
[junit4:junit4]   2> 8288 T1314 oass.FileExchangeRateProvider.reload Reloading exchange rates from file currency.xml
[junit4:junit4]   2> 8292 T1314 oass.FileExchangeRateProvider.reload Reloading exchange rates from file currency.xml
[junit4:junit4]   2> 8295 T1314 oass.OpenExchangeRatesOrgProvider.reload Reloading exchange rates from open-exchange-rates.json
[junit4:junit4]   2> 8296 T1314 oass.OpenExchangeRatesOrgProvider.reload Reloading exchange rates from open-exchange-rates.json
[junit4:junit4]   2> 8296 T1314 oasc.SolrCore.<init> [collection1] Opening new SolrCore at /usr/home/hudson/hudson-slave/workspace/Lucene-Solr-Tests-4.x-Java6/solr/build/solr-core/test/J1/./org.apache.solr.cloud.SyncSliceTest-jetty2-1358208625648/collection1/, dataDir=./org.apache.solr.cloud.SyncSliceTest-1358208618814/jetty2/
[junit4:junit4]   2> 8297 T1314 oasc.JmxMonitoredMap.<init> JMX monitoring is enabled. Adding Solr mbeans to JMX Server: com.sun.jmx.mbeanserver.JmxMBeanServer@2bd9e282
[junit4:junit4]   2> 8297 T1314 oasc.SolrCore.initDirectoryFactory solr.StandardDirectoryFactory
[junit4:junit4]   2> 8298 T1314 oasc.CachingDirectoryFactory.get return new directory for /usr/home/hudson/hudson-slave/workspace/Lucene-Solr-Tests-4.x-Java6/solr/build/solr-core/test/J1/./org.apache.solr.cloud.SyncSliceTest-1358208618814/jetty2 forceNew:false
[junit4:junit4]   2> 8298 T1314 oasc.CachingDirectoryFactory.close Releasing directory:/usr/home/hudson/hudson-slave/workspace/Lucene-Solr-Tests-4.x-Java6/solr/build/solr-core/test/J1/./org.apache.solr.cloud.SyncSliceTest-1358208618814/jetty2
[junit4:junit4]   2> 8298 T1314 oasc.SolrCore.getNewIndexDir New index directory detected: old=null new=./org.apache.solr.cloud.SyncSliceTest-1358208618814/jetty2/index/
[junit4:junit4]   2> 8298 T1314 oasc.SolrCore.initIndex WARNING [collection1] Solr index directory './org.apache.solr.cloud.SyncSliceTest-1358208618814/jetty2/index' doesn't exist. Creating new index...
[junit4:junit4]   2> 8299 T1314 oasc.CachingDirectoryFactory.get return new directory for /usr/home/hudson/hudson-slave/workspace/Lucene-Solr-Tests-4.x-Java6/solr/build/solr-core/test/J1/./org.apache.solr.cloud.SyncSliceTest-1358208618814/jetty2/index forceNew:false
[junit4:junit4]   2> 8313 T1280 oascc.ZkStateReader.updateClusterState Updating cloud state from ZooKeeper... 
[junit4:junit4]   2> 8313 T1280 oasc.Overseer$ClusterStateUpdater.updateState Update state numShards=1 message={
[junit4:junit4]   2> 	  "operation":"state",
[junit4:junit4]   2> 	  "numShards":"1",
[junit4:junit4]   2> 	  "shard":"shard1",
[junit4:junit4]   2> 	  "roles":null,
[junit4:junit4]   2> 	  "state":"active",
[junit4:junit4]   2> 	  "core":"collection1",
[junit4:junit4]   2> 	  "collection":"collection1",
[junit4:junit4]   2> 	  "node_name":"127.0.0.1:36602_",
[junit4:junit4]   2> 	  "base_url":"http://127.0.0.1:36602"}
[junit4:junit4]   2> 9246 T1314 oasc.SolrDeletionPolicy.onCommit SolrDeletionPolicy.onCommit: commits:num=1
[junit4:junit4]   2> 		commit{dir=RateLimitedDirectoryWrapper(org.apache.lucene.store.NIOFSDirectory@/usr/home/hudson/hudson-slave/workspace/Lucene-Solr-Tests-4.x-Java6/solr/build/solr-core/test/J1/org.apache.solr.cloud.SyncSliceTest-1358208618814/jetty2/index lockFactory=org.apache.lucene.store.NativeFSLockFactory@fd97406),segFN=segments_1,generation=1,filenames=[segments_1]
[junit4:junit4]   2> 9246 T1314 oasc.SolrDeletionPolicy.updateCommits newest commit = 1[segments_1]
[junit4:junit4]   2> 9247 T1314 oasc.CachingDirectoryFactory.close Releasing directory:/usr/home/hudson/hudson-slave/workspace/Lucene-Solr-Tests-4.x-Java6/solr/build/solr-core/test/J1/./org.apache.solr.cloud.SyncSliceTest-1358208618814/jetty2/index
[junit4:junit4]   2> 9248 T1314 oasc.SolrCore.initWriters created xml: solr.XMLResponseWriter
[junit4:junit4]   2> 9249 T1314 oasup.UpdateRequestProcessorChain.init inserting DistributedUpdateProcessorFactory into updateRequestProcessorChain "dedupe"
[junit4:junit4]   2> 9250 T1314 oasup.UpdateRequestProcessorChain.init inserting DistributedUpdateProcessorFactory into updateRequestProcessorChain "dedupe-allfields"
[junit4:junit4]   2> 9250 T1314 oasup.UpdateRequestProcessorChain.init inserting DistributedUpdateProcessorFactory into updateRequestProcessorChain "stored_sig"
[junit4:junit4]   2> 9250 T1314 oasup.UpdateRequestProcessorChain.init inserting DistributedUpdateProcessorFactory into updateRequestProcessorChain "uniq-fields"
[junit4:junit4]   2> 9251 T1314 oasup.UpdateRequestProcessorChain.init inserting DistributedUpdateProcessorFactory into updateRequestProcessorChain "distrib-dup-test-chain-implicit"
[junit4:junit4]   2> 9251 T1314 oasc.RequestHandlers.initHandlersFromConfig adding lazy requestHandler: solr.ReplicationHandler
[junit4:junit4]   2> 9251 T1314 oasc.RequestHandlers.initHandlersFromConfig created /replication: solr.ReplicationHandler
[junit4:junit4]   2> 9252 T1314 oasc.RequestHandlers.initHandlersFromConfig created standard: solr.StandardRequestHandler
[junit4:junit4]   2> 9252 T1314 oasc.RequestHandlers.initHandlersFromConfig created /get: solr.RealTimeGetHandler
[junit4:junit4]   2> 9252 T1314 oasc.RequestHandlers.initHandlersFromConfig created dismax: solr.SearchHandler
[junit4:junit4]   2> 9253 T1314 oasc.RequestHandlers.initHandlersFromConfig created mock: org.apache.solr.core.MockQuerySenderListenerReqHandler
[junit4:junit4]   2> 9253 T1314 oasc.RequestHandlers.initHandlersFromConfig created /admin/: org.apache.solr.handler.admin.AdminHandlers
[junit4:junit4]   2> 9253 T1314 oasc.RequestHandlers.initHandlersFromConfig created defaults: solr.StandardRequestHandler
[junit4:junit4]   2> 9254 T1314 oasc.RequestHandlers.initHandlersFromConfig adding lazy requestHandler: solr.StandardRequestHandler
[junit4:junit4]   2> 9254 T1314 oasc.RequestHandlers.initHandlersFromConfig created lazy: solr.StandardRequestHandler
[junit4:junit4]   2> 9254 T1314 oasc.RequestHandlers.initHandlersFromConfig created /update: solr.UpdateRequestHandler
[junit4:junit4]   2> 9255 T1314 oasc.RequestHandlers.initHandlersFromConfig created /terms: org.apache.solr.handler.component.SearchHandler
[junit4:junit4]   2> 9255 T1314 oasc.RequestHandlers.initHandlersFromConfig created spellCheckCompRH: org.apache.solr.handler.component.SearchHandler
[junit4:junit4]   2> 9255 T1314 oasc.RequestHandlers.initHandlersFromConfig created spellCheckCompRH_Direct: org.apache.solr.handler.component.SearchHandler
[junit4:junit4]   2> 9256 T1314 oasc.RequestHandlers.initHandlersFromConfig created spellCheckWithWordbreak: org.apache.solr.handler.component.SearchHandler
[junit4:junit4]   2> 9256 T1314 oasc.RequestHandlers.initHandlersFromConfig created spellCheckWithWordbreak_Direct: org.apache.solr.handler.component.SearchHandler
[junit4:junit4]   2> 9257 T1314 oasc.RequestHandlers.initHandlersFromConfig created spellCheckCompRH1: org.apache.solr.handler.component.SearchHandler
[junit4:junit4]   2> 9257 T1314 oasc.RequestHandlers.initHandlersFromConfig created mltrh: org.apache.solr.handler.component.SearchHandler
[junit4:junit4]   2> 9257 T1314 oasc.RequestHandlers.initHandlersFromConfig created tvrh: org.apache.solr.handler.component.SearchHandler
[junit4:junit4]   2> 9258 T1314 oasc.RequestHandlers.initHandlersFromConfig created /mlt: solr.MoreLikeThisHandler
[junit4:junit4]   2> 9258 T1314 oasc.RequestHandlers.initHandlersFromConfig created /debug/dump: solr.DumpRequestHandler
[junit4:junit4]   2> 9263 T1314 oashl.XMLLoader.init xsltCacheLifetimeSeconds=60
[junit4:junit4]   2> 9266 T1314 oasc.SolrCore.initDeprecatedSupport WARNING solrconfig.xml uses deprecated <admin/gettableFiles>, Please update your config to use the ShowFileRequestHandler.
[junit4:junit4]   2> 9508 T1314 oasc.SolrCore.initDeprecatedSupport WARNING adding ShowFileRequestHandler with hidden files: [SCHEMA.XML, OLD_SYNONYMS.TXT, STOPWORDS.TXT, PROTWORDS.TXT, OPEN-EXCHANGE-RATES.JSON, SYNONYMS.TXT, CURRENCY.XML, MAPPING-ISOLATIN1ACCENT.TXT]
[junit4:junit4]   2> 9510 T1313 oascc.ZkStateReader$2.process A cluster state change: WatchedEvent state:SyncConnected type:NodeDataChanged path:/clusterstate.json, has occurred - updating... (live nodes size: 3)
[junit4:junit4]   2> 9510 T1298 oascc.ZkStateReader$2.process A cluster state change: WatchedEvent state:SyncConnected type:NodeDataChanged path:/clusterstate.json, has occurred - updating... (live nodes size: 3)
[junit4:junit4]   2> 9510 T1285 oascc.ZkStateReader$2.process A cluster state change: WatchedEvent state:SyncConnected type:NodeDataChanged path:/clusterstate.json, has occurred - updating... (live nodes size: 3)
[junit4:junit4]   2> 9510 T1279 oascc.ZkStateReader$2.process A cluster state change: WatchedEvent state:SyncConnected type:NodeDataChanged path:/clusterstate.json, has occurred - updating... (live nodes size: 3)
[junit4:junit4]   2> 9511 T1314 oasc.CachingDirectoryFactory.close Releasing directory:/usr/home/hudson/hudson-slave/workspace/Lucene-Solr-Tests-4.x-Java6/solr/build/solr-core/test/J1/./org.apache.solr.cloud.SyncSliceTest-1358208618814/jetty2
[junit4:junit4]   2> 9513 T1314 oass.SolrIndexSearcher.<init> Opening Searcher@4eac5666 main
[junit4:junit4]   2> 9513 T1314 oasu.CommitTracker.<init> Hard AutoCommit: disabled
[junit4:junit4]   2> 9514 T1314 oasu.CommitTracker.<init> Soft AutoCommit: disabled
[junit4:junit4]   2> 9514 T1314 oashc.SpellCheckComponent.inform Initializing spell checkers
[junit4:junit4]   2> 9534 T1314 oass.DirectSolrSpellChecker.init init: {name=direct,classname=DirectSolrSpellChecker,field=lowerfilt,minQueryLength=3}
[junit4:junit4]   2> 9574 T1315 oasc.SolrCore.registerSearcher [collection1] Registered new searcher Searcher@4eac5666 main{StandardDirectoryReader(segments_1:1)}
[junit4:junit4]   2> 9578 T1314 oasc.ZkController.publish publishing core=collection1 state=down
[junit4:junit4]   2> 9578 T1314 oasc.ZkController.publish numShards not found on descriptor - reading it from system property
[junit4:junit4]   2> 11027 T1280 oascc.ZkStateReader.updateClusterState Updating cloud state from ZooKeeper... 
[junit4:junit4]   2> 11028 T1280 oasc.Overseer$ClusterStateUpdater.updateState Update state numShards=1 message={
[junit4:junit4]   2> 	  "operation":"state",
[junit4:junit4]   2> 	  "numShards":"1",
[junit4:junit4]   2> 	  "shard":null,
[junit4:junit4]   2> 	  "roles":null,
[junit4:junit4]   2> 	  "state":"down",
[junit4:junit4]   2> 	  "core":"collection1",
[junit4:junit4]   2> 	  "collection":"collection1",
[junit4:junit4]   2> 	  "node_name":"127.0.0.1:36606_",
[junit4:junit4]   2> 	  "base_url":"http://127.0.0.1:36606"}
[junit4:junit4]   2> 11028 T1280 oasc.Overseer$ClusterStateUpdater.updateState Collection already exists with numShards=1
[junit4:junit4]   2> 11028 T1280 oasc.Overseer$ClusterStateUpdater.updateState Assigning new node to shard shard=shard1
[junit4:junit4]   2> 11044 T1313 oascc.ZkStateReader$2.process A cluster state change: WatchedEvent state:SyncConnected type:NodeDataChanged path:/clusterstate.json, has occurred - updating... (live nodes size: 3)
[junit4:junit4]   2> 11044 T1285 oascc.ZkStateReader$2.process A cluster state change: WatchedEvent state:SyncConnected type:NodeDataChanged path:/clusterstate.json, has occurred - updating... (live nodes size: 3)
[junit4:junit4]   2> 11044 T1298 oascc.ZkStateReader$2.process A cluster state change: WatchedEvent state:SyncConnected type:NodeDataChanged path:/clusterstate.json, has occurred - updating... (live nodes size: 3)
[junit4:junit4]   2> 11044 T1279 oascc.ZkStateReader$2.process A cluster state change: WatchedEvent state:SyncConnected type:NodeDataChanged path:/clusterstate.json, has occurred - updating... (live nodes size: 3)
[junit4:junit4]   2> 11581 T1314 oasc.CoreContainer.registerCore registering core: collection1
[junit4:junit4]   2> 11581 T1314 oasc.ZkController.register Register replica - core:collection1 address:http://127.0.0.1:36606 collection:collection1 shard:shard1
[junit4:junit4]   2> 11584 T1314 oasc.ZkController.register We are http://127.0.0.1:36606/collection1/ and leader is http://127.0.0.1:36602/collection1/
[junit4:junit4]   2> 11584 T1314 oasc.ZkController.register No LogReplay needed for core=collection1 baseURL=http://127.0.0.1:36606
[junit4:junit4]   2> 11584 T1314 oasc.ZkController.checkRecovery Core needs to recover:collection1
[junit4:junit4]   2> 11585 T1314 oasu.DefaultSolrCoreState.doRecovery Running recovery - first canceling any ongoing recovery
[junit4:junit4]   2> ASYNC  NEW_CORE C57 name=collection1 org.apache.solr.core.SolrCore@48543f09 url=http://127.0.0.1:36606/collection1 node=127.0.0.1:36606_ C57_STATE=coll:collection1 core:collection1 props:{shard=null, roles=null, state=down, core=collection1, collection=collection1, node_name=127.0.0.1:36606_, base_url=http://127.0.0.1:36606}
[junit4:junit4]   2> 11585 T1316 C57 P36606 oasc.RecoveryStrategy.run Starting recovery process.  core=collection1 recoveringAfterStartup=true
[junit4:junit4]   2> 11586 T1316 C57 P36606 oasc.RecoveryStrategy.doRecovery ###### startupVersions=[]
[junit4:junit4]   2> 11586 T1314 oascc.ZkStateReader.updateClusterState Updating cloud state from ZooKeeper... 
[junit4:junit4]   2> 11586 T1316 C57 P36606 oasc.ZkController.publish publishing core=collection1 state=recovering
[junit4:junit4]   2> 11586 T1316 C57 P36606 oasc.ZkController.publish numShards not found on descriptor - reading it from system property
[junit4:junit4]   2> 11587 T1257 oass.SolrDispatchFilter.init user.dir=/usr/home/hudson/hudson-slave/workspace/Lucene-Solr-Tests-4.x-Java6/solr/build/solr-core/test/J1
[junit4:junit4]   2> 11587 T1257 oass.SolrDispatchFilter.init SolrDispatchFilter.init() done
[junit4:junit4]   2> 11588 T1257 oascsi.HttpClientUtil.createClient Creating new http client, config:maxConnections=128&maxConnectionsPerHost=32&followRedirects=false
[junit4:junit4]   2> 11588 T1316 C57 P36606 oascsi.HttpClientUtil.createClient Creating new http client, config:maxConnections=128&maxConnectionsPerHost=32&followRedirects=false
[junit4:junit4]   2> 11711 T1257 oejs.Server.doStart jetty-8.1.8.v20121106
[junit4:junit4]   2> 11713 T1257 oejs.AbstractConnector.doStart Started SocketConnector@127.0.0.1:36610
[junit4:junit4]   2> 11714 T1257 oass.SolrDispatchFilter.init SolrDispatchFilter.init()
[junit4:junit4]   2> 11714 T1257 oasc.SolrResourceLoader.locateSolrHome JNDI not configured for solr (NoInitialContextEx)
[junit4:junit4]   2> 11714 T1257 oasc.SolrResourceLoader.locateSolrHome using system property solr.solr.home: /usr/home/hudson/hudson-slave/workspace/Lucene-Solr-Tests-4.x-Java6/solr/build/solr-core/test/J1/./org.apache.solr.cloud.SyncSliceTest-jetty3-1358208630409
[junit4:junit4]   2> 11715 T1257 oasc.CoreContainer$Initializer.initialize looking for solr.xml: /usr/home/hudson/hudson-slave/workspace/Lucene-Solr-Tests-4.x-Java6/solr/build/solr-core/test/J1/./org.apache.solr.cloud.SyncSliceTest-jetty3-1358208630409/solr.xml
[junit4:junit4]   2> 11715 T1257 oasc.CoreContainer.<init> New CoreContainer 1742863032
[junit4:junit4]   2> 11716 T1257 oasc.CoreContainer.load Loading CoreContainer using Solr Home: '/usr/home/hudson/hudson-slave/workspace/Lucene-Solr-Tests-4.x-Java6/solr/build/solr-core/test/J1/./org.apache.solr.cloud.SyncSliceTest-jetty3-1358208630409/'
[junit4:junit4]   2> 11716 T1257 oasc.SolrResourceLoader.<init> new SolrResourceLoader for directory: '/usr/home/hudson/hudson-slave/workspace/Lucene-Solr-Tests-4.x-Java6/solr/build/solr-core/test/J1/./org.apache.solr.cloud.SyncSliceTest-jetty3-1358208630409/'
[junit4:junit4]   2> 11745 T1257 oashc.HttpShardHandlerFactory.getParameter Setting socketTimeout to: 60000
[junit4:junit4]   2> 11746 T1257 oashc.HttpShardHandlerFactory.getParameter Setting urlScheme to: http://
[junit4:junit4]   2> 11746 T1257 oashc.HttpShardHandlerFactory.getParameter Setting connTimeout to: 15000
[junit4:junit4]   2> 11746 T1257 oashc.HttpShardHandlerFactory.getParameter Setting maxConnectionsPerHost to: 20
[junit4:junit4]   2> 11746 T1257 oashc.HttpShardHandlerFactory.getParameter Setting corePoolSize to: 0
[junit4:junit4]   2> 11747 T1257 oashc.HttpShardHandlerFactory.getParameter Setting maximumPoolSize to: 2147483647
[junit4:junit4]   2> 11747 T1257 oashc.HttpShardHandlerFactory.getParameter Setting maxThreadIdleTime to: 5
[junit4:junit4]   2> 11747 T1257 oashc.HttpShardHandlerFactory.getParameter Setting sizeOfQueue to: -1
[junit4:junit4]   2> 11748 T1257 oashc.HttpShardHandlerFactory.getParameter Setting fairnessPolicy to: false
[junit4:junit4]   2> 11748 T1257 oascsi.HttpClientUtil.createClient Creating new http client, config:maxConnectionsPerHost=20&maxConnections=10000&socketTimeout=60000&connTimeout=15000&retry=false
[junit4:junit4]   2> 11761 T1257 oasc.CoreContainer.load Registering Log Listener
[junit4:junit4]   2> 11774 T1257 oasc.CoreContainer.initZooKeeper Zookeeper client=127.0.0.1:36585/solr
[junit4:junit4]   2> 11775 T1257 oasc.ZkController.checkChrootPath zkHost includes chroot
[junit4:junit4]   2> 11775 T1257 oaz.ZooKeeper.<init> Initiating client connection, connectString=127.0.0.1:36585 sessionTimeout=60000 watcher=org.apache.solr.common.cloud.ConnectionManager@2204d434
[junit4:junit4]   2> 11776 T1257 oascc.ConnectionManager.waitForConnected Waiting for client to connect to ZooKeeper
[junit4:junit4]   2> 11776 T1326 oaz.ClientCnxn$SendThread.logStartConnect Opening socket connection to server localhost/127.0.0.1:36585. Will not attempt to authenticate using SASL (access denied (javax.security.auth.AuthPermission getLoginConfiguration))
[junit4:junit4]   2> 11777 T1326 oaz.ClientCnxn$SendThread.primeConnection Socket connection established to localhost/127.0.0.1:36585, initiating session
[junit4:junit4]   2> 11777 T1259 oazs.NIOServerCnxnFactory.run Accepted socket connection from /140.211.11.196:36611
[junit4:junit4]   2> 11778 T1259 oazs.ZooKeeperServer.processConnectRequest Client attempting to establish new session at /140.211.11.196:36611
[junit4:junit4]   2> 11780 T1261 oazs.ZooKeeperServer.finishSessionInit Established session 0x13c3b8ad1450009 with negotiated timeout 20000 for client /140.211.11.196:36611
[junit4:junit4]   2> 11780 T1326 oaz.ClientCnxn$SendThread.onConnected Session establishment complete on server localhost/127.0.0.1:36585, sessionid = 0x13c3b8ad1450009, negotiated timeout = 20000
[junit4:junit4]   2> 11780 T1327 oascc.ConnectionManager.process Watcher org.apache.solr.common.cloud.ConnectionManager@2204d434 name:ZooKeeperConnection Watcher:127.0.0.1:36585 got event WatchedEvent state:SyncConnected type:None path:null path:null type:None
[junit4:junit4]   2> 11780 T1257 oascc.ConnectionManager.waitForConnected Client is connected to ZooKeeper
[junit4:junit4]   2> 11781 T1262 oazs.PrepRequestProcessor.pRequest2Txn Processed session termination for sessionid: 0x13c3b8ad1450009
[junit4:junit4]   2> 11795 T1327 oaz.ClientCnxn$EventThread.run EventThread shut down
[junit4:junit4]   2> 11795 T1259 oazs.NIOServerCnxn.closeSock Closed socket connection for client /140.211.11.196:36611 which had sessionid 0x13c3b8ad1450009
[junit4:junit4]   2> 11795 T1257 oaz.ZooKeeper.close Session: 0x13c3b8ad1450009 closed
[junit4:junit4]   2> 11795 T1257 oascsi.HttpClientUtil.createClient Creating new http client, config:maxConnections=500&maxConnectionsPerHost=16&socketTimeout=60000&connTimeout=15000
[junit4:junit4]   2> 11802 T1257 oaz.ZooKeeper.<init> Initiating client connection, connectString=127.0.0.1:36585/solr sessionTimeout=30000 watcher=org.apache.solr.common.cloud.ConnectionManager@4ddc7d76
[junit4:junit4]   2> 11803 T1257 oascc.ConnectionManager.waitForConnected Waiting for client to connect to ZooKeeper
[junit4:junit4]   2> 11804 T1328 oaz.ClientCnxn$SendThread.logStartConnect Opening socket connection to server localhost/127.0.0.1:36585. Will not attempt to authenticate using SASL (access denied (javax.security.auth.AuthPermission getLoginConfiguration))
[junit4:junit4]   2> 11804 T1328 oaz.ClientCnxn$SendThread.primeConnection Socket connection established to localhost/127.0.0.1:36585, initiating session
[junit4:junit4]   2> 11804 T1259 oazs.NIOServerCnxnFactory.run Accepted socket connection from /140.211.11.196:36612
[junit4:junit4]   2> 11805 T1259 oazs.ZooKeeperServer.processConnectRequest Client attempting to establish new session at /140.211.11.196:36612
[junit4:junit4]   2> 11806 T1261 oazs.ZooKeeperServer.finishSessionInit Established session 0x13c3b8ad145000a with negotiated timeout 20000 for client /140.211.11.196:36612
[junit4:junit4]   2> 11806 T1328 oaz.ClientCnxn$SendThread.onConnected Session establishment complete on server localhost/127.0.0.1:36585, sessionid = 0x13c3b8ad145000a, negotiated timeout = 20000
[junit4:junit4]   2> 11806 T1329 oascc.ConnectionManager.process Watcher org.apache.solr.common.cloud.ConnectionManager@4ddc7d76 name:ZooKeeperConnection Watcher:127.0.0.1:36585/solr got event WatchedEvent state:SyncConnected type:None path:null path:null type:None
[junit4:junit4]   2> 11806 T1257 oascc.ConnectionManager.waitForConnected Client is connected to ZooKeeper
[junit4:junit4]   2> 11807 T1262 oazs.PrepRequestProcessor.pRequest Got user-level KeeperException when processing sessionid:0x13c3b8ad145000a type:create cxid:0x1 zxid:0x7f txntype:-1 reqpath:n/a Error Path:/solr/overseer Error:KeeperErrorCode = NodeExists for /solr/overseer
[junit4:junit4]   2> 11813 T1262 oazs.PrepRequestProcessor.pRequest Got user-level KeeperException when processing sessionid:0x13c3b8ad145000a type:create cxid:0x2 zxid:0x80 txntype:-1 reqpath:n/a Error Path:/solr/overseer Error:KeeperErrorCode = NodeExists for /solr/overseer
[junit4:junit4]   2> 11814 T1257 oasc.ZkController.createEphemeralLiveNode Register node as live in ZooKeeper:/live_nodes/127.0.0.1:36610_
[junit4:junit4]   2> 11815 T1262 oazs.PrepRequestProcessor.pRequest Got user-level KeeperException when processing sessionid:0x13c3b8ad145000a type:delete cxid:0x4 zxid:0x81 txntype:-1 reqpath:n/a Error Path:/solr/live_nodes/127.0.0.1:36610_ Error:KeeperErrorCode = NoNode for /solr/live_nodes/127.0.0.1:36610_
[junit4:junit4]   2> 11816 T1257 oascc.SolrZkClient.makePath makePath: /live_nodes/127.0.0.1:36610_
[junit4:junit4]   2> 11825 T1298 oascc.ZkStateReader$2.process A cluster state change: WatchedEvent state:SyncConnected type:NodeChildrenChanged path:/live_nodes, has occurred - updating... (live nodes size: 3)
[junit4:junit4]   2> 11825 T1313 oascc.ZkStateReader$3.process Updating live nodes... (4)
[junit4:junit4]   2> 11825 T1279 oascc.ZkStateReader$3.process Updating live nodes... (4)
[junit4:junit4]   2> 11825 T1313 oascc.ZkStateReader$2.process A cluster state change: WatchedEvent state:SyncConnected type:NodeChildrenChanged path:/live_nodes, has occurred - updating... (live nodes size: 4)
[junit4:junit4]   2> 11825 T1285 oascc.ZkStateReader$3.process Updating live nodes... (4)
[junit4:junit4]   2> 11826 T1279 oascc.ZkStateReader$2.process A cluster state change: WatchedEvent state:SyncConnected type:NodeChildrenChanged path:/live_nodes, has occurred - updating... (live nodes size: 4)
[junit4:junit4]   2> 11826 T1285 oascc.ZkStateReader$2.process A cluster state change: WatchedEvent state:SyncConnected type:NodeChildrenChanged path:/live_nodes, has occurred - updating... (live nodes size: 4)
[junit4:junit4]   2> 11826 T1298 oascc.ZkStateReader$3.process Updating live nodes... (4)
[junit4:junit4]   2> 11828 T1257 oascc.ZkStateReader.createClusterStateWatchersAndUpdate Updating cluster state from ZooKeeper... 
[junit4:junit4]   2> 11834 T1330 oasc.CoreContainer.create Creating SolrCore 'collection1' using instanceDir: /usr/home/hudson/hudson-slave/workspace/Lucene-Solr-Tests-4.x-Java6/solr/build/solr-core/test/J1/./org.apache.solr.cloud.SyncSliceTest-jetty3-1358208630409/collection1
[junit4:junit4]   2> 11834 T1330 oasc.ZkController.createCollectionZkNode Check for collection zkNode:collection1
[junit4:junit4]   2> 11835 T1330 oasc.ZkController.createCollectionZkNode Collection zkNode exists
[junit4:junit4]   2> 11835 T1330 oasc.ZkController.readConfigName Load collection config from:/collections/collection1
[junit4:junit4]   2> 11836 T1330 oasc.SolrResourceLoader.<init> new SolrResourceLoader for directory: '/usr/home/hudson/hudson-slave/workspace/Lucene-Solr-Tests-4.x-Java6/solr/build/solr-core/test/J1/./org.apache.solr.cloud.SyncSliceTest-jetty3-1358208630409/collection1/'
[junit4:junit4]   2> 11837 T1330 oasc.SolrResourceLoader.replaceClassLoader Adding 'file:/usr/home/hudson/hudson-slave/workspace/Lucene-Solr-Tests-4.x-Java6/solr/build/solr-core/test/J1/org.apache.solr.cloud.SyncSliceTest-jetty3-1358208630409/collection1/lib/classes/' to classloader
[junit4:junit4]   2> 11837 T1330 oasc.SolrResourceLoader.replaceClassLoader Adding 'file:/usr/home/hudson/hudson-slave/workspace/Lucene-Solr-Tests-4.x-Java6/solr/build/solr-core/test/J1/org.apache.solr.cloud.SyncSliceTest-jetty3-1358208630409/collection1/lib/README' to classloader
[junit4:junit4]   2> 11874 T1330 oasc.SolrConfig.<init> Using Lucene MatchVersion: LUCENE_42
[junit4:junit4]   2> 11923 T1330 oasc.SolrConfig.<init> Loaded SolrConfig: solrconfig.xml
[junit4:junit4]   2> 12023 T1330 oass.IndexSchema.readSchema Reading Solr Schema
[junit4:junit4]   2> 12027 T1330 oass.IndexSchema.readSchema Schema name=test
[junit4:junit4]   2> 12460 T1330 oass.OpenExchangeRatesOrgProvider.init Initialized with rates=open-exchange-rates.json, refreshInterval=1440.
[junit4:junit4]   2> 12468 T1330 oass.IndexSchema.readSchema default search field in schema is text
[junit4:junit4]   2> 12471 T1330 oass.IndexSchema.readSchema unique key field: id
[junit4:junit4]   2> 12481 T1330 oass.FileExchangeRateProvider.reload Reloading exchange rates from file currency.xml
[junit4:junit4]   2> 12485 T1330 oass.FileExchangeRateProvider.reload Reloading exchange rates from file currency.xml
[junit4:junit4]   2> 12489 T1330 oass.OpenExchangeRatesOrgProvider.reload Reloading exchange rates from open-exchange-rates.json
[junit4:junit4]   2> 12490 T1330 oass.OpenExchangeRatesOrgProvider.reload Reloading exchange rates from open-exchange-rates.json
[junit4:junit4]   2> 12491 T1330 oasc.SolrCore.<init> [collection1] Opening new SolrCore at /usr/home/hudson/hudson-slave/workspace/Lucene-Solr-Tests-4.x-Java6/solr/build/solr-core/test/J1/./org.apache.solr.cloud.SyncSliceTest-jetty3-1358208630409/collection1/, dataDir=./org.apache.solr.cloud.SyncSliceTest-1358208618814/jetty3/
[junit4:junit4]   2> 12492 T1330 oasc.JmxMonitoredMap.<init> JMX monitoring is enabled. Adding Solr mbeans to JMX Server: com.sun.jmx.mbeanserver.JmxMBeanServer@2bd9e282
[junit4:junit4]   2> 12492 T1330 oasc.SolrCore.initDirectoryFactory solr.StandardDirectoryFactory
[junit4:junit4]   2> 12493 T1330 oasc.CachingDirectoryFactory.get return new directory for /usr/home/hudson/hudson-slave/workspace/Lucene-Solr-Tests-4.x-Java6/solr/build/solr-core/test/J1/./org.apache.solr.cloud.SyncSliceTest-1358208618814/jetty3 forceNew:false
[junit4:junit4]   2> 12493 T1330 oasc.CachingDirectoryFactory.close Releasing directory:/usr/home/hudson/hudson-slave/workspace/Lucene-Solr-Tests-4.x-Java6/solr/build/solr-core/test/J1/./org.apache.solr.cloud.SyncSliceTest-1358208618814/jetty3
[junit4:junit4]   2> 12493 T1330 oasc.SolrCore.getNewIndexDir New index directory detected: old=null new=./org.apache.solr.cloud.SyncSliceTest-1358208618814/jetty3/index/
[junit4:junit4]   2> 12494 T1330 oasc.SolrCore.initIndex WARNING [collection1] Solr index directory './org.apache.solr.cloud.SyncSliceTest-1358208618814/jetty3/index' doesn't exist. Creating new index...
[junit4:junit4]   2> 12494 T1330 oasc.CachingDirectoryFactory.get return new directory for /usr/home/hudson/hudson-slave/workspace/Lucene-Solr-Tests-4.x-Java6/solr/build/solr-core/test/J1/./org.apache.solr.cloud.SyncSliceTest-1358208618814/jetty3/index forceNew:false
[junit4:junit4]   2> 12503 T1330 oasc.SolrDeletionPolicy.onCommit SolrDeletionPolicy.onCommit: commits:num=1
[junit4:junit4]   2> 		commit{dir=RateLimitedDirectoryWrapper(org.apache.lucene.store.NIOFSDirectory@/usr/home/hudson/hudson-slave/workspace/Lucene-Solr-Tests-4.x-Java6/solr/build/solr-core/test/J1/org.apache.solr.cloud.SyncSliceTest-1358208618814/jetty3/index lockFactory=org.apache.lucene.store.NativeFSLockFactory@3094564f),segFN=segments_1,generation=1,filenames=[segments_1]
[junit4:junit4]   2> 12503 T1330 oasc.SolrDeletionPolicy.updateCommits newest commit = 1[segments_1]
[junit4:junit4]   2> 12504 T1330 oasc.CachingDirectoryFactory.close Releasing directory:/usr/home/hudson/hudson-slave/workspace/Lucene-Solr-Tests-4.x-Java6/solr/build/solr-core/test/J1/./org.apache.solr.cloud.SyncSliceTest-1358208618814/jetty3/index
[junit4:junit4]   2> 12505 T1330 oasc.SolrCore.initWriters created xml: solr.XMLResponseWriter
[junit4:junit4]   2> 12507 T1330 oasup.UpdateRequestProcessorChain.init inserting DistributedUpdateProcessorFactory into updateRequestProcessorChain "dedupe"
[junit4:junit4]   2> 12507 T1330 oasup.UpdateRequestProcessorChain.init inserting DistributedUpdateProcessorFactory into updateRequestProcessorChain "dedupe-allfields"
[junit4:junit4]   2> 12507 T1330 oasup.UpdateRequestProcessorChain.init inserting DistributedUpdateProcessorFactory into updateRequestProcessorChain "stored_sig"
[junit4:junit4]   2> 12508 T1330 oasup.UpdateRequestProcessorChain.init inserting DistributedUpdateProcessorFactory into updateRequestProcessorChain "uniq-fields"
[junit4:junit4]   2> 12508 T1330 oasup.UpdateRequestProcessorChain.init inserting DistributedUpdateProcessorFactory into updateRequestProcessorChain "distrib-dup-test-chain-implicit"
[junit4:junit4]   2> 12509 T1330 oasc.RequestHandlers.initHandlersFromConfig adding lazy requestHandler: solr.ReplicationHandler
[junit4:junit4]   2> 12509 T1330 oasc.RequestHandlers.initHandlersFromConfig created /replication: solr.ReplicationHandler
[junit4:junit4]   2> 12510 T1330 oasc.RequestHandlers.initHandlersFromConfig created standard: solr.StandardRequestHandler
[junit4:junit4]   2> 12510 T1330 oasc.RequestHandlers.initHandlersFromConfig created /get: solr.RealTimeGetHandler
[junit4:junit4]   2> 12511 T1330 oasc.RequestHandlers.initHandlersFromConfig created dismax: solr.SearchHandler
[junit4:junit4]   2> 12511 T1330 oasc.RequestHandlers.initHandlersFromConfig created mock: org.apache.solr.core.MockQuerySenderListenerReqHandler
[junit4:junit4]   2> 12512 T1330 oasc.RequestHandlers.initHandlersFromConfig created /admin/: org.apache.solr.handler.admin.AdminHandlers
[junit4:junit4]   2> 12512 T1330 oasc.RequestHandlers.initHandlersFromConfig created defaults: solr.StandardRequestHandler
[junit4:junit4]   2> 12513 T1330 oasc.RequestHandlers.initHandlersFromConfig adding lazy requestHandler: solr.StandardRequestHandler
[junit4:junit4]   2> 12513 T1330 oasc.RequestHandlers.initHandlersFromConfig created lazy: solr.StandardRequestHandler
[junit4:junit4]   2> 12514 T1330 oasc.RequestHandlers.initHandlersFromConfig created /update: solr.UpdateRequestHandler
[junit4:junit4]   2> 12514 T1330 oasc.RequestHandlers.initHandlersFromConfig created /terms: org.apache.solr.handler.component.SearchHandler
[junit4:junit4]   2> 12515 T1330 oasc.RequestHandlers.initHandlersFromConfig created spellCheckCompRH: org.apache.solr.handler.component.SearchHandler
[junit4:junit4]   2> 12516 T1330 oasc.RequestHandlers.initHandlersFromConfig created spellCheckCompRH_Direct: org.apache.solr.handler.component.SearchHandler
[junit4:junit4]   2> 12516 T1330 oasc.RequestHandlers.initHandlersFromConfig created spellCheckWithWordbreak: org.apache.solr.handler.component.SearchHandler
[junit4:junit4]   2> 12517 T1330 oasc.RequestHandlers.initHandlersFromConfig created spellCheckWithWordbreak_Direct: org.apache.solr.handler.component.SearchHandler
[junit4:junit4]   2> 12517 T1330 oasc.RequestHandlers.initHandlersFromConfig created spellCheckCompRH1: org.apache.solr.handler.component.SearchHandler
[junit4:junit4]   2> 12518 T1330 oasc.RequestHandlers.initHandlersFromConfig created mltrh: org.apache.solr.handler.component.SearchHandler
[junit4:junit4]   2> 12518 T1330 oasc.RequestHandlers.initHandlersFromConfig created tvrh: org.apache.solr.handler.component.SearchHandler
[junit4:junit4]   2> 12519 T1330 oasc.RequestHandlers.initHandlersFromConfig created /mlt: solr.MoreLikeThisHandler
[junit4:junit4]   2> 12519 T1330 oasc.RequestHandlers.initHandlersFromConfig created /debug/dump: solr.DumpRequestHandler
[junit4:junit4]   2> 12527 T1330 oashl.XMLLoader.init xsltCacheLifetimeSeconds=60
[junit4:junit4]   2> 12532 T1330 oasc.SolrCore.initDeprecatedSupport WARNING solrconfig.xml uses deprecated <admin/gettableFiles>, Please update your config to use the ShowFileRequestHandler.
[junit4:junit4]   2> 12534 T1330 oasc.SolrCore.initDeprecatedSupport WARNING adding ShowFileRequestHandler with hidden files: [SCHEMA.XML, OLD_SYNONYMS.TXT, STOPWORDS.TXT, PROTWORDS.TXT, OPEN-EXCHANGE-RATES.JSON, SYNONYMS.TXT, CURRENCY.XML, MAPPING-ISOLATIN1ACCENT.TXT]
[junit4:junit4]   2> 12537 T1330 oasc.CachingDirectoryFactory.close Releasing directory:/usr/home/hudson/hudson-slave/workspace/Lucene-Solr-Tests-4.x-Java6/solr/build/solr-core/test/J1/./org.apache.solr.cloud.SyncSliceTest-1358208618814/jetty3
[junit4:junit4]   2> 12538 T1330 oass.SolrIndexSearcher.<init> Opening Searcher@4e2123f8 main
[junit4:junit4]   2> 12539 T1330 oasu.CommitTracker.<init> Hard AutoCommit: disabled
[junit4:junit4]   2> 12540 T1330 oasu.CommitTracker.<init> Soft AutoCommit: disabled
[junit4:junit4]   2> 12540 T1330 oashc.SpellCheckComponent.inform Initializing spell checkers
[junit4:junit4]   2> 12548 T1280 oascc.ZkStateReader.updateClusterState Updating cloud state from ZooKeeper... 
[junit4:junit4]   2> 12549 T1280 oasc.Overseer$ClusterStateUpdater.updateState Update state numShards=1 message={
[junit4:junit4]   2> 	  "operation":"state",
[junit4:junit4]   2> 	  "numShards":"1",
[junit4:junit4]   2> 	  "shard":"shard1",
[junit4:junit4]   2> 	  "roles":null,
[junit4:junit4]   2> 	  "state":"recovering",
[junit4:junit4]   2> 	  "core":"collection1",
[junit4:junit4]   2> 	  "collection":"collection1",
[junit4:junit4]   2> 	  "node_name":"127.0.0.1:36606_",
[junit4:junit4]   2> 	  "base_url":"http://127.0.0.1:36606"}
[junit4:junit4]   2> 12574 T1330 oass.DirectSolrSpellChecker.init init: {name=direct,classname=DirectSolrSpellChecker,field=lowerfilt,minQueryLength=3}
[junit4:junit4]   2> 12648 T1329 oascc.ZkStateReader$2.process A cluster state change: WatchedEvent state:SyncConnected type:NodeDataChanged path:/clusterstate.json, has occurred - updating... (live nodes size: 4)
[junit4:junit4]   2> 12648 T1285 oascc.ZkStateReader$2.process A cluster state change: WatchedEvent state:SyncConnected type:NodeDataChanged path:/clusterstate.json, has occurred - updating... (live nodes size: 4)
[junit4:junit4]   2> 12648 T1298 oascc.ZkStateReader$2.process A cluster state change: WatchedEvent state:SyncConnected type:NodeDataChanged path:/clusterstate.json, has occurred - updating... (live nodes size: 4)
[junit4:junit4]   2> 12648 T1313 oascc.ZkStateReader$2.process A cluster state change: WatchedEvent state:SyncConnected type:NodeDataChanged path:/clusterstate.json, has occurred - updating... (live nodes size: 4)
[junit4:junit4]   2> 12648 T1279 oascc.ZkStateReader$2.process A cluster state change: WatchedEvent state:SyncConnected type:NodeDataChanged path:/clusterstate.json, has occurred - updating... (live nodes size: 4)
[junit4:junit4]   2> 12731 T1331 oasc.SolrCore.registerSearcher [collection1] Registered new searcher Searcher@4e2123f8 main{StandardDirectoryReader(segments_1:1)}
[junit4:junit4]   2> 12734 T1330 oasc.ZkController.publish publishing core=collection1 state=down
[junit4:junit4]   2> 12735 T1330 oasc.ZkController.publish numShards not found on descriptor - reading it from system property
[junit4:junit4]   2> 14153 T1280 oascc.ZkStateReader.updateClusterState Updating cloud state from ZooKeeper... 
[junit4:junit4]   2> 14154 T1280 oasc.Overseer$ClusterStateUpdater.updateState Update state numShards=1 message={
[junit4:junit4]   2> 	  "operation":"state",
[junit4:junit4]   2> 	  "numShards":"1",
[junit4:junit4]   2> 	  "shard":null,
[junit4:junit4]   2> 	  "roles":null,
[junit4:junit4]   2> 	  "state":"down",
[junit4:junit4]   2> 	  "core":"collection1",
[junit4:junit4]   2> 	  "collection":"collection1",
[junit4:junit4]   2> 	  "node_name":"127.0.0.1:36610_",
[junit4:junit4]   2> 	  "base_url":"http://127.0.0.1:36610"}
[junit4:junit4]   2> 14154 T1280 oasc.Overseer$ClusterStateUpdater.updateState Collection already exists with numShards=1
[junit4:junit4]   2> 14154 T1280 oasc.Overseer$ClusterStateUpdater.updateState Assigning new node to shard shard=shard1
[junit4:junit4]   2> 14193 T1298 oascc.ZkStateReader$2.process A cluster state change: WatchedEvent state:SyncConnected type:NodeDataChanged path:/clusterstate.json, has occurred - updating... (live nodes size: 4)
[junit4:junit4]   2> 14193 T1279 oascc.ZkStateReader$2.process A cluster state change: WatchedEvent state:SyncConnected type:NodeDataChanged path:/clusterstate.json, has occurred - updating... (live nodes size: 4)
[junit4:junit4]   2> 14193 T1329 oascc.ZkStateReader$2.process A cluster state change: WatchedEvent state:SyncConnected type:NodeDataChanged path:/clusterstate.json, has occurred - updating... (live nodes size: 4)
[junit4:junit4]   2> 14193 T1313 oascc.ZkStateReader$2.process A cluster state change: WatchedEvent state:SyncConnected type:NodeDataChanged path:/clusterstate.json, has occurred - updating... (live nodes size: 4)
[junit4:junit4]   2> 14193 T1285 oascc.ZkStateReader$2.process A cluster state change: WatchedEvent state:SyncConnected type:NodeDataChanged path:/clusterstate.json, has occurred - updating... (live nodes size: 4)
[junit4:junit4]   2> 14738 T1330 oasc.CoreContainer.registerCore registering core: collection1
[junit4:junit4]   2> 14738 T1330 oasc.ZkController.register Register replica - core:collection1 address:http://127.0.0.1:36610 collection:collection1 shard:shard1
[junit4:junit4]   2> 14769 T1330 oasc.ZkController.register We are http://127.0.0.1:36610/collection1/ and leader is http://127.0.0.1:36602/collection1/
[junit4:junit4]   2> 14770 T1330 oasc.ZkController.register No LogReplay needed for core=collection1 baseURL=http://127.0.0.1:36610
[junit4:junit4]   2> 14770 T1330 oasc.ZkController.checkRecovery Core needs to recover:collection1
[junit4:junit4]   2> 14770 T1330 oasu.DefaultSolrCoreState.doRecovery Running recovery - first canceling any ongoing recovery
[junit4:junit4]   2> ASYNC  NEW_CORE C58 name=collection1 org.apache.solr.core.SolrCore@5050b425 url=http://127.0.0.1:36610/collection1 node=127.0.0.1:36610_ C58_STATE=coll:collection1 core:collection1 props:{shard=null, roles=null, state=down, core=collection1, collection=collection1, node_name=127.0.0.1:36610_, base_url=http://127.0.0.1:36610}
[junit4:junit4]   2> 14788 T1332 C58 P36610 oasc.RecoveryStrategy.run Starting recovery process.  core=collection1 recoveringAfterStartup=true
[junit4:junit4]   2> 14789 T1332 C58 P36610 oasc.RecoveryStrategy.doRecovery ###### startupVersions=[]
[junit4:junit4]   2> 14789 T1330 oascc.ZkStateReader.updateClusterState Updating cloud state from ZooKeeper... 
[junit4:junit4]   2> 14789 T1332 C58 P36610 oasc.ZkController.publish publishing core=collection1 state=recovering
[junit4:junit4]   2> 14789 T1332 C58 P36610 oasc.ZkController.publish numShards not found on descriptor - reading it from system property
[junit4:junit4]   2> 14790 T1257 oass.SolrDispatchFilter.init user.dir=/usr/home/hudson/hudson-slave/workspace/Lucene-Solr-Tests-4.x-Java6/solr/build/solr-core/test/J1
[junit4:junit4]   2> 14790 T1257 oass.SolrDispatchFilter.init SolrDispatchFilter.init() done
[junit4:junit4]   2> 14791 T1332 C58 P36610 oascsi.HttpClientUtil.createClient Creating new http client, config:maxConnections=128&maxConnectionsPerHost=32&followRedirects=false
[junit4:junit4]   2> 14791 T1257 oascsi.HttpClientUtil.createClient Creating new http client, config:maxConnections=128&maxConnectionsPerHost=32&followRedirects=false
[junit4:junit4]   2> 15126 T1257 oejs.Server.doStart jetty-8.1.8.v20121106
[junit4:junit4]   2> 15129 T1257 oejs.AbstractConnector.doStart Started SocketConnector@127.0.0.1:36614
[junit4:junit4]   2> 15130 T1257 oass.SolrDispatchFilter.init SolrDispatchFilter.init()
[junit4:junit4]   2> 15130 T1257 oasc.SolrResourceLoader.locateSolrHome JNDI not configured for solr (NoInitialContextEx)
[junit4:junit4]   2> 15131 T1257 oasc.SolrResourceLoader.locateSolrHome using system property solr.solr.home: /usr/home/hudson/hudson-slave/workspace/Lucene-Solr-Tests-4.x-Java6/solr/build/solr-core/test/J1/./org.apache.solr.cloud.SyncSliceTest-jetty4-1358208633612
[junit4:junit4]   2> 15131 T1257 oasc.CoreContainer$Initializer.initialize looking for solr.xml: /usr/home/hudson/hudson-slave/workspace/Lucene-Solr-Tests-4.x-Java6/solr/build/solr-core/test/J1/./org.apache.solr.cloud.SyncSliceTest-jetty4-1358208633612/solr.xml
[junit4:junit4]   2> 15131 T1257 oasc.CoreContainer.<init> New CoreContainer 1843946388
[junit4:junit4]   2> 15132 T1257 oasc.CoreContainer.load Loading CoreContainer using Solr Home: '/usr/home/hudson/hudson-slave/workspace/Lucene-Solr-Tests-4.x-Java6/solr/build/solr-core/test/J1/./org.apache.solr.cloud.SyncSliceTest-jetty4-1358208633612/'
[junit4:junit4]   2> 15133 T1257 oasc.SolrResourceLoader.<init> new SolrResourceLoader for directory: '/usr/home/hudson/hudson-slave/workspace/Lucene-Solr-Tests-4.x-Java6/solr/build/solr-core/test/J1/./org.apache.solr.cloud.SyncSliceTest-jetty4-1358208633612/'
[junit4:junit4]   2> 15176 T1257 oashc.HttpShardHandlerFactory.getParameter Setting socketTimeout to: 60000
[junit4:junit4]   2> 15177 T1257 oashc.HttpShardHandlerFactory.getParameter Setting urlScheme to: http://
[junit4:junit4]   2> 15177 T1257 oashc.HttpShardHandlerFactory.getParameter Setting connTimeout to: 15000
[junit4:junit4]   2> 15178 T1257 oashc.HttpShardHandlerFactory.getParameter Setting maxConnectionsPerHost to: 20
[junit4:junit4]   2> 15178 T1257 oashc.HttpShardHandlerFactory.getParameter Setting corePoolSize to: 0
[junit4:junit4]   2> 15179 T1257 oashc.HttpShardHandlerFactory.getParameter Setting maximumPoolSize to: 2147483647
[junit4:junit4]   2> 15179 T1257 oashc.HttpShardHandlerFactory.getParameter Setting maxThreadIdleTime to: 5
[junit4:junit4]   2> 15179 T1257 oashc.HttpShardHandlerFactory.getParameter Setting sizeOfQueue to: -1
[junit4:junit4]   2> 15180 T1257 oashc.HttpShardHandlerFactory.getParameter Setting fairnessPolicy to: false
[junit4:junit4]   2> 15180 T1257 oascsi.HttpClientUtil.createClient Creating new http client, config:maxConnectionsPerHost=20&maxConnections=10000&socketTimeout=60000&connTimeout=15000&retry=false
[junit4:junit4]   2> 15200 T1257 oasc.CoreContainer.load Registering Log Listener
[junit4:junit4]   2> 15218 T1257 oasc.CoreContainer.initZooKeeper Zookeeper client=127.0.0.1:36585/solr
[junit4:junit4]   2> 15219 T1257 oasc.ZkController.checkChrootPath zkHost includes chroot
[junit4:junit4]   2> 15219 T1257 oaz.ZooKeeper.<init> Initiating client connection, connectString=127.0.0.1:36585 sessionTimeout=60000 watcher=org.apache.solr.common.cloud.ConnectionManager@2a8245e9
[junit4:junit4]   2> 15221 T1257 oascc.ConnectionManager.waitForConnected Waiting for client to connect to ZooKeeper
[junit4:junit4]   2> 15221 T1342 oaz.ClientCnxn$SendThread.logStartConnect Opening socket connection to server localhost/127.0.0.1:36585. Will not attempt to authenticate using SASL (access denied (javax.security.auth.AuthPermission getLoginConfiguration))
[junit4:junit4]   2> 15221 T1342 oaz.ClientCnxn$SendThread.primeConnection Socket connection established to localhost/127.0.0.1:36585, initiating session
[junit4:junit4]   2> 15222 T1259 oazs.NIOServerCnxnFactory.run Accepted socket connection from /140.211.11.196:36615
[junit4:junit4]   2> 15222 T1259 oazs.ZooKeeperServer.processConnectRequest Client attempting to establish new session at /140.211.11.196:36615
[junit4:junit4]   2> 15224 T1261 oazs.ZooKeeperServer.finishSessionInit Established session 0x13c3b8ad145000b with negotiated timeout 20000 for client /140.211.11.196:36615
[junit4:junit4]   2> 15224 T1342 oaz.ClientCnxn$SendThread.onConnected Session establishment complete on server localhost/127.0.0.1:36585, sessionid = 0x13c3b8ad145000b, negotiated timeout = 20000
[junit4:junit4]   2> 15224 T1343 oascc.ConnectionManager.process Watcher org.apache.solr.common.cloud.ConnectionManager@2a8245e9 name:ZooKeeperConnection Watcher:127.0.0.1:36585 got event WatchedEvent state:SyncConnected type:None path:null path:null type:None
[junit4:junit4]   2> 15224 T1257 oascc.ConnectionManager.waitForConnected Client is connected to ZooKeeper
[junit4:junit4]   2> 15226 T1262 oazs.PrepRequestProcessor.pRequest2Txn Processed session termination for sessionid: 0x13c3b8ad145000b
[junit4:junit4]   2> 15236 T1343 oaz.ClientCnxn$EventThread.run EventThread shut down
[junit4:junit4]   2> 15236 T1259 oazs.NIOServerCnxn.closeSock Closed socket connection for client /140.211.11.196:36615 which had sessionid 0x13c3b8ad145000b
[junit4:junit4]   2> 15236 T1257 oaz.ZooKeeper.close Session: 0x13c3b8ad145000b closed
[junit4:junit4]   2> 15236 T1257 oascsi.HttpClientUtil.createClient Creating new http client, config:maxConnections=500&maxConnectionsPerHost=16&socketTimeout=60000&connTimeout=15000
[junit4:junit4]   2> 15246 T1257 oaz.ZooKeeper.<init> Initiating client connection, connectString=127.0.0.1:36585/solr sessionTimeout=30000 watcher=org.apache.solr.common.cloud.ConnectionManager@2dff2589
[junit4:junit4]   2> 15247 T1257 oascc.ConnectionManager.waitForConnected Waiting for client to connect to ZooKeeper
[junit4:junit4]   2> 15248 T1344 oaz.ClientCnxn$SendThread.logStartConnect Opening socket connection to server localhost/127.0.0.1:36585. Will not attempt to authenticate using SASL (access denied (javax.security.auth.AuthPermission getLoginConfiguration))
[junit4:junit4]   2> 15248 T1344 oaz.ClientCnxn$SendThread.primeConnection Socket connection established to localhost/127.0.0.1:36585, initiating session
[junit4:junit4]   2> 15248 T1259 oazs.NIOServerCnxnFactory.run Accepted socket connection from /140.211.11.196:36616
[junit4:junit4]   2> 15249 T1259 oazs.ZooKeeperServer.processConnectRequest Client attempting to establish new session at /140.211.11.196:36616
[junit4:junit4]   2> 15250 T1261 oazs.ZooKeeperServer.finishSessionInit Established session 0x13c3b8ad145000c with negotiated timeout 20000 for client /140.211.11.196:36616
[junit4:junit4]   2> 15250 T1344 oaz.ClientCnxn$SendThread.onConnected Session establishment complete on server localhost/127.0.0.1:36585, sessionid = 0x13c3b8ad145000c, negotiated timeout = 20000
[junit4:junit4]   2> 15251 T1345 oascc.ConnectionManager.process Watcher org.apache.solr.common.cloud.ConnectionManager@2dff2589 name:ZooKeeperConnection Watcher:127.0.0.1:36585/solr got event WatchedEvent state:SyncConnected type:None path:null path:null type:None
[junit4:junit4]   2> 15251 T1257 oascc.ConnectionManager.waitForConnected Client is connected to ZooKeeper
[junit4:junit4]   2> 15252 T1262 oazs.PrepRequestProcessor.pRequest Got user-level KeeperException when processing sessionid:0x13c3b8ad145000c type:create cxid:0x1 zxid:0x92 txntype:-1 reqpath:n/a Error Path:/solr/overseer Error:KeeperErrorCode = NodeExists for /solr/overseer
[junit4:junit4]   2> 15253 T1262 oazs.PrepRequestProcessor.pRequest Got user-level KeeperException when processing sessionid:0x13c3b8ad145000c type:create cxid:0x2 zxid:0x93 txntype:-1 reqpath:n/a Error Path:/solr/overseer Error:KeeperErrorCode = NodeExists for /solr/overseer
[junit4:junit4]   2> 15261 T1257 oasc.ZkController.createEphemeralLiveNode Register node as live in ZooKeeper:/live_nodes/127.0.0.1:36614_
[junit4:junit4]   2> 15262 T1262 oazs.PrepRequestProcessor.pRequest Got user-level KeeperException when processing sessionid:0x13c3b8ad145000c type:delete cxid:0x4 zxid:0x94 txntype:-1 reqpath:n/a Error Path:/solr/live_nodes/127.0.0.1:36614_ Error:KeeperErrorCode = NoNode for /solr/live_nodes/127.0.0.1:36614_
[junit4:junit4]   2> 15263 T1257 oascc.SolrZkClient.makePath makePath: /live_nodes/127.0.0.1:36614_
[junit4:junit4]   2> 15265 T1298 oascc.ZkStateReader$2.process A cluster state change: WatchedEvent state:SyncConnected type:NodeChildrenChanged path:/live_nodes, has occurred - updating... (live nodes size: 4)
[junit4:junit4]   2> 15266 T1313 oascc.ZkStateReader$3.process Updating live nodes... (5)
[junit4:junit4]   2> 15266 T1329 oascc.ZkStateReader$3.process Updating live nodes... (5)
[junit4:junit4]   2> 15266 T1285 oascc.ZkStateReader$3.process Updating live nodes... (5)
[junit4:junit4]   2> 15266 T1279 oascc.ZkStateReader$3.process Updating live nodes... (5)
[junit4:junit4]   2> 15266 T1329 oascc.ZkStateReader$2.process A cluster state change: WatchedEvent state:SyncConnected type:NodeChildrenChanged path:/live_nodes, has occurred - updating... (live nodes size: 5)
[junit4:junit4]   2> 15266 T1313 oascc.ZkStateReader$2.process A cluster state change: WatchedEvent state:SyncConnected type:NodeChildrenChanged path:/live_nodes, has occurred - updating... (live nodes size: 5)
[junit4:junit4]   2> 15266 T1279 oascc.ZkStateReader$2.process A cluster state change: WatchedEvent state:SyncConnected type:NodeChildrenChanged path:/live_nodes, has occurred - updating... (live nodes size: 5)
[junit4:junit4]   2> 15267 T1285 oascc.ZkStateReader$2.process A cluster state change: WatchedEvent state:SyncConnected type:NodeChildrenChanged path:/live_nodes, has occurred - updating... (live nodes size: 5)
[junit4:junit4]   2> 15267 T1298 oascc.ZkStateReader$3.process Updating live nodes... (5)
[junit4:junit4]   2> 15270 T1257 oascc.ZkStateReader.createClusterStateWatchersAndUpdate Updating cluster state from ZooKeeper... 
[junit4:junit4]   2> 15277 T1346 oasc.CoreContainer.create Creating SolrCore 'collection1' using instanceDir: /usr/home/hudson/hudson-slave/workspace/Lucene-Solr-Tests-4.x-Java6/solr/build/solr-core/test/J1/./org.apache.solr.cloud.SyncSliceTest-jetty4-1358208633612/collection1
[junit4:junit4]   2> 15277 T1346 oasc.ZkController.createCollectionZkNode Check for collection zkNode:collection1
[junit4:junit4]   2> 15277 T1346 oasc.ZkController.createCollectionZkNode Collection zkNode exists
[junit4:junit4]   2> 15278 T1346 oasc.ZkController.readConfigName Load collection config from:/collections/collection1
[junit4:junit4]   2> 15279 T1346 oasc.SolrResourceLoader.<init> new SolrResourceLoader for directory: '/usr/home/hudson/hudson-slave/workspace/Lucene-Solr-Tests-4.x-Java6/solr/build/solr-core/test/J1/./org.apache.solr.cloud.SyncSliceTest-jetty4-1358208633612/collection1/'
[junit4:junit4]   2> 15280 T1346 oasc.SolrResourceLoader.replaceClassLoader Adding 'file:/usr/home/hudson/hudson-slave/workspace/Lucene-Solr-Tests-4.x-Java6/solr/build/solr-core/test/J1/org.apache.solr.cloud.SyncSliceTest-jetty4-1358208633612/collection1/lib/README' to classloader
[junit4:junit4]   2> 15281 T1346 oasc.SolrResourceLoader.replaceClassLoader Adding 'file:/usr/home/hudson/hudson-slave/workspace/Lucene-Solr-Tests-4.x-Java6/solr/build/solr-core/test/J1/org.apache.solr.cloud.SyncSliceTest-jetty4-1358208633612/collection1/lib/classes/' to classloader
[junit4:junit4]   2> 15338 T1346 oasc.SolrConfig.<init> Using Lucene MatchVersion: LUCENE_42
[junit4:junit4]   2> 15409 T1346 oasc.SolrConfig.<init> Loaded SolrConfig: solrconfig.xml
[junit4:junit4]   2> 15510 T1346 oass.IndexSchema.readSchema Reading Solr Schema
[junit4:junit4]   2> 15517 T1346 oass.IndexSchema.readSchema Schema name=test
[junit4:junit4]   2>  C57_STATE=coll:collection1 core:collection1 props:{shard=shard1, roles=null, state=recovering, core=collection1, collection=collection1, node_name=127.0.0.1:36606_, base_url=http://127.0.0.1:36606}
[junit4:junit4]   2> 15604 T1316 C57 P36606 oasc.RecoveryStrategy.doRecovery Attempting to PeerSync from http://127.0.0.1:36602/collection1/ core=collection1 - recoveringAfterStartup=true
[junit4:junit4]   2> 15604 T1316 C57 P36606 oasu.PeerSync.sync PeerSync: core=collection1 url=http://127.0.0.1:36606 START replicas=[http://127.0.0.1:36602/collection1/] nUpdates=100
[junit4:junit4]   2> 15605 T1316 C57 P36606 oasu.PeerSync.sync WARNING no frame of reference to tell of we've missed updates
[junit4:junit4]   2> 15605 T1316 C57 P36606 oasc.RecoveryStrategy.doRecovery PeerSync Recovery was not successful - trying replication. core=collection1
[junit4:junit4]   2> 15605 T1316 C57 P36606 oasc.RecoveryStrategy.doRecovery Starting Replication Recovery. core=collection1
[junit4:junit4]   2> 15605 T1316 C57 P36606 oasc.RecoveryStrategy.doRecovery Begin buffering updates. core=collection1
[junit4:junit4]   2> 15605 T1316 C57 P36606 oasu.UpdateLog.bufferUpdates Starting to buffer updates. FSUpdateLog{state=ACTIVE, tlog=null}
[junit4:junit4]   2> 15605 T1316 C57 P36606 oasc.RecoveryStrategy.replicate Attempting to replicate from http://127.0.0.1:36602/collection1/. core=collection1
[junit4:junit4]   2> 15606 T1316 C57 P36606 oascsi.HttpClientUtil.createClient Creating new http client, config:maxConnections=128&maxConnectionsPerHost=32&followRedirects=false
[junit4:junit4]   2> ASYNC  NEW_CORE C59 name=collection1 org.apache.solr.core.SolrCore@873aaea url=http://127.0.0.1:36602/collection1 node=127.0.0.1:36602_ C59_STATE=coll:collection1 core:collection1 props:{shard=shard1, roles=null, state=active, core=collection1, collection=collection1, node_name=127.0.0.1:36602_, base_url=http://127.0.0.1:36602, leader=true}
[junit4:junit4]   2> 15615 T1290 C59 P36602 REQ /get {getVersions=100&distrib=false&wt=javabin&qt=/get&version=2} status=0 QTime=0 
[junit4:junit4]   2> 15617 T1291 C59 P36602 oasu.DirectUpdateHandler2.commit start commit{,optimize=false,openSearcher=false,waitSearcher=true,expungeDeletes=false,softCommit=false}
[junit4:junit4]   2> 15618 T1291 C59 P36602 oasc.CachingDirectoryFactory.close Releasing directory:/usr/home/hudson/hudson-slave/workspace/Lucene-Solr-Tests-4.x-Java6/solr/build/solr-core/test/J1/./org.apache.solr.cloud.SyncSliceTest-1358208618814/jetty1
[junit4:junit4]   2> 15622 T1291 C59 P36602 oasc.SolrDeletionPolicy.onInit SolrDeletionPolicy.onInit: commits:num=1
[junit4:junit4]   2> 		commit{dir=RateLimitedDirectoryWrapper(org.apache.lucene.store.NIOFSDirectory@/usr/home/hudson/hudson-slave/workspace/Lucene-Solr-Tests-4.x-Java6/solr/build/solr-core/test/J1/org.apache.solr.cloud.SyncSliceTest-1358208618814/jetty1/index lockFactory=org.apache.lucene.store.NativeFSLockFactory@5489f951),segFN=segments_1,generation=1,filenames=[segments_1]
[junit4:junit4]   2> 15622 T1291 C59 P36602 oasc.SolrDeletionPolicy.updateCommits newest commit = 1[segments_1]
[junit4:junit4]   2> 15626 T1291 C59 P36602 oasc.SolrDeletionPolicy.onCommit SolrDeletionPolicy.onCommit: commits:num=2
[junit4:junit4]   2> 		commit{dir=RateLimitedDirectoryWrapper(org.apache.lucene.store.NIOFSDirectory@/usr/home/hudson/hudson-slave/workspace/Lucene-Solr-Tests-4.x-Java6/solr/build/solr-core/test/J1/org.apache.solr.cloud.SyncSliceTest-1358208618814/jetty1/index lockFactory=org.apache.lucene.store.NativeFSLockFactory@5489f951),segFN=segments_1,generation=1,filenames=[segments_1]
[junit4:junit4]   2> 		commit{dir=RateLimitedDirectoryWrapper(org.apache.lucene.store.NIOFSDirectory@/usr/home/hudson/hudson-slave/workspace/Lucene-Solr-Tests-4.x-Java6/solr/build/solr-core/test/J1/org.apache.solr.cloud.SyncSliceTest-1358208618814/jetty1/index lockFactory=org.apache.lucene.store.NativeFSLockFactory@5489f951),segFN=segments_2,generation=2,filenames=[segments_2]
[junit4:junit4]   2> 15626 T1291 C59 P36602 oasc.SolrDeletionPolicy.updateCommits newest commit = 2[segments_2]
[junit4:junit4]   2> 15628 T1291 C59 P36602 oasc.CachingDirectoryFactory.close Releasing directory:/usr/home/hudson/hudson-slave/workspace/Lucene-Solr-Tests-4.x-Java6/solr/build/solr-core/test/J1/./org.apache.solr.cloud.SyncSliceTest-1358208618814/jetty1
[junit4:junit4]   2> 15628 T1291 C59 P36602 oass.SolrIndexSearcher.<init> Opening Searcher@660eba1a realtime
[junit4:junit4]   2> 15628 T1291 C59 P36602 oasu.DirectUpdateHandler2.commit end_commit_flush
[junit4:junit4]   2> 15629 T1291 C59 P36602 /update {waitSearcher=true&openSearcher=false&commit=true&wt=javabin&commit_end_point=true&version=2&softCommit=false} {commit=} 0 12
[junit4:junit4]   2> 15630 T1316 C57 P36606 oash.ReplicationHandler.inform Commits will be reserved for  10000
[junit4:junit4]   2> 15630 T1316 C57 P36606 oash.SnapPuller.<init>  No value set for 'pollInterval'. Timer Task not started.
[junit4:junit4]   2> 15633 T1292 C59 P36602 oash.ReplicationHandler.inform Commits will be reserved for  10000
[junit4:junit4]   2> 15633 T1292 C59 P36602 REQ /replication {command=indexversion&qt=/replication&wt=javabin&version=2} status=0 QTime=1 
[junit4:junit4]   2> 15633 T1316 C57 P36606 oash.SnapPuller.fetchLatestIndex Master's generation: 2
[junit4:junit4]   2> 15634 T1316 C57 P36606 oash.SnapPuller.fetchLatestIndex Slave's generation: 1
[junit4:junit4]   2> 15634 T1316 C57 P36606 oash.SnapPuller.fetchLatestIndex Starting replication process
[junit4:junit4]   2> 15636 T1292 C59 P36602 oasc.CachingDirectoryFactory.close Releasing directory:/usr/home/hudson/hudson-slave/workspace/Lucene-Solr-Tests-4.x-Java6/solr/build/solr-core/test/J1/./org.apache.solr.cloud.SyncSliceTest-1358208618814/jetty1
[junit4:junit4]   2> 15637 T1292 C59 P36602 oasc.CachingDirectoryFactory.close Releasing directory:/usr/home/hudson/hudson-slave/workspace/Lucene-Solr-Tests-4.x-Java6/solr/build/solr-core/test/J1/./org.apache.solr.cloud.SyncSliceTest-1358208618814/jetty1/index
[junit4:junit4]   2> 15637 T1292 C59 P36602 REQ /replication {command=filelist&qt=/replication&wt=javabin&generation=2&version=2} status=0 QTime=1 
[junit4:junit4]   2> 15638 T1316 C57 P36606 oash.SnapPuller.fetchLatestIndex Number of files in latest index in master: 1
[junit4:junit4]   2> 15639 T1316 C57 P36606 oasc.CachingDirectoryFactory.get return new directory for /usr/home/hudson/hudson-slave/workspace/Lucene-Solr-Tests-4.x-Java6/solr/build/solr-core/test/J1/./org.apache.solr.cloud.SyncSliceTest-1358208618814/jetty2/index.20130114191034449 forceNew:false
[junit4:junit4]   2> 15639 T1316 C57 P36606 oasc.CachingDirectoryFactory.close Releasing directory:/usr/home/hudson/hudson-slave/workspace/Lucene-Solr-Tests-4.x-Java6/solr/build/solr-core/test/J1/./org.apache.solr.cloud.SyncSliceTest-1358208618814/jetty2
[junit4:junit4]   2> 15640 T1316 C57 P36606 oash.SnapPuller.fetchLatestIndex Starting download to RateLimitedDirectoryWrapper(org.apache.lucene.store.NIOFSDirectory@/usr/home/hudson/hudson-slave/workspace/Lucene-Solr-Tests-4.x-Java6/solr/build/solr-core/test/J1/org.apache.solr.cloud.SyncSliceTest-1358208618814/jetty2/index.20130114191034449 lockFactory=org.apache.lucene.store.NativeFSLockFactory@1b62d923) fullCopy=true
[junit4:junit4]   2> 15643 T1292 C59 P36602 REQ /replication {file=segments_2&command=filecontent&checksum=true&wt=filestream&qt=/replication&generation=2} status=0 QTime=0 
[junit4:junit4]   2> 15645 T1316 C57 P36606 oasc.CachingDirectoryFactory.close Releasing directory:/usr/home/hudson/hudson-slave/workspace/Lucene-Solr-Tests-4.x-Java6/solr/build/solr-core/test/J1/./org.apache.solr.cloud.SyncSliceTest-1358208618814/jetty2/index
[junit4:junit4]   2> 15645 T1316 C57 P36606 oash.SnapPuller.fetchLatestIndex Total time taken for download : 0 secs
[junit4:junit4]   2> 15647 T1316 C57 P36606 oash.SnapPuller.modifyIndexProps New index installed. Updating index properties... index=index.20130114191034449
[junit4:junit4]   2> 15648 T1316 C57 P36606 oasc.CachingDirectoryFactory.close Releasing directory:/usr/home/hudson/hudson-slave/workspace/Lucene-Solr-Tests-4.x-Java6/solr/build/solr-core/test/J1/./org.apache.solr.cloud.SyncSliceTest-1358208618814/jetty2
[junit4:junit4]   2> 15648 T1316 C57 P36606 oasc.CachingDirectoryFactory.close Releasing directory:/usr/home/hudson/hudson-slave/workspace/Lucene-Solr-Tests-4.x-Java6/solr/build/solr-core/test/J1/./org.apache.solr.cloud.SyncSliceTest-1358208618814/jetty2
[junit4:junit4]   2> 15649 T1316 C57 P36606 oasc.SolrCore.getNewIndexDir New index directory detected: old=./org.apache.solr.cloud.SyncSliceTest-1358208618814/jetty2/index/ new=./org.apache.solr.cloud.SyncSliceTest-1358208618814/jetty2/index.20130114191034449
[junit4:junit4]   2> 15652 T1316 C57 P36606 oasc.SolrDeletionPolicy.onInit SolrDeletionPolicy.onInit: commits:num=1
[junit4:junit4]   2> 		commit{dir=RateLimitedDirectoryWrapper(org.apache.lucene.store.NIOFSDirectory@/usr/home/hudson/hudson-slave/workspace/Lucene-Solr-Tests-4.x-Java6/solr/build/solr-core/test/J1/org.apache.solr.cloud.SyncSliceTest-1358208618814/jetty2/index.20130114191034449 lockFactory=org.apache.lucene.store.NativeFSLockFactory@1b62d923),segFN=segments_2,generation=2,filenames=[segments_2]
[junit4:junit4]   2> 15653 T1316 C57 P36606 oasc.SolrDeletionPolicy.updateCommits newest commit = 2[segments_2]
[junit4:junit4]   2> 15654 T1316 C57 P36606 oasc.CachingDirectoryFactory.close Releasing directory:/usr/home/hudson/hudson-slave/workspace/Lucene-Solr-Tests-4.x-Java6/solr/build/solr-core/test/J1/./org.apache.solr.cloud.SyncSliceTest-1358208618814/jetty2
[junit4:junit4]   2> 15654 T1316 C57 P36606 oasu.DefaultSolrCoreState.newIndexWriter Creating new IndexWriter...
[junit4:junit4]   2> 15654 T1316 C57 P36606 oasu.DefaultSolrCoreState.newIndexWriter Waiting until IndexWriter is unused... core=collection1
[junit4:junit4]   2> 15654 T1316 C57 P36606 oasu.DefaultSolrCoreState.newIndexWriter Rollback old IndexWriter... core=collection1
[junit4:junit4]   2> 15655 T1316 C57 P36606 oasc.CachingDirectoryFactory.close Releasing directory:/usr/home/hudson/hudson-slave/workspace/Lucene-Solr-Tests-4.x-Java6/solr/build/solr-core/test/J1/./org.apache.solr.cloud.SyncSliceTest-1358208618814/jetty2/index.20130114191034449
[junit4:junit4]   2> 15655 T1316 C57 P36606 oasc.CachingDirectoryFactory.close Releasing directory:/usr/home/hudson/hudson-slave/workspace/Lucene-Solr-Tests-4.x-Java6/solr/build/solr-core/test/J1/./org.apache.solr.cloud.SyncSliceTest-1358208618814/jetty2
[junit4:junit4]   2> 15658 T1316 C57 P36606 oasc.SolrDeletionPolicy.onInit SolrDeletionPolicy.onInit: commits:num=1
[junit4:junit4]   2> 		commit{dir=RateLimitedDirectoryWrapper(org.apache.lucene.store.NIOFSDirectory@/usr/home/hudson/hudson-slave/workspace/Lucene-Solr-Tests-4.x-Java6/solr/build/solr-core/test/J1/org.apache.solr.cloud.SyncSliceTest-1358208618814/jetty2/index.20130114191034449 lockFactory=org.apache.lucene.store.NativeFSLockFactory@1b62d923),segFN=segments_2,generation=2,filenames=[segments_2]
[junit4:junit4]   2> 15659 T1316 C57 P36606 oasc.SolrDeletionPolicy.updateCommits newest commit = 2[segments_2]
[junit4:junit4]   2> 15659 T1316 C57 P36606 oasu.DefaultSolrCoreState.newIndexWriter New IndexWriter is ready to be used.
[junit4:junit4]   2> 15659 T1316 C57 P36606 oasc.CachingDirectoryFactory.close Releasing directory:/usr/home/hudson/hudson-slave/workspace/Lucene-Solr-Tests-4.x-Java6/solr/build/solr-core/test/J1/./org.apache.solr.cloud.SyncSliceTest-1358208618814/jetty2
[junit4:junit4]   2> 15659 T1316 C57 P36606 oass.SolrIndexSearcher.<init> Opening Searcher@2f28849 main
[junit4:junit4]   2> 15661 T1315 oasc.SolrCore.registerSearcher [collection1] Registered new searcher Searcher@2f28849 main{StandardDirectoryReader(segments_2:1:nrt)}
[junit4:junit4]   2> 15661 T1315 oasc.CachingDirectoryFactory.close Releasing directory:/usr/home/hudson/hudson-slave/workspace/Lucene-Solr-Tests-4.x-Java6/solr/build/solr-core/test/J1/./org.apache.solr.cloud.SyncSliceTest-1358208618814/jetty2/index
[junit4:junit4]   2> 15661 T1316 C57 P36606 oasu.DirectUpdateHandler2.commit start commit{,optimize=false,openSearcher=false,waitSearcher=false,expungeDeletes=false,softCommit=false}
[junit4:junit4]   2> 15663 T1316 C57 P36606 oasc.SolrDeletionPolicy.onCommit SolrDeletionPolicy.onCommit: commits:num=2
[junit4:junit4]   2> 		commit{dir=RateLimitedDirectoryWrapper(org.apache.lucene.store.NIOFSDirectory@/usr/home/hudson/hudson-slave/workspace/Lucene-Solr-Tests-4.x-Java6/solr/build/solr-core/test/J1/org.apache.solr.cloud.SyncSliceTest-1358208618814/jetty2/index.20130114191034449 lockFactory=org.apache.lucene.store.NativeFSLockFactory@1b62d923),segFN=segments_2,generation=2,filenames=[segments_2]
[junit4:junit4]   2> 		commit{dir=RateLimitedDirectoryWrapper(org.apache.lucene.store.NIOFSDirectory@/usr/home/hudson/hudson-slave/workspace/Lucene-Solr-Tests-4.x-Java6/solr/build/solr-core/test/J1/org.apache.solr.cloud.SyncSliceTest-1358208618814/jetty2/index.20130114191034449 lockFactory=org.apache.lucene.store.NativeFSLockFactory@1b62d923),segFN=segments_3,generation=3,filenames=[segments_3]
[junit4:junit4]   2> 15663 T1316 C57 P36606 oasc.SolrDeletionPolicy.updateCommits newest commit = 3[segments_3]
[junit4:junit4]   2> 15664 T1316 C57 P36606 oasc.CachingDirectoryFactory.close Releasing directory:/usr/home/hudson/hudson-slave/workspace/Lucene-Solr-Tests-4.x-Java6/solr/build/solr-core/test/J1/./org.apache.solr.cloud.SyncSliceTest-1358208618814/jetty2
[junit4:junit4]   2> 15664 T1316 C57 P36606 oasu.DirectUpdateHandler2.commit end_commit_flush
[junit4:junit4]   2> 15665 T1316 C57 P36606 oasc.CachingDirectoryFactory.close Releasing directory:/usr/home/hudson/hudson-slave/workspace/Lucene-Solr-Tests-4.x-Java6/solr/build/solr-core/test/J1/./org.apache.solr.cloud.SyncSliceTest-1358208618814/jetty2/index.20130114191034449
[junit4:junit4]   2> 15665 T1316 C57 P36606 oasc.CachingDirectoryFactory.close Releasing directory:/usr/home/hudson/hudson-slave/workspace/Lucene-Solr-Tests-4.x-Java6/solr/build/solr-core/test/J1/./org.apache.solr.cloud.SyncSliceTest-1358208618814/jetty2/index
[junit4:junit4]   2> 15665 T1316 C57 P36606 oasc.RecoveryStrategy.replay No replay needed. core=collection1
[junit4:junit4]   2> 15665 T1316 C57 P36606 oasc.RecoveryStrategy.doRecovery Replication Recovery was successful - registering as Active. core=collection1
[junit4:junit4]   2> 15665 T1316 C57 P36606 oasc.ZkController.publish publishing core=collection1 state=active
[junit4:junit4]   2> 15665 T1316 C57 P36606 oasc.ZkController.publish numShards not found on descriptor - reading it from system property
[junit4:junit4]   2> 15670 T1316 C57 P36606 oasc.RecoveryStrategy.doRecovery Finished recovery process. core=collection1
[junit4:junit4]   2> 15697 T1280 oascc.ZkStateReader.updateClusterState Updating cloud state from ZooKeeper... 
[junit4:junit4]   2> 15698 T1280 oasc.Overseer$ClusterStateUpdater.updateState Update state numShards=1 message={
[junit4:junit4]   2> 	  "operation":"state",
[junit4:junit4]   2> 	  "numShards":"1",
[junit4:junit4]   2> 	  "shard":"shard1",
[junit4:junit4]   2> 	  "roles":null,
[junit4:junit4]   2> 	  "state":"recovering",
[junit4:junit4]   2> 	  "core":"collection1",
[junit4:junit4]   2> 	  "collection":"collection1",
[junit4:junit4]   2> 	  "node_name":"127.0.0.1:36610_",
[junit4:junit4]   2> 	  "base_url":"http://127.0.0.1:36610"}
[junit4:junit4]   2> 15702 T1280 oasc.Overseer$ClusterStateUpdater.updateState Update state numShards=1 message={
[junit4:junit4]   2> 	  "operation":"state",
[junit4:junit4]   2> 	  "numShards":"1",
[junit4:junit4]   2> 	  "shard":"shard1",
[junit4:junit4]   2> 	  "roles":null,
[junit4:junit4]   2> 	  "state":"active",
[junit4:junit4]   2> 	  "core":"collection1",
[junit4:junit4]   2> 	  "collection":"collection1",
[junit4:junit4]   2> 	  "node_name":"127.0.0.1:36606_",
[junit4:junit4]   2> 	  "base_url":"http://127.0.0.1:36606"}
[junit4:junit4]   2> 15721 T1298 oascc.ZkStateReader$2.process A cluster state change: WatchedEvent state:SyncConnected type:NodeDataChanged path:/clusterstate.json, has occurred - updating... (live nodes size: 5)
[junit4:junit4]   2> 15721 T1285 oascc.ZkStateReader$2.process A cluster state change: WatchedEvent state:SyncConnected type:NodeDataChanged path:/clusterstate.json, has occurred - updating... (live nodes size: 5)
[junit4:junit4]   2> 15721 T1279 oascc.ZkStateReader$2.process A cluster state change: WatchedEvent state:SyncConnected type:NodeDataChanged path:/clusterstate.json, has occurred - updating... (live nodes size: 5)
[junit4:junit4]   2> 15721 T1345 oascc.ZkStateReader$2.process A cluster state change: WatchedEvent state:SyncConnected type:NodeDataChanged path:/clusterstate.json, has occurred - updating... (live nodes size: 5)
[junit4:junit4]   2> 15721 T1313 oascc.ZkStateReader$2.process A cluster state change: WatchedEvent state:SyncConnected type:NodeDataChanged path:/clusterstate.json, has occurred - updating... (live nodes size: 5)
[junit4:junit4]   2> 15721 T1329 oascc.ZkStateReader$2.process A cluster state change: WatchedEvent state:SyncConnected type:NodeDataChanged path:/clusterstate.json, has occurred - updating... (live nodes size: 5)
[junit4:junit4]   2> 16106 T1346 oass.OpenExchangeRatesOrgProvider.init Initialized with rates=open-exchange-rates.json, refreshInterval=1440.
[junit4:junit4]   2> 16115 T1346 oass.IndexSchema.readSchema default search field in schema is text
[junit4:junit4]   2> 16119 T1346 oass.IndexSchema.readSchema unique key field: id
[junit4:junit4]   2> 16130 T1346 oass.FileExchangeRateProvider.reload Reloading exchange rates from file currency.xml
[junit4:junit4]   2> 16139 T1346 oass.FileExchangeRateProvider.reload Reloading exchange rates from file currency.xml
[junit4:junit4]   2> 16142 T1346 oass.OpenExchangeRatesOrgProvider.reload Reloading exchange rates from open-exchange-rates.json
[junit4:junit4]   2> 16143 T1346 oass.OpenExchangeRatesOrgProvider.reload Reloading exchange rates from open-exchange-rates.json
[junit4:junit4]   2> 16144 T1346 oasc.SolrCore.<init> [collection1] Opening new SolrCore at /usr/home/hudson/hudson-slave/workspace/Lucene-Solr-Tests-4.x-Java6/solr/build/solr-core/test/J1/./org.apache.solr.cloud.SyncSliceTest-jetty4-1358208633612/collection1/, dataDir=./org.apache.solr.cloud.SyncSliceTest-1358208618814/jetty4/
[junit4:junit4]   2> 16145 T1346 oasc.JmxMonitoredMap.<init> JMX monitoring is enabled. Adding Solr mbeans to JMX Server: com.sun.jmx.mbeanserver.JmxMBeanServer@2bd9e282
[junit4:junit4]   2> 16145 T1346 oasc.SolrCore.initDirectoryFactory solr.StandardDirectoryFactory
[junit4:junit4]   2> 16146 T1346 oasc.CachingDirectoryFactory.get return new directory for /usr/home/hudson/hudson-slave/workspace/Lucene-Solr-Tests-4.x-Java6/solr/build/solr-core/test/J1/./org.apache.solr.cloud.SyncSliceTest-1358208618814/jetty4 forceNew:false
[junit4:junit4]   2> 16146 T1346 oasc.CachingDirectoryFactory.close Releasing directory:/usr/home/hudson/hudson-slave/workspace/Lucene-Solr-Tests-4.x-Java6/solr/build/solr-core/test/J1/./org.apache.solr.cloud.SyncSliceTest-1358208618814/jetty4
[junit4:junit4]   2> 16147 T1346 oasc.SolrCore.getNewIndexDir New index directory detected: old=null new=./org.apache.solr.cloud.SyncSliceTest-1358208618814/jetty4/index/
[junit4:junit4]   2> 16147 T1346 oasc.SolrCore.initIndex WARNING [collection1] Solr index directory './org.apache.solr.cloud.SyncSliceTest-1358208618814/jetty4/index' doesn't exist. Creating new index...
[junit4:junit4]   2> 16148 T1346 oasc.CachingDirectoryFactory.get return new directory for /usr/home/hudson/hudson-slave/workspace/Lucene-Solr-Tests-4.x-Java6/solr/build/solr-core/test/J1/./org.apache.solr.cloud.SyncSliceTest-1358208618814/jetty4/index forceNew:false
[junit4:junit4]   2> 16152 T1346 oasc.SolrDeletionPolicy.onCommit SolrDeletionPolicy.onCommit: commits:num=1
[junit4:junit4]   2> 		commit{dir=RateLimitedDirectoryWrapper(org.apache.lucene.store.NIOFSDirectory@/usr/home/hudson/hudson-slave/workspace/Lucene-Solr-Tests-4.x-Java6/solr/build/solr-core/test/J1/org.apache.solr.cloud.SyncSliceTest-1358208618814/jetty4/index lockFactory=org.apache.lucene.store.NativeFSLockFactory@544e6f7),segFN=segments_1,generation=1,filenames=[segments_1]
[junit4:junit4]   2> 16152 T1346 oasc.SolrDeletionPolicy.updateCommits newest commit = 1[segments_1]
[junit4:junit4]   2> 16153 T1346 oasc.CachingDirectoryFactory.close Releasing directory:/usr/home/hudson/hudson-slave/workspace/Lucene-Solr-Tests-4.x-Java6/solr/build/solr-core/test/J1/./org.apache.solr.cloud.SyncSliceTest-1358208618814/jetty4/index
[junit4:junit4]   2> 16153 T1346 oasc.SolrCore.initWriters created xml: solr.XMLResponseWriter
[junit4:junit4]   2> 16155 T1346 oasup.UpdateRequestProcessorChain.init inserting DistributedUpdateProcessorFactory into updateRequestProcessorChain "dedupe"
[junit4:junit4]   2> 16155 T1346 oasup.UpdateRequestProcessorChain.init inserting DistributedUpdateProcessorFactory into updateRequestProcessorChain "dedupe-allfields"
[junit4:junit4]   2> 16156 T1346 oasup.UpdateRequestProcessorChain.init inserting DistributedUpdateProcessorFactory into updateRequestProcessorChain "stored_sig"
[junit4:junit4]   2> 16156 T1346 oasup.UpdateRequestProcessorChain.init inserting DistributedUpdateProcessorFactory into updateRequestProcessorChain "uniq-fields"
[junit4:junit4]   2> 16156 T1346 oasup.UpdateRequestProcessorChain.init inserting DistributedUpdateProcessorFactory into updateRequestProcessorChain "distrib-dup-test-chain-implicit"
[junit4:junit4]   2> 16157 T1346 oasc.RequestHandlers.initHandlersFromConfig adding lazy requestHandler: solr.ReplicationHandler
[junit4:junit4]   2> 16157 T1346 oasc.RequestHandlers.initHandlersFromConfig created /replication: solr.ReplicationHandler
[junit4:junit4]   2> 16157 T1346 oasc.RequestHandlers.initHandlersFromConfig created standard: solr.StandardRequestHandler
[junit4:junit4]   2> 16158 T1346 oasc.RequestHandlers.initHandlersFromConfig created /get: solr.RealTimeGetHandler
[junit4:junit4]   2> 16159 T1346 oasc.RequestHandlers.initHandlersFromConfig created dismax: solr.SearchHandler
[junit4:junit4]   2> 16159 T1346 oasc.RequestHandlers.initHandlersFromConfig created mock: org.apache.solr.core.MockQuerySenderListenerReqHandler
[junit4:junit4]   2> 16159 T1346 oasc.RequestHandlers.initHandlersFromConfig created /admin/: org.apache.solr.handler.admin.AdminHandlers
[junit4:junit4]   2> 16160 T1346 oasc.RequestHandlers.initHandlersFromConfig created defaults: solr.StandardRequestHandler
[junit4:junit4]   2> 16160 T1346 oasc.RequestHandlers.initHandlersFromConfig adding lazy requestHandler: solr.StandardRequestHandler
[junit4:junit4]   2> 16160 T1346 oasc.RequestHandlers.initHandlersFromConfig created lazy: solr.StandardRequestHandler
[junit4:junit4]   2> 16161 T1346 oasc.RequestHandlers.initHandlersFromConfig created /update: solr.UpdateRequestHandler
[junit4:junit4]   2> 16161 T1346 oasc.RequestHandlers.initHandlersFromConfig created /terms: org.apache.solr.handler.component.SearchHandler
[junit4:junit4]   2> 16162 T1346 oasc.RequestHandlers.initHandlersFromConfig created spellCheckCompRH: org.apache.solr.handler.component.SearchHandler
[junit4:junit4]   2> 16162 T1346 oasc.RequestHandlers.initHandlersFromConfig created spellCheckCompRH_Direct: org.apache.solr.handler.component.SearchHandler
[junit4:junit4]   2> 16163 T1346 oasc.RequestHandlers.initHandlersFromConfig created spellCheckWithWordbreak: org.apache.solr.handler.component.SearchHandler
[junit4:junit4]   2> 16163 T1346 oasc.RequestHandlers.initHandlersFromConfig created spellCheckWithWordbreak_Direct: org.apache.solr.handler.component.SearchHandler
[junit4:junit4]   2> 16164 T1346 oasc.RequestHandlers.initHandlersFromConfig created spellCheckCompRH1: org.apache.solr.handler.component.SearchHandler
[junit4:junit4]   2> 16164 T1346 oasc.RequestHandlers.initHandlersFromConfig created mltrh: org.apache.solr.handler.component.SearchHandler
[junit4:junit4]   2> 16165 T1346 oasc.RequestHandlers.initHandlersFromConfig created tvrh: org.apache.solr.handler.component.SearchHandler
[junit4:junit4]   2> 16165 T1346 oasc.RequestHandlers.initHandlersFromConfig created /mlt: solr.MoreLikeThisHandler
[junit4:junit4]   2> 16166 T1346 oasc.RequestHandlers.initHandlersFromConfig created /debug/dump: solr.DumpRequestHandler
[junit4:junit4]   2> 16172 T1346 oashl.XMLLoader.init xsltCacheLifetimeSeconds=60
[junit4:junit4]   2> 16176 T1346 oasc.SolrCore.initDeprecatedSupport WARNING solrconfig.xml uses deprecated <admin/gettableFiles>, Please update your config to use the ShowFileRequestHandler.
[junit4:junit4]   2> 16177 T1346 oasc.SolrCore.initDeprecatedSupport WARNING adding ShowFileRequestHandler with hidden files: [SCHEMA.XML, OLD_SYNONYMS.TXT, STOPWORDS.TXT, PROTWORDS.TXT, OPEN-EXCHANGE-RATES.JSON, SYNONYMS.TXT, CURRENCY.XML, MAPPING-ISOLATIN1ACCENT.TXT]
[junit4:junit4]   2> 16180 T1346 oasc.CachingDirectoryFactory.close Releasing directory:/usr/home/hudson/hudson-slave/workspace/Lucene-Solr-Tests-4.x-Java6/solr/build/solr-core/test/J1/./org.apache.solr.cloud.SyncSliceTest-1358208618814/jetty4
[junit4:junit4]   2> 16191 T1346 oass.SolrIndexSearcher.<init> Opening Searcher@437a0861 main
[junit4:junit4]   2> 16193 T1346 oasu.CommitTracker.<init> Hard AutoCommit: disabled
[junit4:junit4]   2> 16194 T1346 oasu.CommitTracker.<init> Soft AutoCommit: disabled
[junit4:junit4]   2> 16194 T1346 oashc.SpellCheckComponent.inform Initializing spell checkers
[junit4:junit4]   2> 16204 T1346 oass.DirectSolrSpellChecker.init init: {name=direct,classname=DirectSolrSpellChecker,field=lowerfilt,minQueryLength=3}
[junit4:junit4]   2> 16301 T1349 oasc.SolrCore.registerSearcher [collection1] Registered new searcher Searcher@437a0861 main{StandardDirectoryReader(segments_1:1)}
[junit4:junit4]   2> 16306 T1346 oasc.ZkController.publish publishing core=collection1 state=down
[junit4:junit4]   2> 16306 T1346 oasc.ZkController.publish numShards not found on descriptor - reading it from system property
[junit4:junit4]   2> 17227 T1280 oascc.ZkStateReader.updateClusterState Updating cloud state from ZooKeeper... 
[junit4:junit4]   2> 17228 T1280 oasc.Overseer$ClusterStateUpdater.updateState Update state numShards=1 message={
[junit4:junit4]   2> 	  "operation":"state",
[junit4:junit4]   2> 	  "numShards":"1",
[junit4:junit4]   2> 	  "shard":null,
[junit4:junit4]   2> 	  "roles":null,
[junit4:junit4]   2> 	  "state":"down",
[junit4:junit4]   2> 	  "core":"collection1",
[junit4:junit4]   2> 	  "collection":"collection1",
[junit4:junit4]   2> 	  "node_name":"127.0.0.1:36614_",
[junit4:junit4]   2> 	  "base_url":"http://127.0.0.1:36614"}
[junit4:junit4]   2> 17228 T1280 oasc.Overseer$ClusterStateUpdater.updateState Collection already exists with numShards=1
[junit4:junit4]   2> 17228 T1280 oasc.Overseer$ClusterStateUpdater.updateState Assigning new node to shard shard=shard1
[junit4:junit4]   2> 17266 T1329 oascc.ZkStateReader$2.process A cluster state change: WatchedEvent state:SyncConnected type:NodeDataChanged path:/clusterstate.json, has occurred - updating... (live nodes size: 5)
[junit4:junit4]   2> 17266 T1298 oascc.ZkStateReader$2.process A cluster state change: WatchedEvent state:SyncConnected type:NodeDataChanged path:/clusterstate.json, has occurred - updating... (live nodes size: 5)
[junit4:junit4]   2> 17266 T1345 oascc.ZkStateReader$2.process A cluster state change: WatchedEvent state:SyncConnected type:NodeDataChanged path:/clusterstate.json, has occurred - updating... (live nodes size: 5)
[junit4:junit4]   2> 17266 T1285 oascc.ZkStateReader$2.process A cluster state change: WatchedEvent state:SyncConnected type:NodeDataChanged path:/clusterstate.json, has occurred - updating... (live nodes size: 5)
[junit4:junit4]   2> 17266 T1313 oascc.ZkStateReader$2.process A cluster state change: WatchedEvent state:SyncConnected type:NodeDataChanged path:/clusterstate.json, has occurred - updating... (live nodes size: 5)
[junit4:junit4]   2> 17266 T1279 oascc.ZkStateReader$2.process A cluster state change: WatchedEvent state:SyncConnected type:NodeDataChanged path:/clusterstate.json, has occurred - updating... (live nodes size: 5)
[junit4:junit4]   2> 17325 T1346 oasc.CoreContainer.registerCore registering core: collection1
[junit4:junit4]   2> 17325 T1346 oasc.ZkController.register Register replica - core:collection1 address:http://127.0.0.1:36614 collection:collection1 shard:shard1
[junit4:junit4]   2> 17328 T1346 oasc.ZkController.register We are http://127.0.0.1:36614/collection1/ and leader is http://127.0.0.1:36602/collection1/
[junit4:junit4]   2> 17328 T1346 oasc.ZkController.register No LogReplay needed for core=collection1 baseURL=http://127.0.0.1:36614
[junit4:junit4]   2> 17328 T1346 oasc.ZkController.checkRecovery Core needs to recover:collection1
[junit4:junit4]   2> 17328 T1346 oasu.DefaultSolrCoreState.doRecovery Running recovery - first canceling any ongoing recovery
[junit4:junit4]   2> ASYNC  NEW_CORE C60 name=collection1 org.apache.solr.core.SolrCore@3798d967 url=http://127.0.0.1:36614/collection1 node=127.0.0.1:36614_ C60_STATE=coll:collection1 core:collection1 props:{shard=null, roles=null, state=down, core=collection1, collection=collection1, node_name=127.0.0.1:36614_, base_url=http://127.0.0.1:36614}
[junit4:junit4]   2> 17329 T1350 C60 P36614 oasc.RecoveryStrategy.run Starting recovery process.  core=collection1 recoveringAfterStartup=true
[junit4:junit4]   2> 17329 T1346 oascc.ZkStateReader.updateClusterState Updating cloud state from ZooKeeper... 
[junit4:junit4]   2> 17330 T1350 C60 P36614 oasc.RecoveryStrategy.doRecovery ###### startupVersions=[]
[junit4:junit4]   2> 17330 T1350 C60 P36614 oasc.ZkController.publish publishing core=collection1 state=recovering
[junit4:junit4]   2> 17330 T1350 C60 P36614 oasc.ZkController.publish numShards not found on descriptor - reading it from system property
[junit4:junit4]   2> 17330 T1257 oass.SolrDispatchFilter.init user.dir=/usr/home/hudson/hudson-slave/workspace/Lucene-Solr-Tests-4.x-Java6/solr/build/solr-core/test/J1
[junit4:junit4]   2> 17331 T1257 oass.SolrDispatchFilter.init SolrDispatchFilter.init() done
[junit4:junit4]   2> 17331 T1257 oascsi.HttpClientUtil.createClient Creating new http client, config:maxConnections=128&maxConnectionsPerHost=32&followRedirects=false
[junit4:junit4]   2> 17331 T1350 C60 P36614 oascsi.HttpClientUtil.createClient Creating new http client, config:maxConnections=128&maxConnectionsPerHost=32&followRedirects=false
[junit4:junit4]   2> 17343 T1257 oascc.ZkStateReader.updateClusterState Updating cloud state from ZooKeeper... 
[junit4:junit4]   2> 17344 T1257 oasc.AbstractFullDistribZkTestBase.waitForThingsToLevelOut Wait for recoveries to finish - wait 15 for each attempt
[junit4:junit4]   2> 17344 T1257 oasc.AbstractDistribZkTestBase.waitForRecoveriesToFinish Wait for recoveries to finish - collection: collection1 failOnTimeout:true timeout (sec):15
[junit4:junit4]   2> 17345 T1257 oascc.ZkStateReader.updateClusterState Updating cloud state from ZooKeeper... 
[junit4:junit4]   2>  C58_STATE=coll:collection1 core:collection1 props:{shard=shard1, roles=null, state=recovering, core=collection1, collection=collection1, node_name=127.0.0.1:36610_, base_url=http://127.0.0.1:36610}
[junit4:junit4]   2> 17805 T1332 C58 P36610 oasc.RecoveryStrategy.doRecovery Attempting to PeerSync from http://127.0.0.1:36602/collection1/ core=collection1 - recoveringAfterStartup=true
[junit4:junit4]   2> 17805 T1332 C58 P36610 oasu.PeerSync.sync PeerSync: core=collection1 url=http://127.0.0.1:36610 START replicas=[http://127.0.0.1:36602/collection1/] nUpdates=100
[junit4:junit4]   2> 17809 T1332 C58 P36610 oasu.PeerSync.sync WARNING no frame of reference to tell of we've missed updates
[junit4:junit4]   2> 17809 T1332 C58 P36610 oasc.RecoveryStrategy.doRecovery PeerSync Recovery was not successful - trying replication. core=collection1
[junit4:junit4]   2> 17809 T1332 C58 P36610 oasc.RecoveryStrategy.doRecovery Starting Replication Recovery. core=collection1
[junit4:junit4]   2> 17809 T1332 C58 P36610 oasc.RecoveryStrategy.doRecovery Begin buffering updates. core=collection1
[junit4:junit4]   2> 17809 T1332 C58 P36610 oasu.UpdateLog.bufferUpdates Starting to buffer updates. FSUpdateLog{state=ACTIVE, tlog=null}
[junit4:junit4]   2> 17809 T1332 C58 P36610 oasc.RecoveryStrategy.replicate Attempting to replicate from http://127.0.0.1:36602/collection1/. core=collection1
[junit4:junit4]   2> 17809 T1332 C58 P36610 oascsi.HttpClientUtil.createClient Creating new http client, config:maxConnections=128&maxConnectionsPerHost=32&followRedirects=false
[junit4:junit4]   2> 17811 T1290 C59 P36602 REQ /get {getVersions=100&distrib=false&wt=javabin&qt=/get&version=2} status=0 QTime=0 
[junit4:junit4]   2> 17817 T1294 C59 P36602 oasu.DirectUpdateHandler2.commit start commit{,optimize=false,openSearcher=false,waitSearcher=true,expungeDeletes=false,softCommit=false}
[junit4:junit4]   2> 17848 T1294 C59 P36602 oasc.SolrDeletionPolicy.onCommit SolrDeletionPolicy.onCommit: commits:num=2
[junit4:junit4]   2> 		commit{dir=RateLimitedDirectoryWrapper(org.apache.lucene.store.NIOFSDirectory@/usr/home/hudson/hudson-slave/workspace/Lucene-Solr-Tests-4.x-Java6/solr/build/solr-core/test/J1/org.apache.solr.cloud.SyncSliceTest-1358208618814/jetty1/index lockFactory=org.apache.lucene.store.NativeFSLockFactory@5489f951),segFN=segments_2,generation=2,filenames=[segments_2]
[junit4:junit4]   2> 		commit{dir=RateLimitedDirectoryWrapper(org.apache.lucene.store.NIOFSDirectory@/usr/home/hudson/hudson-slave/workspace/Lucene-Solr-Tests-4.x-Java6/solr/build/solr-core/test/J1/org.apache.solr.cloud.SyncSliceTest-1358208618814/jetty1/index lockFactory=org.apache.lucene.store.NativeFSLockFactory@5489f951),segFN=segments_3,generation=3,filenames=[segments_3]
[junit4:junit4]   2> 17848 T1294 C59 P36602 oasc.SolrDeletionPolicy.updateCommits newest commit = 3[segments_3]
[junit4:junit4]   2> 17849 T1294 C59 P36602 oasc.CachingDirectoryFactory.close Releasing directory:/usr/home/hudson/hudson-slave/workspace/Lucene-Solr-Tests-4.x-Java6/solr/build/solr-core/test/J1/./org.apache.solr.cloud.SyncSliceTest-1358208618814/jetty1
[junit4:junit4]   2> 17849 T1294 C59 P36602 oasu.DirectUpdateHandler2.commit end_commit_flush
[junit4:junit4]   2> 17849 T1294 C59 P36602 /update {waitSearcher=true&openSearcher=false&commit=true&wt=javabin&commit_end_point=true&version=2&softCommit=false} {commit=} 0 32
[junit4:junit4]   2> 17850 T1332 C58 P36610 oash.ReplicationHandler.inform Commits will be reserved for  10000
[junit4:junit4]   2> 17851 T1332 C58 P36610 oash.SnapPuller.<init>  No value set for 'pollInterval'. Timer Task not started.
[junit4:junit4]   2> 17853 T1292 C59 P36602 REQ /replication {command=indexversion&qt=/replication&wt=javabin&version=2} status=0 QTime=0 
[junit4:junit4]   2> 17854 T1332 C58 P36610 oash.SnapPuller.fetchLatestIndex Master's generation: 3
[junit4:junit4]   2> 17854 T1332 C58 P36610 oash.SnapPuller.fetchLatestIndex Slave's generation: 1
[junit4:junit4]   2> 17854 T1332 C58 P36610 oash.SnapPuller.fetchLatestIndex Starting replication process
[junit4:junit4]   2> 17856 T1292 C59 P36602 oasc.CachingDirectoryFactory.close Releasing directory:/usr/home/hudson/hudson-slave/workspace/Lucene-Solr-Tests-4.x-Java6/solr/build/solr-core/test/J1/./org.apache.solr.cloud.SyncSliceTest-1358208618814/jetty1
[junit4:junit4]   2> 17857 T1292 C59 P36602 oasc.CachingDirectoryFactory.close Releasing directory:/usr/home/hudson/hudson-slave/workspace/Lucene-Solr-Tests-4.x-Java6/solr/build/solr-core/test/J1/./org.apache.solr.cloud.SyncSliceTest-1358208618814/jetty1/index
[junit4:junit4]   2> 17857 T1292 C59 P36602 REQ /replication {command=filelist&qt=/replication&wt=javabin&generation=3&version=2} status=0 QTime=1 
[junit4:junit4]   2> 17858 T1332 C58 P36610 oash.SnapPuller.fetchLatestIndex Number of files in latest index in master: 1
[junit4:junit4]   2> 17859 T1332 C58 P36610 oasc.CachingDirectoryFactory.get return new directory for /usr/home/hudson/hudson-slave/workspace/Lucene-Solr-Tests-4.x-Java6/solr/build/solr-core/test/J1/./org.apache.solr.cloud.SyncSliceTest-1358208618814/jetty3/index.20130114191036669 forceNew:false
[junit4:junit4]   2> 17859 T1332 C58 P36610 oasc.CachingDirectoryFactory.close Releasing directory:/usr/home/hudson/hudson-slave/workspace/Lucene-Solr-Tests-4.x-Java6/solr/build/solr-core/test/J1/./org.apache.solr.cloud.SyncSliceTest-1358208618814/jetty3
[junit4:junit4]   2> 17860 T1332 C58 P36610 oash.SnapPuller.fetchLatestIndex Starting download to RateLimitedDirectoryWrapper(org.apache.lucene.store.NIOFSDirectory@/usr/home/hudson/hudson-slave/workspace/Lucene-Solr-Tests-4.x-Java6/solr/build/solr-core/test/J1/org.apache.solr.cloud.SyncSliceTest-1358208618814/jetty3/index.20130114191036669 lockFactory=org.apache.lucene.store.NativeFSLockFactory@7fc6ab97) fullCopy=true
[junit4:junit4]   2> 17863 T1292 C59 P36602 REQ /replication {file=segments_3&command=filecontent&checksum=true&wt=filestream&qt=/replication&generation=3} status=0 QTime=0 
[junit4:junit4]   2> 17864 T1332 C58 P36610 oasc.CachingDirectoryFactory.close Releasing directory:/usr/home/hudson/hudson-slave/workspace/Lucene-Solr-Tests-4.x-Java6/solr/build/solr-core/test/J1/./org.apache.solr.cloud.SyncSliceTest-1358208618814/jetty3/index
[junit4:junit4]   2> 17865 T1332 C58 P36610 oash.SnapPuller.fetchLatestIndex Total time taken for download : 0 secs
[junit4:junit4]   2> 17876 T1332 C58 P36610 oash.SnapPuller.modifyIndexProps New index installed. Updating index properties... index=index.20130114191036669
[junit4:junit4]   2> 17877 T1332 C58 P36610 oasc.CachingDirectoryFactory.close Releasing directory:/usr/home/hudson/hudson-slave/workspace/Lucene-Solr-Tests-4.x-Java6/solr/build/solr-core/test/J1/./org.apache.solr.cloud.SyncSliceTest-1358208618814/jetty3
[junit4:junit4]   2> 17880 T1332 C58 P36610 oasc.CachingDirectoryFactory.close Releasing directory:/usr/home/hudson/hudson-slave/workspace/Lucene-Solr-Tests-4.x-Java6/solr/build/solr-core/test/J1/./org.apache.solr.cloud.SyncSliceTest-1358208618814/jetty3
[junit4:junit4]   2> 17880 T1332 C58 P36610 oasc.SolrCore.getNewIndexDir New index directory detected: old=./org.apache.solr.cloud.SyncSliceTest-1358208618814/jetty3/index/ new=./org.apache.solr.cloud.SyncSliceTest-1358208618814/jetty3/index.20130114191036669
[junit4:junit4]   2> 17883 T1332 C58 P36610 oasc.SolrDeletionPolicy.onInit SolrDeletionPolicy.onInit: commits:num=1
[junit4:junit4]   2> 		commit{dir=RateLimitedDirectoryWrapper(org.apache.lucene.store.NIOFSDirectory@/usr/home/hudson/hudson-slave/workspace/Lucene-Solr-Tests-4.x-Java6/solr/build/solr-core/test/J1/org.apache.solr.cloud.SyncSliceTest-1358208618814/jetty3/index.20130114191036669 lockFactory=org.apache.lucene.store.NativeFSLockFactory@7fc6ab97),segFN=segments_3,generation=3,filenames=[segments_3]
[junit4:junit4]   2> 17910 T1332 C58 P36610 oasc.SolrDeletionPolicy.updateCommits newest commit = 3[segments_3]
[junit4:junit4]   2> 17912 T1332 C58 P36610 oasc.CachingDirectoryFactory.close Releasing directory:/usr/home/hudson/hudson-slave/workspace/Lucene-Solr-Tests-4.x-Java6/solr/build/solr-core/test/J1/./org.apache.solr.cloud.SyncSliceTest-1358208618814/jetty3
[junit4:junit4]   2> 17912 T1332 C58 P36610 oasu.DefaultSolrCoreState.newIndexWriter Creating new IndexWriter...
[junit4:junit4]   2> 17912 T1332 C58 P36610 oasu.DefaultSolrCoreState.newIndexWriter Waiting until IndexWriter is unused... core=collection1
[junit4:junit4]   2> 17912 T1332 C58 P36610 oasu.DefaultSolrCoreState.newIndexWriter Rollback old IndexWriter... core=collection1
[junit4:junit4]   2> 17913 T1332 C58 P36610 oasc.CachingDirectoryFactory.close Releasing directory:/usr/home/hudson/hudson-slave/workspace/Lucene-Solr-Tests-4.x-Java6/solr/build/solr-core/test/J1/./org.apache.solr.cloud.SyncSliceTest-1358208618814/jetty3/index.20130114191036669
[junit4:junit4]   2> 17914 T1332 C58 P36610 oasc.CachingDirectoryFactory.close Releasing directory:/usr/home/hudson/hudson-slave/workspace/Lucene-Solr-Tests-4.x-Java6/solr/build/solr-core/test/J1/./org.apache.solr.cloud.SyncSliceTest-1358208618814/jetty3
[junit4:junit4]   2> 17916 T1332 C58 P36610 oasc.SolrDeletionPolicy.onInit SolrDeletionPolicy.onInit: commits:num=1
[junit4:junit4]   2> 		commit{dir=RateLimitedDirectoryWrapper(org.apache.lucene.store.NIOFSDirectory@/usr/home/hudson/hudson-slave/workspace/Lucene-Solr-Tests-4.x-Java6/solr/build/solr-core/test/J1/org.apache.solr.cloud.SyncSliceTest-1358208618814/jetty3/index.20130114191036669 lockFactory=org.apache.lucene.store.NativeFSLockFactory@7fc6ab97),segFN=segments_3,generation=3,filenames=[segments_3]
[junit4:junit4]   2> 17917 T1332 C58 P36610 oasc.SolrDeletionPolicy.updateCommits newest commit = 3[segments_3]
[junit4:junit4]   2> 17917 T1332 C58 P36610 oasu.DefaultSolrCoreState.newIndexWriter New IndexWriter is ready to be used.
[junit4:junit4]   2> 17917 T1332 C58 P36610 oasc.CachingDirectoryFactory.close Releasing directory:/usr/home/hudson/hudson-slave/workspace/Lucene-Solr-Tests-4.x-Java6/solr/build/solr-core/test/J1/./org.apache.solr.cloud.SyncSliceTest-1358208618814/jetty3
[junit4:junit4]   2> 17917 T1332 C58 P36610 oass.SolrIndexSearcher.<init> Opening Searcher@1f864014 main
[junit4:junit4]   2> 17919 T1331 oasc.SolrCore.registerSearcher [collection1] Registered new searcher Searcher@1f864014 main{StandardDirectoryReader(segments_3:1:nrt)}
[junit4:junit4]   2> 17919 T1331 oasc.CachingDirectoryFactory.close Releasing directory:/usr/home/hudson/hudson-slave/workspace/Lucene-Solr-Tests-4.x-Java6/solr/build/solr-core/test/J1/./org.apache.solr.cloud.SyncSliceTest-1358208618814/jetty3/index
[junit4:junit4]   2> 17919 T1332 C58 P36610 oasu.DirectUpdateHandler2.commit start commit{,optimize=false,openSearcher=false,waitSearcher=false,expungeDeletes=false,softCommit=false}
[junit4:junit4]   2> 17921 T1332 C58 P36610 oasc.SolrDeletionPolicy.onCommit SolrDeletionPolicy.onCommit: commits:num=2
[junit4:junit4]   2> 		commit{dir=RateLimitedDirectoryWrapper(org.apache.lucene.store.NIOFSDirectory@/usr/home/hudson/hudson-slave/workspace/Lucene-Solr-Tests-4.x-Java6/solr/build/solr-core/test/J1/org.apache.solr.cloud.SyncSliceTest-1358208618814/jetty3/index.20130114191036669 lockFactory=org.apache.lucene.store.NativeFSLockFactory@7fc6ab97),segFN=segments_3,generation=3,filenames=[segments_3]
[junit4:junit4]   2> 		commit{dir=RateLimitedDirectoryWrapper(org.apache.lucene.store.NIOFSDirectory@/usr/home/hudson/hudson-slave/workspace/Lucene-Solr-Tests-4.x-Java6/solr/build/solr-core/test/J1/org.apache.solr.cloud.SyncSliceTest-1358208618814/jetty3/index.20130114191036669 lockFactory=org.apache.lucene.store.NativeFSLockFactory@7fc6ab97),segFN=segments_4,generation=4,filenames=[segments_4]
[junit4:junit4]   2> 17922 T1332 C58 P36610 oasc.SolrDeletionPolicy.updateCommits newest commit = 4[segments_4]
[junit4:junit4]   2> 17922 T1332 C58 P36610 oasc.CachingDirectoryFactory.close Releasing directory:/usr/home/hudson/hudson-slave/workspace/Lucene-Solr-Tests-4.x-Java6/solr/build/solr-core/test/J1/./org.apache.solr.cloud.SyncSliceTest-1358208618814/jetty3
[junit4:junit4]   2> 17923 T1332 C58 P36610 oasu.DirectUpdateHandler2.commit end_commit_flush
[junit4:junit4]   2> 17923 T1332 C58 P36610 oasc.CachingDirectoryFactory.close Releasing directory:/usr/home/hudson/hudson-slave/workspace/Lucene-Solr-Tests-4.x-Java6/solr/build/solr-core/test/J1/./org.apache.solr.cloud.SyncSliceTest-1358208618814/jetty3/index.20130114191036669
[junit4:junit4]   2> 17923 T1332 C58 P36610 oasc.CachingDirectoryFactory.close Releasing directory:/usr/home/hudson/hudson-slave/workspace/Lucene-Solr-Tests-4.x-Java6/solr/build/solr-core/test/J1/./org.apache.solr.cloud.SyncSliceTest-1358208618814/jetty3/index
[junit4:junit4]   2> 17923 T1332 C58 P36610 oasc.RecoveryStrategy.replay No replay needed. core=collection1
[junit4:junit4]   2> 17923 T1332 C58 P36610 oasc.RecoveryStrategy.doRecovery Replication Recovery was successful - registering as Active. core=collection1
[junit4:junit4]   2> 17923 T1332 C58 P36610 oasc.ZkController.publish publishing core=collection1 state=active
[junit4:junit4]   2> 17924 T1332 C58 P36610 oasc.ZkController.publish numShards not found on descriptor - reading it from system property
[junit4:junit4]   2> 17932 T1332 C58 P36610 oasc.RecoveryStrategy.doRecovery Finished recovery process. core=collection1
[junit4:junit4]   2> 18347 T1257 oascc.ZkStateReader.updateClusterState Updating cloud state from ZooKeeper... 
[junit4:junit4]   2> 18774 T1280 oascc.ZkStateReader.updateClusterState Updating cloud state from ZooKeeper... 
[junit4:junit4]   2> 18774 T1280 oasc.Overseer$ClusterStateUpdater.updateState Update state numShards=1 message={
[junit4:junit4]   2> 	  "operation":"state",
[junit4:junit4]   2> 	  "numShards":"1",
[junit4:junit4]   2> 	  "shard":"shard1",
[junit4:junit4]   2> 	  "roles":null,
[junit4:junit4]   2> 	  "state":"recovering",
[junit4:junit4]   2> 	  "core":"collection1",
[junit4:junit4]   2> 	  "collection":"collection1",
[junit4:junit4]   2> 	  "node_name":"127.0.0.1:36614_",
[junit4:junit4]   2> 	  "base_url":"http://127.0.0.1:36614"}
[junit4:junit4]   2> 18803 T1280 oasc.Overseer$ClusterStateUpdater.updateState Update state numShards=1 message={
[junit4:junit4]   2> 	  "operation":"state",
[junit4:junit4]   2> 	  "numShards":"1",
[junit4:junit4]   2> 	  "shard":"shard1",
[junit4:junit4]   2> 	  "roles":null,
[junit4:junit4]   2> 	  "state":"active",
[junit4:junit4]   2> 	  "core":"collection1",
[junit4:junit4]   2> 	  "collection":"collection1",
[junit4:junit4]   2> 	  "node_name":"127.0.0.1:36610_",
[junit4:junit4]   2> 	  "base_url":"http://127.0.0.1:36610"}
[junit4:junit4]   2> 18820 T1329 oascc.ZkStateReader$2.process A cluster state change: WatchedEvent state:SyncConnected type:NodeDataChanged path:/clusterstate.json, has occurred - updating... (live nodes size: 5)
[junit4:junit4]   2> 18820 T1313 oascc.ZkStateReader$2.process A cluster state change: WatchedEvent state:SyncConnected type:NodeDataChanged path:/clusterstate.json, has occurred - updating... (live nodes size: 5)
[junit4:junit4]   2> 18820 T1345 oascc.ZkStateReader$2.process A cluster state change: WatchedEvent state:SyncConnected type:NodeDataChanged path:/clusterstate.json, has occurred - updating... (live nodes size: 5)
[junit4:junit4]   2> 18820 T1279 oascc.ZkStateReader$2.process A cluster state change: WatchedEvent state:SyncConnected type:NodeDataChanged path:/clusterstate.json, has occurred - updating... (live nodes size: 5)
[junit4:junit4]   2> 18820 T1285 oascc.ZkStateReader$2.process A cluster state change: WatchedEvent state:SyncConnected type:NodeDataChanged path:/clusterstate.json, has occurred - updating... (live nodes size: 5)
[junit4:junit4]   2> 18820 T1298 oascc.ZkStateReader$2.process A cluster state change: WatchedEvent state:SyncConnected type:NodeDataChanged path:/clusterstate.json, has occurred - updating... (live nodes size: 5)
[junit4:junit4]   2> 19349 T1257 oascc.ZkStateReader.updateClusterState Updating cloud state from ZooKeeper... 
[junit4:junit4]   2> 20351 T1257 oascc.ZkStateReader.updateClusterState Updating cloud state from ZooKeeper... 
[junit4:junit4]   2>  C60_STATE=coll:collection1 core:collection1 props:{shard=shard1, roles=null, state=recovering, core=collection1, collection=collection1, node_name=127.0.0.1:36614_, base_url=http://127.0.0.1:36614}
[junit4:junit4]   2> 21350 T1350 C60 P36614 oasc.RecoveryStrategy.doRecovery Attempting to PeerSync from http://127.0.0.1:36602/collection1/ core=collection1 - recoveringAfterStartup=true
[junit4:junit4]   2> 21350 T1350 C60 P36614 oasu.PeerSync.sync PeerSync: core=collection1 url=http://127.0.0.1:36614 START replicas=[http://127.0.0.1:36602/collection1/] nUpdates=100
[junit4:junit4]   2> 21351 T1350 C60 P36614 oasu.PeerSync.sync WARNING no frame of reference to tell of we've missed updates
[junit4:junit4]   2> 21351 T1350 C60 P36614 oasc.RecoveryStrategy.doRecovery PeerSync Recovery was not successful - trying replication. core=collection1
[junit4:junit4]   2> 21351 T1350 C60 P36614 oasc.RecoveryStrategy.doRecovery Starting Replication Recovery. core=collection1
[junit4:junit4]   2> 21351 T1350 C60 P36614 oasc.RecoveryStrategy.doRecovery Begin buffering updates. core=collection1
[junit4:junit4]   2> 21351 T1350 C60 P36614 oasu.UpdateLog.bufferUpdates Starting to buffer updates. FSUpdateLog{state=ACTIVE, tlog=null}
[junit4:junit4]   2> 21351 T1350 C60 P36614 oasc.RecoveryStrategy.replicate Attempting to replicate from http://127.0.0.1:36602/collection1/. core=collection1
[junit4:junit4]   2> 21352 T1350 C60 P36614 oascsi.HttpClientUtil.createClient Creating new http client, config:maxConnections=128&maxConnectionsPerHost=32&followRedirects=false
[junit4:junit4]   2> 21353 T1257 oascc.ZkStateReader.updateClusterState Updating cloud state from ZooKeeper... 
[junit4:junit4]   2> 21354 T1290 C59 P36602 REQ /get {getVersions=100&distrib=false&wt=javabin&qt=/get&version=2} status=0 QTime=0 
[junit4:junit4]   2> 21362 T1288 C59 P36602 oasu.DirectUpdateHandler2.commit start commit{,optimize=false,openSearcher=false,waitSearcher=true,expungeDeletes=false,softCommit=false}
[junit4:junit4]   2> 21378 T1288 C59 P36602 oasc.SolrDeletionPolicy.onCommit SolrDeletionPolicy.onCommit: commits:num=3
[junit4:junit4]   2> 		commit{dir=RateLimitedDirectoryWrapper(org.apache.lucene.store.NIOFSDirectory@/usr/home/hudson/hudson-slave/workspace/Lucene-Solr-Tests-4.x-Java6/solr/build/solr-core/test/J1/org.apache.solr.cloud.SyncSliceTest-1358208618814/jetty1/index lockFactory=org.apache.lucene.store.NativeFSLockFactory@5489f951),segFN=segments_2,generation=2,filenames=[segments_2]
[junit4:junit4]   2> 		commit{dir=RateLimitedDirectoryWrapper(org.apache.lucene.store.NIOFSDirectory@/usr/home/hudson/hudson-slave/workspace/Lucene-Solr-Tests-4.x-Java6/solr/build/solr-core/test/J1/org.apache.solr.cloud.SyncSliceTest-1358208618814/jetty1/index lockFactory=org.apache.lucene.store.NativeFSLockFactory@5489f951),segFN=segments_3,generation=3,filenames=[segments_3]
[junit4:junit4]   2> 		commit{dir=RateLimitedDirectoryWrapper(org.apache.lucene.store.NIOFSDirectory@/usr/home/hudson/hudson-slave/workspace/Lucene-Solr-Tests-4.x-Java6/solr/build/solr-core/test/J1/org.apache.solr.cloud.SyncSliceTest-1358208618814/jetty1/index lockFactory=org.apache.lucene.store.NativeFSLockFactory@5489f951),segFN=segments_4,generation=4,filenames=[segments_4]
[junit4:junit4]   2> 21379 T1288 C59 P36602 oasc.SolrDeletionPolicy.updateCommits newest commit = 4[segments_4]
[junit4:junit4]   2> 21380 T1288 C59 P36602 oasc.CachingDirectoryFactory.close Releasing directory:/usr/home/hudson/hudson-slave/workspace/Lucene-Solr-Tests-4.x-Java6/solr/build/solr-core/test/J1/./org.apache.solr.cloud.SyncSliceTest-1358208618814/jetty1
[junit4:junit4]   2> 21380 T1288 C59 P36602 oasu.DirectUpdateHandler2.commit end_commit_flush
[junit4:junit4]   2> 21380 T1288 C59 P36602 /update {waitSearcher=true&openSearcher=false&commit=true&wt=javabin&commit_end_point=true&version=2&softCommit=false} {commit=} 0 18
[junit4:junit4]   2> 21381 T1350 C60 P36614 oash.ReplicationHandler.inform Commits will be reserved for  10000
[junit4:junit4]   2> 21382 T1350 C60 P36614 oash.SnapPuller.<init>  No value set for 'pollInterval'. Timer Task not started.
[junit4:junit4]   2> 21384 T1292 C59 P36602 REQ /replication {command=indexversion&qt=/replication&wt=javabin&version=2} status=0 QTime=0 
[junit4:junit4]   2> 21385 T1350 C60 P36614 oash.SnapPuller.fetchLatestIndex Master's generation: 4
[junit4:junit4]   2> 21386 T1350 C60 P36614 oash.SnapPuller.fetchLatestIndex Slave's generation: 1
[junit4:junit4]   2> 21386 T1350 C60 P36614 oash.SnapPuller.fetchLatestIndex Starting replication process
[junit4:junit4]   2> 21388 T1292 C59 P36602 oasc.CachingDirectoryFactory.close Releasing directory:/usr/home/hudson/hudson-slave/workspace/Lucene-Solr-Tests-4.x-Java6/solr/build/solr-core/test/J1/./org.apache.solr.cloud.SyncSliceTest-1358208618814/jetty1
[junit4:junit4]   2> 21389 T1292 C59 P36602 oasc.CachingDirectoryFactory.close Releasing directory:/usr/home/hudson/hudson-slave/workspace/Lucene-Solr-Tests-4.x-Java6/solr/build/solr-core/test/J1/./org.apache.solr.cloud.SyncSliceTest-1358208618814/jetty1/index
[junit4:junit4]   2> 21390 T1292 C59 P36602 REQ /replication {command=filelist&qt=/replication&wt=javabin&generation=4&version=2} status=0 QTime=2 
[junit4:junit4]   2> 21390 T1350 C60 P36614 oash.SnapPuller.fetchLatestIndex Number of files in latest index in master: 1
[junit4:junit4]   2> 21405 T1350 C60 P36614 oasc.CachingDirectoryFactory.get return new directory for /usr/home/hudson/hudson-slave/workspace/Lucene-Solr-Tests-4.x-Java6/solr/build/solr-core/test/J1/./org.apache.solr.cloud.SyncSliceTest-1358208618814/jetty4/index.20130114191040202 forceNew:false
[junit4:junit4]   2> 21405 T1350 C60 P36614 oasc.CachingDirectoryFactory.close Releasing directory:/usr/home/hudson/hudson-slave/workspace/Lucene-Solr-Tests-4.x-Java6/solr/build/solr-core/test/J1/./org.apache.solr.cloud.SyncSliceTest-1358208618814/jetty4
[junit4:junit4]   2> 21406 T1350 C60 P36614 oash.SnapPuller.fetchLatestIndex Starting download to RateLimitedDirectoryWrapper(org.apache.lucene.store.NIOFSDirectory@/usr/home/hudson/hudson-slave/workspace/Lucene-Solr-Tests-4.x-Java6/solr/build/solr-core/test/J1/org.apache.solr.cloud.SyncSliceTest-1358208618814/jetty4/index.20130114191040202 lockFactory=org.apache.lucene.store.NativeFSLockFactory@64c88cb) fullCopy=true
[junit4:junit4]   2> 21409 T1292 C59 P36602 REQ /replication {file=segments_4&command=filecontent&checksum=true&wt=filestream&qt=/replication&generation=4} status=0 QTime=0 
[junit4:junit4]   2> 21411 T1350 C60 P36614 oasc.CachingDirectoryFactory.close Releasing directory:/usr/home/hudson/hudson-slave/workspace/Lucene-Solr-Tests-4.x-Java6/solr/build/solr-core/test/J1/./org.apache.solr.cloud.SyncSliceTest-1358208618814/jetty4/index
[junit4:junit4]   2> 21411 T1350 C60 P36614 oash.SnapPuller.fetchLatestIndex Total time taken for download : 0 secs
[junit4:junit4]   2> 21412 T1350 C60 P36614 oash.SnapPuller.modifyIndexProps New index installed. Updating index properties... index=index.20130114191040202
[junit4:junit4]   2> 21413 T1350 C60 P36614 oasc.CachingDirectoryFactory.close Releasing directory:/usr/home/hudson/hudson-slave/workspace/Lucene-Solr-Tests-4.x-Java6/solr/build/solr-core/test/J1/./org.apache.solr.cloud.SyncSliceTest-1358208618814/jetty4
[junit4:junit4]   2> 21413 T1350 C60 P36614 oasc.CachingDirectoryFactory.close Releasing directory:/usr/home/hudson/hudson-slave/workspace/Lucene-Solr-Tests-4.x-Java6/solr/build/solr-core/test/J1/./org.apache.solr.cloud.SyncSliceTest-1358208618814/jetty4
[junit4:junit4]   2> 21413 T1350 C60 P36614 oasc.SolrCore.getNewIndexDir New index directory detected: old=./org.apache.solr.cloud.SyncSliceTest-1358208618814/jetty4/index/ new=./org.apache.solr.cloud.SyncSliceTest-1358208618814/jetty4/index.20130114191040202
[junit4:junit4]   2> 21416 T1350 C60 P36614 oasc.SolrDeletionPolicy.onInit SolrDeletionPolicy.onInit: commits:num=1
[junit4:junit4]   2> 		commit{dir=RateLimitedDirectoryWrapper(org.apache.lucene.store.NIOFSDirectory@/usr/home/hudson/hudson-slave/workspace/Lucene-Solr-Tests-4.x-Java6/solr/build/solr-core/test/J1/org.apache.solr.cloud.SyncSliceTest-1358208618814/jetty4/index.20130114191040202 lockFactory=org.apache.lucene.store.NativeFSLockFactory@64c88cb),segFN=segments_4,generation=4,filenames=[segments_4]
[junit4:junit4]   2> 21416 T1350 C60 P36614 oasc.SolrDeletionPolicy.updateCommits newest commit = 4[segments_4]
[junit4:junit4]   2> 21417 T1350 C60 P36614 oasc.CachingDirectoryFactory.close Releasing directory:/usr/home/hudson/hudson-slave/workspace/Lucene-Solr-Tests-4.x-Java6/solr/build/solr-core/test/J1/./org.apache.solr.cloud.SyncSliceTest-1358208618814/jetty4
[junit4:junit4]   2> 21417 T1350 C60 P36614 oasu.DefaultSolrCoreState.newIndexWriter Creating new IndexWriter...
[junit4:junit4]   2> 21417 T1350 C60 P36614 oasu.DefaultSolrCoreState.newIndexWriter Waiting until IndexWriter is unused... core=collection1
[junit4:junit4]   2> 21417 T1350 C60 P36614 oasu.DefaultSolrCoreState.newIndexWriter Rollback old IndexWriter... core=collection1
[junit4:junit4]   2> 21418 T1350 C60 P36614 oasc.CachingDirectoryFactory.close Releasing directory:/usr/home/hudson/hudson-slave/workspace/Lucene-Solr-Tests-4.x-Java6/solr/build/solr-core/test/J1/./org.apache.solr.cloud.SyncSliceTest-1358208618814/jetty4/index.20130114191040202
[junit4:junit4]   2> 21418 T1350 C60 P36614 oasc.CachingDirectoryFactory.close Releasing directory:/usr/home/hudson/hudson-slave/workspace/Lucene-Solr-Tests-4.x-Java6/solr/build/solr-core/test/J1/./org.apache.solr.cloud.SyncSliceTest-1358208618814/jetty4
[junit4:junit4]   2> 21420 T1350 C60 P36614 oasc.SolrDeletionPolicy.onInit SolrDeletionPolicy.onInit: commits:num=1
[junit4:junit4]   2> 		commit{dir=RateLimitedDirectoryWrapper(org.apache.lucene.store.NIOFSDirectory@/usr/home/hudson/hudson-slave/workspace/Lucene-Solr-Tests-4.x-Java6/solr/build/solr-core/test/J1/org.apache.solr.cloud.SyncSliceTest-1358208618814/jetty4/index.20130114191040202 lockFactory=org.apache.lucene.store.NativeFSLockFactory@64c88cb),segFN=segments_4,generation=4,filenames=[segments_4]
[junit4:junit4]   2> 21421 T1350 C60 P36614 oasc.SolrDeletionPolicy.updateCommits newest commit = 4[segments_4]
[junit4:junit4]   2> 21421 T1350 C60 P36614 oasu.DefaultSolrCoreState.newIndexWriter New IndexWriter is ready to be used.
[junit4:junit4]   2> 21421 T1350 C60 P36614 oasc.CachingDirectoryFactory.close Releasing directory:/usr/home/hudson/hudson-slave/workspace/Lucene-Solr-Tests-4.x-Java6/solr/build/solr-core/test/J1/./org.apache.solr.cloud.SyncSliceTest-1358208618814/jetty4
[junit4:junit4]   2> 21421 T1350 C60 P36614 oass.SolrIndexSearcher.<init> Opening Searcher@6dcaf16 main
[junit4:junit4]   2> 21423 T1349 oasc.SolrCore.registerSearcher [collection1] Registered new searcher Searcher@6dcaf16 main{StandardDirectoryReader(segments_4:1:nrt)}
[junit4:junit4]   2> 21423 T1349 oasc.CachingDirectoryFactory.close Releasing directory:/usr/home/hudson/hudson-slave/workspace/Lucene-Solr-Tests-4.x-Java6/solr/build/solr-core/test/J1/./org.apache.solr.cloud.SyncSliceTest-1358208618814/jetty4/index
[junit4:junit4]   2> 21424 T1350 C60 P36614 oasu.DirectUpdateHandler2.commit start commit{,optimize=false,openSearcher=false,waitSearcher=false,expungeDeletes=false,softCommit=false}
[junit4:junit4]   2> 21425 T1350 C60 P36614 oasc.SolrDeletionPolicy.onCommit SolrDeletionPolicy.onCommit: commits:num=2
[junit4:junit4]   2> 		commit{dir=RateLimitedDirectoryWrapper(org.apache.lucene.store.NIOFSDirectory@/usr/home/hudson/hudson-slave/workspace/Lucene-Solr-Tests-4.x-Java6/solr/build/solr-core/test/J1/org.apache.solr.cloud.SyncSliceTest-1358208618814/jetty4/index.20130114191040202 lockFactory=org.apache.lucene.store.NativeFSLockFactory@64c88cb),segFN=segments_4,generation=4,filenames=[segments_4]
[junit4:junit4]   2> 		commit{dir=RateLimitedDirectoryWrapper(org.apache.lucene.store.NIOF

[...truncated too long message...]

.x-Java6/solr/build/solr-core/test/J1/./org.apache.solr.cloud.SyncSliceTest-1358208618814/jetty4/index
[junit4:junit4]   2> 147583 T1257 oasc.CachingDirectoryFactory.close Closing directory when closing factory:/usr/home/hudson/hudson-slave/workspace/Lucene-Solr-Tests-4.x-Java6/solr/build/solr-core/test/J1/./org.apache.solr.cloud.SyncSliceTest-1358208618814/jetty4
[junit4:junit4]   2> 147583 T1257 oasc.CachingDirectoryFactory.closeDirectory Closing directory:/usr/home/hudson/hudson-slave/workspace/Lucene-Solr-Tests-4.x-Java6/solr/build/solr-core/test/J1/./org.apache.solr.cloud.SyncSliceTest-1358208618814/jetty4
[junit4:junit4]   2> 166581 T1345 oaz.ClientCnxn$EventThread.run EventThread shut down
[junit4:junit4]   2> 166581 T1257 oaz.ZooKeeper.close Session: 0x13c3b8ad145000c closed
[junit4:junit4]   2> 166583 T1257 oejsh.ContextHandler.doStop stopped o.e.j.s.ServletContextHandler{/,null}
[junit4:junit4]   2> 166822 T1257 oas.SolrTestCaseJ4.tearDown ###Ending testDistribSearch
[junit4:junit4]   1> client port:0.0.0.0/0.0.0.0:0
[junit4:junit4]   2> NOTE: reproduce with: ant test  -Dtestcase=SyncSliceTest -Dtests.method=testDistribSearch -Dtests.seed=408ACDF6F69A1ACC -Dtests.multiplier=3 -Dtests.slow=true -Dtests.locale=hu -Dtests.timezone=America/Kentucky/Louisville -Dtests.file.encoding=ISO-8859-1
[junit4:junit4] FAILURE  167s J1 | SyncSliceTest.testDistribSearch <<<
[junit4:junit4]    > Throwable #1: java.lang.AssertionError: shard1 should have just been set up to be inconsistent - but it's still consistent
[junit4:junit4]    > 	at __randomizedtesting.SeedInfo.seed([408ACDF6F69A1ACC:C16C43EE81C57AF0]:0)
[junit4:junit4]    > 	at org.junit.Assert.fail(Assert.java:93)
[junit4:junit4]    > 	at org.junit.Assert.assertTrue(Assert.java:43)
[junit4:junit4]    > 	at org.junit.Assert.assertNotNull(Assert.java:526)
[junit4:junit4]    > 	at org.apache.solr.cloud.SyncSliceTest.doTest(SyncSliceTest.java:214)
[junit4:junit4]    > 	at org.apache.solr.BaseDistributedSearchTestCase.testDistribSearch(BaseDistributedSearchTestCase.java:794)
[junit4:junit4]    > 	at sun.reflect.NativeMethodAccessorImpl.invoke0(Native Method)
[junit4:junit4]    > 	at sun.reflect.NativeMethodAccessorImpl.invoke(NativeMethodAccessorImpl.java:57)
[junit4:junit4]    > 	at sun.reflect.DelegatingMethodAccessorImpl.invoke(DelegatingMethodAccessorImpl.java:43)
[junit4:junit4]    > 	at java.lang.reflect.Method.invoke(Method.java:616)
[junit4:junit4]    > 	at com.carrotsearch.randomizedtesting.RandomizedRunner.invoke(RandomizedRunner.java:1559)
[junit4:junit4]    > 	at com.carrotsearch.randomizedtesting.RandomizedRunner.access$600(RandomizedRunner.java:79)
[junit4:junit4]    > 	at com.carrotsearch.randomizedtesting.RandomizedRunner$6.evaluate(RandomizedRunner.java:737)
[junit4:junit4]    > 	at com.carrotsearch.randomizedtesting.RandomizedRunner$7.evaluate(RandomizedRunner.java:773)
[junit4:junit4]    > 	at com.carrotsearch.randomizedtesting.RandomizedRunner$8.evaluate(RandomizedRunner.java:787)
[junit4:junit4]    > 	at com.carrotsearch.randomizedtesting.rules.SystemPropertiesRestoreRule$1.evaluate(SystemPropertiesRestoreRule.java:53)
[junit4:junit4]    > 	at org.apache.lucene.util.TestRuleSetupTeardownChained$1.evaluate(TestRuleSetupTeardownChained.java:50)
[junit4:junit4]    > 	at org.apache.lucene.util.TestRuleFieldCacheSanity$1.evaluate(TestRuleFieldCacheSanity.java:51)
[junit4:junit4]    > 	at org.apache.lucene.util.AbstractBeforeAfterRule$1.evaluate(AbstractBeforeAfterRule.java:46)
[junit4:junit4]    > 	at com.carrotsearch.randomizedtesting.rules.SystemPropertiesInvariantRule$1.evaluate(SystemPropertiesInvariantRule.java:55)
[junit4:junit4]    > 	at org.apache.lucene.util.TestRuleThreadAndTestName$1.evaluate(TestRuleThreadAndTestName.java:49)
[junit4:junit4]    > 	at org.apache.lucene.util.TestRuleIgnoreAfterMaxFailures$1.evaluate(TestRuleIgnoreAfterMaxFailures.java:70)
[junit4:junit4]    > 	at org.apache.lucene.util.TestRuleMarkFailure$1.evaluate(TestRuleMarkFailure.java:48)
[junit4:junit4]    > 	at com.carrotsearch.randomizedtesting.rules.StatementAdapter.evaluate(StatementAdapter.java:36)
[junit4:junit4]    > 	at com.carrotsearch.randomizedtesting.ThreadLeakControl$StatementRunner.run(ThreadLeakControl.java:358)
[junit4:junit4]    > 	at com.carrotsearch.randomizedtesting.ThreadLeakControl.forkTimeoutingTask(ThreadLeakControl.java:782)
[junit4:junit4]    > 	at com.carrotsearch.randomizedtesting.ThreadLeakControl$3.evaluate(ThreadLeakControl.java:442)
[junit4:junit4]    > 	at com.carrotsearch.randomizedtesting.RandomizedRunner.runSingleTest(RandomizedRunner.java:746)
[junit4:junit4]    > 	at com.carrotsearch.randomizedtesting.RandomizedRunner$3.evaluate(RandomizedRunner.java:648)
[junit4:junit4]    > 	at com.carrotsearch.randomizedtesting.RandomizedRunner$4.evaluate(RandomizedRunner.java:682)
[junit4:junit4]    > 	at com.carrotsearch.randomizedtesting.RandomizedRunner$5.evaluate(RandomizedRunner.java:693)
[junit4:junit4]    > 	at com.carrotsearch.randomizedtesting.rules.StatementAdapter.evaluate(StatementAdapter.java:36)
[junit4:junit4]    > 	at com.carrotsearch.randomizedtesting.rules.SystemPropertiesRestoreRule$1.evaluate(SystemPropertiesRestoreRule.java:53)
[junit4:junit4]    > 	at org.apache.lucene.util.AbstractBeforeAfterRule$1.evaluate(AbstractBeforeAfterRule.java:46)
[junit4:junit4]    > 	at org.apache.lucene.util.TestRuleStoreClassName$1.evaluate(TestRuleStoreClassName.java:42)
[junit4:junit4]    > 	at com.carrotsearch.randomizedtesting.rules.SystemPropertiesInvariantRule$1.evaluate(SystemPropertiesInvariantRule.java:55)
[junit4:junit4]    > 	at com.carrotsearch.randomizedtesting.rules.NoShadowingOrOverridesOnMethodsRule$1.evaluate(NoShadowingOrOverridesOnMethodsRule.java:39)
[junit4:junit4]    > 	at com.carrotsearch.randomizedtesting.rules.NoShadowingOrOverridesOnMethodsRule$1.evaluate(NoShadowingOrOverridesOnMethodsRule.java:39)
[junit4:junit4]    > 	at com.carrotsearch.randomizedtesting.rules.StatementAdapter.evaluate(StatementAdapter.java:36)
[junit4:junit4]    > 	at org.apache.lucene.util.TestRuleAssertionsRequired$1.evaluate(TestRuleAssertionsRequired.java:43)
[junit4:junit4]    > 	at org.apache.lucene.util.TestRuleMarkFailure$1.evaluate(TestRuleMarkFailure.java:48)
[junit4:junit4]    > 	at org.apache.lucene.util.TestRuleIgnoreAfterMaxFailures$1.evaluate(TestRuleIgnoreAfterMaxFailures.java:70)
[junit4:junit4]    > 	at org.apache.lucene.util.TestRuleIgnoreTestSuites$1.evaluate(TestRuleIgnoreTestSuites.java:55)
[junit4:junit4]    > 	at com.carrotsearch.randomizedtesting.rules.StatementAdapter.evaluate(StatementAdapter.java:36)
[junit4:junit4]    > 	at com.carrotsearch.randomizedtesting.ThreadLeakControl$StatementRunner.run(ThreadLeakControl.java:358)
[junit4:junit4]    > 	at java.lang.Thread.run(Thread.java:679)
[junit4:junit4]   2> 166837 T1257 oas.SolrTestCaseJ4.deleteCore ###deleteCore
[junit4:junit4]   2> NOTE: test params are: codec=Lucene41: {range_facet_l=MockVariableIntBlock(baseBlockSize=36), text=Pulsing41(freqCutoff=9 minBlockSize=73 maxBlockSize=222), _version_=MockVariableIntBlock(baseBlockSize=36), rnd_b=PostingsFormat(name=Asserting), intDefault=MockVariableIntBlock(baseBlockSize=36), id=PostingsFormat(name=Asserting), timestamp=MockVariableIntBlock(baseBlockSize=36), a_t=MockVariableIntBlock(baseBlockSize=36), range_facet_sl=Pulsing41(freqCutoff=9 minBlockSize=73 maxBlockSize=222), range_facet_si=PostingsFormat(name=Memory doPackFST= true), other_tl1=MockVariableIntBlock(baseBlockSize=36), multiDefault=PostingsFormat(name=Memory doPackFST= true), a_si=PostingsFormat(name=Memory doPackFST= true)}, sim=DefaultSimilarity, locale=hu, timezone=America/Kentucky/Louisville
[junit4:junit4]   2> NOTE: FreeBSD 9.0-RELEASE amd64/Sun Microsystems Inc. 1.6.0_32 (64-bit)/cpus=16,threads=2,free=79194016,total=477626368
[junit4:junit4]   2> NOTE: All tests run in this JVM: [OverseerTest, RequiredFieldsTest, TestSolrCoreProperties, TestRealTimeGet, BasicDistributedZk2Test, TestValueSourceCache, UpdateParamsTest, TestTrie, BasicFunctionalityTest, TestQueryUtils, OutputWriterTest, TestSolrDeletionPolicy2, PrimitiveFieldTypeTest, StatelessScriptUpdateProcessorFactoryTest, SolrInfoMBeanTest, TestAnalyzedSuggestions, XsltUpdateRequestHandlerTest, TestStressRecovery, TestCharFilters, TestLRUCache, TestStressLucene, TestSolrJ, TestQuerySenderListener, DebugComponentTest, TestSolrDeletionPolicy1, TestCSVLoader, SolrIndexConfigTest, BasicZkTest, TestDocSet, ShardRoutingTest, TestOmitPositions, SchemaVersionSpecificBehaviorTest, TestPluginEnable, BadIndexSchemaTest, HighlighterTest, TestReversedWildcardFilterFactory, ZkNodePropsTest, EchoParamsTest, TestRTGBase, TestRecovery, UUIDFieldTest, PolyFieldTest, IndexSchemaRuntimeFieldTest, SyncSliceTest]
[junit4:junit4] Completed on J1 in 166.86s, 1 test, 1 failure <<< FAILURES!

[...truncated 605 lines...]
BUILD FAILED
/usr/home/hudson/hudson-slave/workspace/Lucene-Solr-Tests-4.x-Java6/build.xml:344: The following error occurred while executing this line:
/usr/home/hudson/hudson-slave/workspace/Lucene-Solr-Tests-4.x-Java6/build.xml:39: The following error occurred while executing this line:
/usr/home/hudson/hudson-slave/workspace/Lucene-Solr-Tests-4.x-Java6/solr/build.xml:178: The following error occurred while executing this line:
/usr/home/hudson/hudson-slave/workspace/Lucene-Solr-Tests-4.x-Java6/solr/common-build.xml:428: The following error occurred while executing this line:
/usr/home/hudson/hudson-slave/workspace/Lucene-Solr-Tests-4.x-Java6/lucene/common-build.xml:1176: The following error occurred while executing this line:
/usr/home/hudson/hudson-slave/workspace/Lucene-Solr-Tests-4.x-Java6/lucene/common-build.xml:841: There were test failures: 247 suites, 1032 tests, 1 failure, 23 ignored (5 assumptions)

Total time: 41 minutes 51 seconds
Build step 'Invoke Ant' marked build as failure
Archiving artifacts
Recording test results
Email was triggered for: Failure
Sending email for trigger: Failure