You are viewing a plain text version of this content. The canonical link for it is here.
Posted to dev@zookeeper.apache.org by Apache Jenkins Server <je...@builds.apache.org> on 2016/04/11 14:16:46 UTC

ZooKeeper_branch35_jdk8 - Build # 46 - Still Failing

See https://builds.apache.org/job/ZooKeeper_branch35_jdk8/46/

###################################################################################
########################## LAST 60 LINES OF THE CONSOLE ###########################
[...truncated 387821 lines...]
     [exec] Log Message Received: [2016-04-11 12:14:31,888:9612(0x2b7f3ca5d540):ZOO_INFO@testLogCallbackInit@993: testLogCallbackInit #8]
     [exec] Log Message Received: [2016-04-11 12:14:31,888:9612(0x2b7f3ca5d540):ZOO_INFO@testLogCallbackInit@993: testLogCallbackInit #9]
     [exec] Log Message Received: [2016-04-11 12:14:31,890:9612(0x2b7f3ca5d540):ZOO_INFO@zookeeper_close@3257: Closing zookeeper sessionId=0x102149a17da000e to [127.0.0.1:22181]
     [exec] ]
     [exec]  : elapsed 1003 : OK
     [exec] Zookeeper_simpleSystem::testLogCallbackClearLog Message Received: [2016-04-11 12:14:31,890:9612(0x2b7f3ca5d540):ZOO_INFO@log_env@1027: Client environment:zookeeper.version=zookeeper C client 3.5.1]
     [exec] Log Message Received: [2016-04-11 12:14:31,890:9612(0x2b7f3ca5d540):ZOO_INFO@log_env@1031: Client environment:host.name=asf910.gq1.ygridcore.net]
     [exec] Log Message Received: [2016-04-11 12:14:31,890:9612(0x2b7f3ca5d540):ZOO_INFO@log_env@1038: Client environment:os.name=Linux]
     [exec] Log Message Received: [2016-04-11 12:14:31,890:9612(0x2b7f3ca5d540):ZOO_INFO@log_env@1039: Client environment:os.arch=3.13.0-36-lowlatency]
     [exec] Log Message Received: [2016-04-11 12:14:31,890:9612(0x2b7f3ca5d540):ZOO_INFO@log_env@1040: Client environment:os.version=#63-Ubuntu SMP PREEMPT Wed Sep 3 21:56:12 UTC 2014]
     [exec] Log Message Received: [2016-04-11 12:14:31,890:9612(0x2b7f3ca5d540):ZOO_INFO@log_env@1048: Client environment:user.name=jenkins]
     [exec] Log Message Received: [2016-04-11 12:14:31,890:9612(0x2b7f3ca5d540):ZOO_INFO@log_env@1056: Client environment:user.home=/home/jenkins]
     [exec] Log Message Received: [2016-04-11 12:14:31,890:9612(0x2b7f3ca5d540):ZOO_INFO@log_env@1068: Client environment:user.dir=/home/jenkins/jenkins-slave/workspace/ZooKeeper_branch35_jdk8/branch-3.5/build/test/test-cppunit]
     [exec] Log Message Received: [2016-04-11 12:14:31,890:9612(0x2b7f3ca5d540):ZOO_INFO@zookeeper_init_internal@1111: Initiating client connection, host=127.0.0.1:22181 sessionTimeout=10000 watcher=0x45d2a0 sessionId=0 sessionPasswd=<null> context=0x7fff65e27df0 flags=0]
     [exec] Log Message Received: [2016-04-11 12:14:31,891:9612(0x2b7f3f0ec700):ZOO_INFO@check_events@2357: initiated connection to server [127.0.0.1:22181]]
     [exec] Log Message Received: [2016-04-11 12:14:32,121:9612(0x2b7f3f0ec700):ZOO_INFO@check_events@2409: session establishment complete on server [127.0.0.1:22181], sessionId=0x102149a17da000f, negotiated timeout=10000 ]
     [exec]  : elapsed 1002 : OK
     [exec] Zookeeper_simpleSystem::testAsyncWatcherAutoReset ZooKeeper server started : elapsed 10086 : OK
     [exec] Zookeeper_simpleSystem::testDeserializeString : elapsed 0 : OK
     [exec] Zookeeper_simpleSystem::testFirstServerDown : elapsed 1001 : OK
     [exec] Zookeeper_simpleSystem::testNullData : elapsed 1070 : OK
     [exec] Zookeeper_simpleSystem::testIPV6 : elapsed 1011 : OK
     [exec] Zookeeper_simpleSystem::testCreate : elapsed 1037 : OK
     [exec] Zookeeper_simpleSystem::testPath : elapsed 1065 : OK
     [exec] Zookeeper_simpleSystem::testPathValidation : elapsed 1225 : OK
     [exec] Zookeeper_simpleSystem::testPing : elapsed 18375 : OK
     [exec] Zookeeper_simpleSystem::testAcl : elapsed 1366 : OK
     [exec] Zookeeper_simpleSystem::testChroot : elapsed 3121 : OK
     [exec] Zookeeper_simpleSystem::testAuth ZooKeeper server started ZooKeeper server started : elapsed 34566 : OK
     [exec] Zookeeper_simpleSystem::testHangingClient : elapsed 1052 : OK
     [exec] Zookeeper_simpleSystem::testWatcherAutoResetWithGlobal ZooKeeper server started ZooKeeper server started ZooKeeper server started : elapsed 18305 : OK
     [exec] Zookeeper_simpleSystem::testWatcherAutoResetWithLocal ZooKeeper server started ZooKeeper server started ZooKeeper server started : elapsed 20976 : OK
     [exec] Zookeeper_simpleSystem::testGetChildren2 : elapsed 1279 : OK
     [exec] Zookeeper_simpleSystem::testLastZxid : elapsed 4536 : OK
     [exec] Zookeeper_simpleSystem::testRemoveWatchers ZooKeeper server started : elapsed 5961 : OK
     [exec] Zookeeper_readOnly::testReadOnly : elapsed 4580 : OK
     [exec] /home/jenkins/jenkins-slave/workspace/ZooKeeper_branch35_jdk8/branch-3.5/src/c/tests/TestReconfig.cc:183: Assertion: equality assertion failed [Expected: 1, Actual  : 0]
     [exec] Failures !!!
     [exec] Run: 72   Failure total: 1   Failures: 1   Errors: 0
     [exec] FAIL: zktest-mt
     [exec] ==========================================
     [exec] 1 of 2 tests failed
     [exec] Please report to user@zookeeper.apache.org
     [exec] ==========================================
     [exec] make[1]: Leaving directory `/home/jenkins/jenkins-slave/workspace/ZooKeeper_branch35_jdk8/branch-3.5/build/test/test-cppunit'
     [exec] make[1]: *** [check-TESTS] Error 1
     [exec] make: *** [check-am] Error 2

BUILD FAILED
/home/jenkins/jenkins-slave/workspace/ZooKeeper_branch35_jdk8/branch-3.5/build.xml:1322: The following error occurred while executing this line:
/home/jenkins/jenkins-slave/workspace/ZooKeeper_branch35_jdk8/branch-3.5/build.xml:1282: The following error occurred while executing this line:
/home/jenkins/jenkins-slave/workspace/ZooKeeper_branch35_jdk8/branch-3.5/build.xml:1292: exec returned: 2

Total time: 20 minutes 49 seconds
Build step 'Invoke Ant' marked build as failure
Archiving artifacts
Recording test results
Email was triggered for: Failure - Any
Sending email for trigger: Failure - Any



###################################################################################
############################## FAILED TESTS (if any) ##############################
All tests passed