You are viewing a plain text version of this content. The canonical link for it is here.
Posted to dev@activemq.apache.org by Apache Jenkins Server <je...@builds.apache.org> on 2013/08/01 14:38:37 UTC
Jenkins build is still unstable: ActiveMQ-Java7 » ActiveMQ :: MQTT Protocol #260
See <https://builds.apache.org/job/ActiveMQ-Java7/org.apache.activemq$activemq-mqtt/260/>
Build failed in Jenkins: ActiveMQ-Java7 » ActiveMQ :: MQTT Protocol #265
Posted by Apache Jenkins Server <je...@builds.apache.org>.
See <https://builds.apache.org/job/ActiveMQ-Java7/org.apache.activemq$activemq-mqtt/265/>
------------------------------------------
Aug 08, 2013 2:05:09 PM org.apache.maven.cli.event.ExecutionEventLogger projectSkipped
INFO:
Aug 08, 2013 2:05:09 PM org.apache.maven.cli.event.ExecutionEventLogger projectSkipped
INFO: ------------------------------------------------------------------------
Aug 08, 2013 2:05:09 PM org.apache.maven.cli.event.ExecutionEventLogger projectSkipped
INFO: Skipping ActiveMQ :: STOMP Protocol
Aug 08, 2013 2:05:09 PM org.apache.maven.cli.event.ExecutionEventLogger projectSkipped
INFO: This project has been banned from the build due to previous failures.
Aug 08, 2013 2:05:09 PM org.apache.maven.cli.event.ExecutionEventLogger projectSkipped
INFO: ------------------------------------------------------------------------
Aug 08, 2013 2:05:09 PM org.apache.maven.cli.event.ExecutionEventLogger projectStarted
INFO:
Aug 08, 2013 2:05:09 PM org.apache.maven.cli.event.ExecutionEventLogger projectStarted
INFO: ------------------------------------------------------------------------
Aug 08, 2013 2:05:09 PM org.apache.maven.cli.event.ExecutionEventLogger projectStarted
INFO: Building ActiveMQ :: MQTT Protocol 5.9-SNAPSHOT
Aug 08, 2013 2:05:09 PM org.apache.maven.cli.event.ExecutionEventLogger projectStarted
INFO: ------------------------------------------------------------------------
Downloading: http://repo.maven.apache.org/maven2/org/eclipse/jetty/maven-jetty-plugin/7.6.9.v20130131/maven-jetty-plugin-7.6.9.v20130131.pom
[WARNING] The POM for org.eclipse.jetty:maven-jetty-plugin:jar:7.6.9.v20130131 is missing, no dependency information available
[WARNING] Failed to retrieve plugin descriptor for org.eclipse.jetty:maven-jetty-plugin:7.6.9.v20130131: Plugin org.eclipse.jetty:maven-jetty-plugin:7.6.9.v20130131 or one of its dependencies could not be resolved: Failed to read artifact descriptor for org.eclipse.jetty:maven-jetty-plugin:jar:7.6.9.v20130131
Aug 08, 2013 2:05:10 PM org.apache.maven.cli.event.ExecutionEventLogger mojoStarted
INFO:
Aug 08, 2013 2:05:10 PM org.apache.maven.cli.event.ExecutionEventLogger mojoStarted
INFO: --- maven-clean-plugin:2.5:clean (default-clean) @ activemq-mqtt ---
Aug 08, 2013 2:05:10 PM org.apache.maven.cli.event.ExecutionEventLogger mojoStarted
INFO:
Aug 08, 2013 2:05:10 PM org.apache.maven.cli.event.ExecutionEventLogger mojoStarted
INFO: --- maven-enforcer-plugin:1.0.1:enforce (default) @ activemq-mqtt ---
Aug 08, 2013 2:05:10 PM org.apache.maven.cli.event.ExecutionEventLogger mojoStarted
INFO:
Aug 08, 2013 2:05:10 PM org.apache.maven.cli.event.ExecutionEventLogger mojoStarted
INFO: --- maven-bundle-plugin:2.3.7:cleanVersions (cleanVersions) @ activemq-mqtt ---
Aug 08, 2013 2:05:10 PM org.apache.maven.cli.event.ExecutionEventLogger mojoStarted
INFO:
Aug 08, 2013 2:05:10 PM org.apache.maven.cli.event.ExecutionEventLogger mojoStarted
INFO: --- activemq-protobuf:1.1:compile (default) @ activemq-mqtt ---
[WARNING] No proto files found in directory: <https://builds.apache.org/job/ActiveMQ-Java7/org.apache.activemq$activemq-mqtt/ws/src/main/proto>
Aug 08, 2013 2:05:10 PM org.apache.maven.cli.event.ExecutionEventLogger mojoStarted
INFO:
Aug 08, 2013 2:05:10 PM org.apache.maven.cli.event.ExecutionEventLogger mojoStarted
INFO: --- maven-remote-resources-plugin:1.3:process (default) @ activemq-mqtt ---
Aug 08, 2013 2:05:11 PM org.apache.maven.cli.event.ExecutionEventLogger mojoStarted
INFO:
Aug 08, 2013 2:05:11 PM org.apache.maven.cli.event.ExecutionEventLogger mojoStarted
INFO: --- maven-resources-plugin:2.5:resources (default-resources) @ activemq-mqtt ---
[debug] execute contextualize
[INFO] Using 'UTF-8' encoding to copy filtered resources.
[INFO] Copying 5 resources
[INFO] skip non existing resourceDirectory <https://builds.apache.org/job/ActiveMQ-Java7/org.apache.activemq$activemq-mqtt/ws/src/main/filtered-resources>
[INFO] Copying 3 resources
Aug 08, 2013 2:05:11 PM org.apache.maven.cli.event.ExecutionEventLogger mojoStarted
INFO:
Aug 08, 2013 2:05:11 PM org.apache.maven.cli.event.ExecutionEventLogger mojoStarted
INFO: --- maven-compiler-plugin:2.5.1:compile (default-compile) @ activemq-mqtt ---
[INFO] Compiling 16 source files to <https://builds.apache.org/job/ActiveMQ-Java7/org.apache.activemq$activemq-mqtt/ws/target/classes>
Aug 08, 2013 2:05:11 PM org.apache.maven.cli.event.ExecutionEventLogger mojoStarted
INFO:
Aug 08, 2013 2:05:11 PM org.apache.maven.cli.event.ExecutionEventLogger mojoStarted
INFO: --- maven-resources-plugin:2.5:testResources (default-testResources) @ activemq-mqtt ---
[debug] execute contextualize
[INFO] Using 'UTF-8' encoding to copy filtered resources.
[INFO] Copying 3 resources
[INFO] Copying 3 resources
Aug 08, 2013 2:05:11 PM org.apache.maven.cli.event.ExecutionEventLogger mojoStarted
INFO:
Aug 08, 2013 2:05:11 PM org.apache.maven.cli.event.ExecutionEventLogger mojoStarted
INFO: --- maven-compiler-plugin:2.5.1:testCompile (default-testCompile) @ activemq-mqtt ---
[INFO] Compiling 6 source files to <https://builds.apache.org/job/ActiveMQ-Java7/org.apache.activemq$activemq-mqtt/ws/target/test-classes>
Aug 08, 2013 2:05:11 PM org.apache.maven.cli.event.ExecutionEventLogger mojoStarted
INFO:
Aug 08, 2013 2:05:11 PM org.apache.maven.cli.event.ExecutionEventLogger mojoStarted
INFO: --- maven-surefire-plugin:2.10:test (default-test) @ activemq-mqtt ---
[INFO] Surefire report directory: <https://builds.apache.org/job/ActiveMQ-Java7/org.apache.activemq$activemq-mqtt/ws/target/surefire-reports>
-------------------------------------------------------
T E S T S
-------------------------------------------------------
-------------------------------------------------------
T E S T S
-------------------------------------------------------
Running org.apache.activemq.transport.mqtt.MQTTNioTest
Tests run: 18, Failures: 0, Errors: 1, Skipped: 0, Time elapsed: 153.475 sec <<< FAILURE!
Running org.apache.activemq.transport.mqtt.MQTTSSLTest
Tests run: 17, Failures: 0, Errors: 0, Skipped: 0, Time elapsed: 168.331 sec
Running org.apache.activemq.transport.mqtt.MQTTTest
Tests run: 17, Failures: 0, Errors: 1, Skipped: 0, Time elapsed: 150.052 sec <<< FAILURE!
Results :
Tests in error:
testPingOnMQTTNIO(org.apache.activemq.transport.mqtt.MQTTNioTest): The client id MUST be configured when clean session is set to false
testReceiveMessageSentWhileOffline(org.apache.activemq.transport.mqtt.MQTTTest): Command from server contained an invalid message id: 1
Tests run: 52, Failures: 0, Errors: 2, Skipped: 0
[ERROR] There are test failures.
Please refer to <https://builds.apache.org/job/ActiveMQ-Java7/org.apache.activemq$activemq-mqtt/ws/target/surefire-reports> for the individual test results.
Jenkins build is still unstable: ActiveMQ-Java7 » ActiveMQ :: MQTT Protocol #264
Posted by Apache Jenkins Server <je...@builds.apache.org>.
See <https://builds.apache.org/job/ActiveMQ-Java7/org.apache.activemq$activemq-mqtt/264/>
Jenkins build is still unstable: ActiveMQ-Java7 » ActiveMQ :: MQTT Protocol #263
Posted by Apache Jenkins Server <je...@builds.apache.org>.
See <https://builds.apache.org/job/ActiveMQ-Java7/org.apache.activemq$activemq-mqtt/263/>
Jenkins build is still unstable: ActiveMQ-Java7 » ActiveMQ :: MQTT Protocol #262
Posted by Apache Jenkins Server <je...@builds.apache.org>.
See <https://builds.apache.org/job/ActiveMQ-Java7/org.apache.activemq$activemq-mqtt/262/>
Jenkins build is still unstable: ActiveMQ-Java7 » ActiveMQ :: MQTT Protocol #261
Posted by Apache Jenkins Server <je...@builds.apache.org>.
See <https://builds.apache.org/job/ActiveMQ-Java7/org.apache.activemq$activemq-mqtt/261/>