You are viewing a plain text version of this content. The canonical link for it is here.
Posted to dev@lucene.apache.org by Policeman Jenkins Server <je...@thetaphi.de> on 2015/06/28 23:08:11 UTC

[JENKINS] Lucene-Solr-5.x-MacOSX (64bit/jdk1.7.0) - Build # 2416 - Failure!

Build: http://jenkins.thetaphi.de/job/Lucene-Solr-5.x-MacOSX/2416/
Java: 64bit/jdk1.7.0 -XX:-UseCompressedOops -XX:+UseG1GC

1 tests failed.
FAILED:  org.apache.solr.cloud.ChaosMonkeySafeLeaderTest.test

Error Message:
shard1 is not consistent.  Got 203 from https://127.0.0.1:60584/collection1lastClient and got 96 from https://127.0.0.1:60608/collection1

Stack Trace:
java.lang.AssertionError: shard1 is not consistent.  Got 203 from https://127.0.0.1:60584/collection1lastClient and got 96 from https://127.0.0.1:60608/collection1
	at __randomizedtesting.SeedInfo.seed([E5D67A84E70E48F6:6D82455E49F2250E]:0)
	at org.junit.Assert.fail(Assert.java:93)
	at org.apache.solr.cloud.AbstractFullDistribZkTestBase.checkShardConsistency(AbstractFullDistribZkTestBase.java:1244)
	at org.apache.solr.cloud.AbstractFullDistribZkTestBase.checkShardConsistency(AbstractFullDistribZkTestBase.java:1223)
	at org.apache.solr.cloud.ChaosMonkeySafeLeaderTest.test(ChaosMonkeySafeLeaderTest.java:165)
	at sun.reflect.NativeMethodAccessorImpl.invoke0(Native Method)
	at sun.reflect.NativeMethodAccessorImpl.invoke(NativeMethodAccessorImpl.java:57)
	at sun.reflect.DelegatingMethodAccessorImpl.invoke(DelegatingMethodAccessorImpl.java:43)
	at java.lang.reflect.Method.invoke(Method.java:606)
	at com.carrotsearch.randomizedtesting.RandomizedRunner.invoke(RandomizedRunner.java:1627)
	at com.carrotsearch.randomizedtesting.RandomizedRunner$6.evaluate(RandomizedRunner.java:836)
	at com.carrotsearch.randomizedtesting.RandomizedRunner$7.evaluate(RandomizedRunner.java:872)
	at com.carrotsearch.randomizedtesting.RandomizedRunner$8.evaluate(RandomizedRunner.java:886)
	at org.apache.solr.BaseDistributedSearchTestCase$ShardsRepeatRule$ShardsFixedStatement.callStatement(BaseDistributedSearchTestCase.java:960)
	at org.apache.solr.BaseDistributedSearchTestCase$ShardsRepeatRule$ShardsStatement.evaluate(BaseDistributedSearchTestCase.java:935)
	at com.carrotsearch.randomizedtesting.rules.SystemPropertiesRestoreRule$1.evaluate(SystemPropertiesRestoreRule.java:57)
	at org.apache.lucene.util.TestRuleSetupTeardownChained$1.evaluate(TestRuleSetupTeardownChained.java:50)
	at org.apache.lucene.util.AbstractBeforeAfterRule$1.evaluate(AbstractBeforeAfterRule.java:46)
	at org.apache.lucene.util.TestRuleThreadAndTestName$1.evaluate(TestRuleThreadAndTestName.java:49)
	at org.apache.lucene.util.TestRuleIgnoreAfterMaxFailures$1.evaluate(TestRuleIgnoreAfterMaxFailures.java:65)
	at org.apache.lucene.util.TestRuleMarkFailure$1.evaluate(TestRuleMarkFailure.java:48)
	at com.carrotsearch.randomizedtesting.rules.StatementAdapter.evaluate(StatementAdapter.java:36)
	at com.carrotsearch.randomizedtesting.ThreadLeakControl$StatementRunner.run(ThreadLeakControl.java:365)
	at com.carrotsearch.randomizedtesting.ThreadLeakControl.forkTimeoutingTask(ThreadLeakControl.java:798)
	at com.carrotsearch.randomizedtesting.ThreadLeakControl$3.evaluate(ThreadLeakControl.java:458)
	at com.carrotsearch.randomizedtesting.RandomizedRunner.runSingleTest(RandomizedRunner.java:845)
	at com.carrotsearch.randomizedtesting.RandomizedRunner$3.evaluate(RandomizedRunner.java:747)
	at com.carrotsearch.randomizedtesting.RandomizedRunner$4.evaluate(RandomizedRunner.java:781)
	at com.carrotsearch.randomizedtesting.RandomizedRunner$5.evaluate(RandomizedRunner.java:792)
	at com.carrotsearch.randomizedtesting.rules.StatementAdapter.evaluate(StatementAdapter.java:36)
	at com.carrotsearch.randomizedtesting.rules.SystemPropertiesRestoreRule$1.evaluate(SystemPropertiesRestoreRule.java:57)
	at org.apache.lucene.util.AbstractBeforeAfterRule$1.evaluate(AbstractBeforeAfterRule.java:46)
	at com.carrotsearch.randomizedtesting.rules.StatementAdapter.evaluate(StatementAdapter.java:36)
	at org.apache.lucene.util.TestRuleStoreClassName$1.evaluate(TestRuleStoreClassName.java:42)
	at com.carrotsearch.randomizedtesting.rules.NoShadowingOrOverridesOnMethodsRule$1.evaluate(NoShadowingOrOverridesOnMethodsRule.java:39)
	at com.carrotsearch.randomizedtesting.rules.NoShadowingOrOverridesOnMethodsRule$1.evaluate(NoShadowingOrOverridesOnMethodsRule.java:39)
	at com.carrotsearch.randomizedtesting.rules.StatementAdapter.evaluate(StatementAdapter.java:36)
	at com.carrotsearch.randomizedtesting.rules.StatementAdapter.evaluate(StatementAdapter.java:36)
	at com.carrotsearch.randomizedtesting.rules.StatementAdapter.evaluate(StatementAdapter.java:36)
	at org.apache.lucene.util.TestRuleAssertionsRequired$1.evaluate(TestRuleAssertionsRequired.java:54)
	at org.apache.lucene.util.TestRuleMarkFailure$1.evaluate(TestRuleMarkFailure.java:48)
	at org.apache.lucene.util.TestRuleIgnoreAfterMaxFailures$1.evaluate(TestRuleIgnoreAfterMaxFailures.java:65)
	at org.apache.lucene.util.TestRuleIgnoreTestSuites$1.evaluate(TestRuleIgnoreTestSuites.java:55)
	at com.carrotsearch.randomizedtesting.rules.StatementAdapter.evaluate(StatementAdapter.java:36)
	at com.carrotsearch.randomizedtesting.ThreadLeakControl$StatementRunner.run(ThreadLeakControl.java:365)
	at java.lang.Thread.run(Thread.java:745)




Build Log:
[...truncated 10449 lines...]
   [junit4] Suite: org.apache.solr.cloud.ChaosMonkeySafeLeaderTest
   [junit4]   2> Creating dataDir: /Users/jenkins/workspace/Lucene-Solr-5.x-MacOSX/solr/build/solr-core/test/J0/temp/solr.cloud.ChaosMonkeySafeLeaderTest_E5D67A84E70E48F6-001/init-core-data-001
   [junit4]   2> 1230070 INFO  (SUITE-ChaosMonkeySafeLeaderTest-seed#[E5D67A84E70E48F6]-worker) [    ] o.a.s.SolrTestCaseJ4 Randomized ssl (true) and clientAuth (false)
   [junit4]   2> 1230070 INFO  (SUITE-ChaosMonkeySafeLeaderTest-seed#[E5D67A84E70E48F6]-worker) [    ] o.a.s.BaseDistributedSearchTestCase Setting hostContext system property: /
   [junit4]   2> 1230081 INFO  (TEST-ChaosMonkeySafeLeaderTest.test-seed#[E5D67A84E70E48F6]) [    ] o.a.s.c.ZkTestServer STARTING ZK TEST SERVER
   [junit4]   2> 1230087 INFO  (Thread-3140) [    ] o.a.s.c.ZkTestServer client port:0.0.0.0/0.0.0.0:0
   [junit4]   2> 1230087 INFO  (Thread-3140) [    ] o.a.s.c.ZkTestServer Starting server
   [junit4]   2> 1230188 INFO  (TEST-ChaosMonkeySafeLeaderTest.test-seed#[E5D67A84E70E48F6]) [    ] o.a.s.c.ZkTestServer start zk server on port:60569
   [junit4]   2> 1230188 INFO  (TEST-ChaosMonkeySafeLeaderTest.test-seed#[E5D67A84E70E48F6]) [    ] o.a.s.c.c.SolrZkClient Using default ZkCredentialsProvider
   [junit4]   2> 1230192 INFO  (TEST-ChaosMonkeySafeLeaderTest.test-seed#[E5D67A84E70E48F6]) [    ] o.a.s.c.c.ConnectionManager Waiting for client to connect to ZooKeeper
   [junit4]   2> 1230205 INFO  (zkCallback-1146-thread-1) [    ] o.a.s.c.c.ConnectionManager Watcher org.apache.solr.common.cloud.ConnectionManager@ec4e0c2 name:ZooKeeperConnection Watcher:127.0.0.1:60569 got event WatchedEvent state:SyncConnected type:None path:null path:null type:None
   [junit4]   2> 1230206 INFO  (TEST-ChaosMonkeySafeLeaderTest.test-seed#[E5D67A84E70E48F6]) [    ] o.a.s.c.c.ConnectionManager Client is connected to ZooKeeper
   [junit4]   2> 1230207 INFO  (TEST-ChaosMonkeySafeLeaderTest.test-seed#[E5D67A84E70E48F6]) [    ] o.a.s.c.c.SolrZkClient Using default ZkACLProvider
   [junit4]   2> 1230207 INFO  (TEST-ChaosMonkeySafeLeaderTest.test-seed#[E5D67A84E70E48F6]) [    ] o.a.s.c.c.SolrZkClient makePath: /solr
   [junit4]   2> 1230227 INFO  (TEST-ChaosMonkeySafeLeaderTest.test-seed#[E5D67A84E70E48F6]) [    ] o.a.s.c.c.SolrZkClient Using default ZkCredentialsProvider
   [junit4]   2> 1230239 INFO  (TEST-ChaosMonkeySafeLeaderTest.test-seed#[E5D67A84E70E48F6]) [    ] o.a.s.c.c.ConnectionManager Waiting for client to connect to ZooKeeper
   [junit4]   2> 1230241 INFO  (zkCallback-1147-thread-1) [    ] o.a.s.c.c.ConnectionManager Watcher org.apache.solr.common.cloud.ConnectionManager@373949fe name:ZooKeeperConnection Watcher:127.0.0.1:60569/solr got event WatchedEvent state:SyncConnected type:None path:null path:null type:None
   [junit4]   2> 1230241 INFO  (TEST-ChaosMonkeySafeLeaderTest.test-seed#[E5D67A84E70E48F6]) [    ] o.a.s.c.c.ConnectionManager Client is connected to ZooKeeper
   [junit4]   2> 1230241 INFO  (TEST-ChaosMonkeySafeLeaderTest.test-seed#[E5D67A84E70E48F6]) [    ] o.a.s.c.c.SolrZkClient Using default ZkACLProvider
   [junit4]   2> 1230241 INFO  (TEST-ChaosMonkeySafeLeaderTest.test-seed#[E5D67A84E70E48F6]) [    ] o.a.s.c.c.SolrZkClient makePath: /collections/collection1
   [junit4]   2> 1230250 INFO  (TEST-ChaosMonkeySafeLeaderTest.test-seed#[E5D67A84E70E48F6]) [    ] o.a.s.c.c.SolrZkClient makePath: /collections/collection1/shards
   [junit4]   2> 1230266 INFO  (TEST-ChaosMonkeySafeLeaderTest.test-seed#[E5D67A84E70E48F6]) [    ] o.a.s.c.c.SolrZkClient makePath: /collections/control_collection
   [junit4]   2> 1230276 INFO  (TEST-ChaosMonkeySafeLeaderTest.test-seed#[E5D67A84E70E48F6]) [    ] o.a.s.c.c.SolrZkClient makePath: /collections/control_collection/shards
   [junit4]   2> 1230285 INFO  (TEST-ChaosMonkeySafeLeaderTest.test-seed#[E5D67A84E70E48F6]) [    ] o.a.s.c.AbstractZkTestCase put /Users/jenkins/workspace/Lucene-Solr-5.x-MacOSX/solr/core/src/test-files/solr/collection1/conf/solrconfig-tlog.xml to /configs/conf1/solrconfig.xml
   [junit4]   2> 1230285 INFO  (TEST-ChaosMonkeySafeLeaderTest.test-seed#[E5D67A84E70E48F6]) [    ] o.a.s.c.c.SolrZkClient makePath: /configs/conf1/solrconfig.xml
   [junit4]   2> 1230299 INFO  (TEST-ChaosMonkeySafeLeaderTest.test-seed#[E5D67A84E70E48F6]) [    ] o.a.s.c.AbstractZkTestCase put /Users/jenkins/workspace/Lucene-Solr-5.x-MacOSX/solr/core/src/test-files/solr/collection1/conf/schema15.xml to /configs/conf1/schema.xml
   [junit4]   2> 1230300 INFO  (TEST-ChaosMonkeySafeLeaderTest.test-seed#[E5D67A84E70E48F6]) [    ] o.a.s.c.c.SolrZkClient makePath: /configs/conf1/schema.xml
   [junit4]   2> 1230308 INFO  (TEST-ChaosMonkeySafeLeaderTest.test-seed#[E5D67A84E70E48F6]) [    ] o.a.s.c.AbstractZkTestCase put /Users/jenkins/workspace/Lucene-Solr-5.x-MacOSX/solr/core/src/test-files/solr/collection1/conf/solrconfig.snippet.randomindexconfig.xml to /configs/conf1/solrconfig.snippet.randomindexconfig.xml
   [junit4]   2> 1230309 INFO  (TEST-ChaosMonkeySafeLeaderTest.test-seed#[E5D67A84E70E48F6]) [    ] o.a.s.c.c.SolrZkClient makePath: /configs/conf1/solrconfig.snippet.randomindexconfig.xml
   [junit4]   2> 1230314 INFO  (TEST-ChaosMonkeySafeLeaderTest.test-seed#[E5D67A84E70E48F6]) [    ] o.a.s.c.AbstractZkTestCase put /Users/jenkins/workspace/Lucene-Solr-5.x-MacOSX/solr/core/src/test-files/solr/collection1/conf/stopwords.txt to /configs/conf1/stopwords.txt
   [junit4]   2> 1230315 INFO  (TEST-ChaosMonkeySafeLeaderTest.test-seed#[E5D67A84E70E48F6]) [    ] o.a.s.c.c.SolrZkClient makePath: /configs/conf1/stopwords.txt
   [junit4]   2> 1230326 INFO  (TEST-ChaosMonkeySafeLeaderTest.test-seed#[E5D67A84E70E48F6]) [    ] o.a.s.c.AbstractZkTestCase put /Users/jenkins/workspace/Lucene-Solr-5.x-MacOSX/solr/core/src/test-files/solr/collection1/conf/protwords.txt to /configs/conf1/protwords.txt
   [junit4]   2> 1230327 INFO  (TEST-ChaosMonkeySafeLeaderTest.test-seed#[E5D67A84E70E48F6]) [    ] o.a.s.c.c.SolrZkClient makePath: /configs/conf1/protwords.txt
   [junit4]   2> 1230332 INFO  (TEST-ChaosMonkeySafeLeaderTest.test-seed#[E5D67A84E70E48F6]) [    ] o.a.s.c.AbstractZkTestCase put /Users/jenkins/workspace/Lucene-Solr-5.x-MacOSX/solr/core/src/test-files/solr/collection1/conf/currency.xml to /configs/conf1/currency.xml
   [junit4]   2> 1230333 INFO  (TEST-ChaosMonkeySafeLeaderTest.test-seed#[E5D67A84E70E48F6]) [    ] o.a.s.c.c.SolrZkClient makePath: /configs/conf1/currency.xml
   [junit4]   2> 1230340 INFO  (TEST-ChaosMonkeySafeLeaderTest.test-seed#[E5D67A84E70E48F6]) [    ] o.a.s.c.AbstractZkTestCase put /Users/jenkins/workspace/Lucene-Solr-5.x-MacOSX/solr/core/src/test-files/solr/collection1/conf/enumsConfig.xml to /configs/conf1/enumsConfig.xml
   [junit4]   2> 1230340 INFO  (TEST-ChaosMonkeySafeLeaderTest.test-seed#[E5D67A84E70E48F6]) [    ] o.a.s.c.c.SolrZkClient makePath: /configs/conf1/enumsConfig.xml
   [junit4]   2> 1230346 INFO  (TEST-ChaosMonkeySafeLeaderTest.test-seed#[E5D67A84E70E48F6]) [    ] o.a.s.c.AbstractZkTestCase put /Users/jenkins/workspace/Lucene-Solr-5.x-MacOSX/solr/core/src/test-files/solr/collection1/conf/open-exchange-rates.json to /configs/conf1/open-exchange-rates.json
   [junit4]   2> 1230347 INFO  (TEST-ChaosMonkeySafeLeaderTest.test-seed#[E5D67A84E70E48F6]) [    ] o.a.s.c.c.SolrZkClient makePath: /configs/conf1/open-exchange-rates.json
   [junit4]   2> 1230351 INFO  (TEST-ChaosMonkeySafeLeaderTest.test-seed#[E5D67A84E70E48F6]) [    ] o.a.s.c.AbstractZkTestCase put /Users/jenkins/workspace/Lucene-Solr-5.x-MacOSX/solr/core/src/test-files/solr/collection1/conf/mapping-ISOLatin1Accent.txt to /configs/conf1/mapping-ISOLatin1Accent.txt
   [junit4]   2> 1230352 INFO  (TEST-ChaosMonkeySafeLeaderTest.test-seed#[E5D67A84E70E48F6]) [    ] o.a.s.c.c.SolrZkClient makePath: /configs/conf1/mapping-ISOLatin1Accent.txt
   [junit4]   2> 1230357 INFO  (TEST-ChaosMonkeySafeLeaderTest.test-seed#[E5D67A84E70E48F6]) [    ] o.a.s.c.AbstractZkTestCase put /Users/jenkins/workspace/Lucene-Solr-5.x-MacOSX/solr/core/src/test-files/solr/collection1/conf/old_synonyms.txt to /configs/conf1/old_synonyms.txt
   [junit4]   2> 1230358 INFO  (TEST-ChaosMonkeySafeLeaderTest.test-seed#[E5D67A84E70E48F6]) [    ] o.a.s.c.c.SolrZkClient makePath: /configs/conf1/old_synonyms.txt
   [junit4]   2> 1230363 INFO  (TEST-ChaosMonkeySafeLeaderTest.test-seed#[E5D67A84E70E48F6]) [    ] o.a.s.c.AbstractZkTestCase put /Users/jenkins/workspace/Lucene-Solr-5.x-MacOSX/solr/core/src/test-files/solr/collection1/conf/synonyms.txt to /configs/conf1/synonyms.txt
   [junit4]   2> 1230364 INFO  (TEST-ChaosMonkeySafeLeaderTest.test-seed#[E5D67A84E70E48F6]) [    ] o.a.s.c.c.SolrZkClient makePath: /configs/conf1/synonyms.txt
   [junit4]   2> 1230372 INFO  (TEST-ChaosMonkeySafeLeaderTest.test-seed#[E5D67A84E70E48F6]) [    ] o.a.s.c.c.SolrZkClient Using default ZkCredentialsProvider
   [junit4]   2> 1230373 INFO  (TEST-ChaosMonkeySafeLeaderTest.test-seed#[E5D67A84E70E48F6]) [    ] o.a.s.c.c.ConnectionManager Waiting for client to connect to ZooKeeper
   [junit4]   2> 1230376 INFO  (zkCallback-1148-thread-1) [    ] o.a.s.c.c.ConnectionManager Watcher org.apache.solr.common.cloud.ConnectionManager@75b1ebce name:ZooKeeperConnection Watcher:127.0.0.1:60569/solr got event WatchedEvent state:SyncConnected type:None path:null path:null type:None
   [junit4]   2> 1230377 INFO  (TEST-ChaosMonkeySafeLeaderTest.test-seed#[E5D67A84E70E48F6]) [    ] o.a.s.c.c.ConnectionManager Client is connected to ZooKeeper
   [junit4]   2> 1230377 INFO  (TEST-ChaosMonkeySafeLeaderTest.test-seed#[E5D67A84E70E48F6]) [    ] o.a.s.c.c.SolrZkClient Using default ZkACLProvider
   [junit4]   2> 1230828 INFO  (TEST-ChaosMonkeySafeLeaderTest.test-seed#[E5D67A84E70E48F6]) [    ] o.a.s.SolrTestCaseJ4 Writing core.properties file to /Users/jenkins/workspace/Lucene-Solr-5.x-MacOSX/solr/build/solr-core/test/J0/temp/solr.cloud.ChaosMonkeySafeLeaderTest_E5D67A84E70E48F6-001/control-001/cores/collection1
   [junit4]   2> 1230831 INFO  (TEST-ChaosMonkeySafeLeaderTest.test-seed#[E5D67A84E70E48F6]) [    ] o.e.j.s.Server jetty-9.2.11.v20150529
   [junit4]   2> 1230835 INFO  (TEST-ChaosMonkeySafeLeaderTest.test-seed#[E5D67A84E70E48F6]) [    ] o.e.j.s.h.ContextHandler Started o.e.j.s.ServletContextHandler@30fb12b5{/,null,AVAILABLE}
   [junit4]   2> 1230840 INFO  (TEST-ChaosMonkeySafeLeaderTest.test-seed#[E5D67A84E70E48F6]) [    ] o.e.j.s.ServerConnector Started ServerConnector@33894232{SSL-http/1.1}{127.0.0.1:60573}
   [junit4]   2> 1230841 INFO  (TEST-ChaosMonkeySafeLeaderTest.test-seed#[E5D67A84E70E48F6]) [    ] o.e.j.s.Server Started @1237588ms
   [junit4]   2> 1230841 INFO  (TEST-ChaosMonkeySafeLeaderTest.test-seed#[E5D67A84E70E48F6]) [    ] o.a.s.c.s.e.JettySolrRunner Jetty properties: {hostContext=/, hostPort=60573, solr.data.dir=/Users/jenkins/workspace/Lucene-Solr-5.x-MacOSX/solr/build/solr-core/test/J0/temp/solr.cloud.ChaosMonkeySafeLeaderTest_E5D67A84E70E48F6-001/tempDir-001/control/data, coreRootDirectory=/Users/jenkins/workspace/Lucene-Solr-5.x-MacOSX/solr/build/solr-core/test/J0/temp/solr.cloud.ChaosMonkeySafeLeaderTest_E5D67A84E70E48F6-001/control-001/cores}
   [junit4]   2> 1230843 INFO  (TEST-ChaosMonkeySafeLeaderTest.test-seed#[E5D67A84E70E48F6]) [    ] o.a.s.s.SolrDispatchFilter SolrDispatchFilter.init(): sun.misc.Launcher$AppClassLoader@6629a046
   [junit4]   2> 1230843 INFO  (TEST-ChaosMonkeySafeLeaderTest.test-seed#[E5D67A84E70E48F6]) [    ] o.a.s.c.SolrResourceLoader new SolrResourceLoader for directory: '/Users/jenkins/workspace/Lucene-Solr-5.x-MacOSX/solr/build/solr-core/test/J0/temp/solr.cloud.ChaosMonkeySafeLeaderTest_E5D67A84E70E48F6-001/control-001/'
   [junit4]   2> 1230876 INFO  (TEST-ChaosMonkeySafeLeaderTest.test-seed#[E5D67A84E70E48F6]) [    ] o.a.s.c.SolrXmlConfig Loading container configuration from /Users/jenkins/workspace/Lucene-Solr-5.x-MacOSX/solr/build/solr-core/test/J0/temp/solr.cloud.ChaosMonkeySafeLeaderTest_E5D67A84E70E48F6-001/control-001/solr.xml
   [junit4]   2> 1230909 INFO  (TEST-ChaosMonkeySafeLeaderTest.test-seed#[E5D67A84E70E48F6]) [    ] o.a.s.c.CoresLocator Config-defined core root directory: /Users/jenkins/workspace/Lucene-Solr-5.x-MacOSX/solr/build/solr-core/test/J0/temp/solr.cloud.ChaosMonkeySafeLeaderTest_E5D67A84E70E48F6-001/control-001/cores
   [junit4]   2> 1230909 INFO  (TEST-ChaosMonkeySafeLeaderTest.test-seed#[E5D67A84E70E48F6]) [    ] o.a.s.c.CoreContainer New CoreContainer 244517984
   [junit4]   2> 1230909 INFO  (TEST-ChaosMonkeySafeLeaderTest.test-seed#[E5D67A84E70E48F6]) [    ] o.a.s.c.CoreContainer Loading cores into CoreContainer [instanceDir=/Users/jenkins/workspace/Lucene-Solr-5.x-MacOSX/solr/build/solr-core/test/J0/temp/solr.cloud.ChaosMonkeySafeLeaderTest_E5D67A84E70E48F6-001/control-001/]
   [junit4]   2> 1230909 INFO  (TEST-ChaosMonkeySafeLeaderTest.test-seed#[E5D67A84E70E48F6]) [    ] o.a.s.c.CoreContainer loading shared library: /Users/jenkins/workspace/Lucene-Solr-5.x-MacOSX/solr/build/solr-core/test/J0/temp/solr.cloud.ChaosMonkeySafeLeaderTest_E5D67A84E70E48F6-001/control-001/lib
   [junit4]   2> 1230910 WARN  (TEST-ChaosMonkeySafeLeaderTest.test-seed#[E5D67A84E70E48F6]) [    ] o.a.s.c.SolrResourceLoader Can't find (or read) directory to add to classloader: lib (resolved as: /Users/jenkins/workspace/Lucene-Solr-5.x-MacOSX/solr/build/solr-core/test/J0/temp/solr.cloud.ChaosMonkeySafeLeaderTest_E5D67A84E70E48F6-001/control-001/lib).
   [junit4]   2> 1230920 INFO  (TEST-ChaosMonkeySafeLeaderTest.test-seed#[E5D67A84E70E48F6]) [    ] o.a.s.h.c.HttpShardHandlerFactory created with socketTimeout : 90000,urlScheme : ,connTimeout : 15000,maxConnectionsPerHost : 20,maxConnections : 10000,corePoolSize : 0,maximumPoolSize : 2147483647,maxThreadIdleTime : 5,sizeOfQueue : -1,fairnessPolicy : false,useRetries : false,
   [junit4]   2> 1230925 INFO  (TEST-ChaosMonkeySafeLeaderTest.test-seed#[E5D67A84E70E48F6]) [    ] o.a.s.u.UpdateShardHandler Creating UpdateShardHandler HTTP client with params: socketTimeout=340000&connTimeout=45000&retry=true
   [junit4]   2> 1230928 INFO  (TEST-ChaosMonkeySafeLeaderTest.test-seed#[E5D67A84E70E48F6]) [    ] o.a.s.l.LogWatcher SLF4J impl is org.slf4j.impl.Log4jLoggerFactory
   [junit4]   2> 1230928 INFO  (TEST-ChaosMonkeySafeLeaderTest.test-seed#[E5D67A84E70E48F6]) [    ] o.a.s.l.LogWatcher Registering Log Listener [Log4j (org.slf4j.impl.Log4jLoggerFactory)]
   [junit4]   2> 1230928 INFO  (TEST-ChaosMonkeySafeLeaderTest.test-seed#[E5D67A84E70E48F6]) [    ] o.a.s.c.ZkContainer Zookeeper client=127.0.0.1:60569/solr
   [junit4]   2> 1230928 INFO  (TEST-ChaosMonkeySafeLeaderTest.test-seed#[E5D67A84E70E48F6]) [    ] o.a.s.c.ZkController zkHost includes chroot
   [junit4]   2> 1230928 INFO  (TEST-ChaosMonkeySafeLeaderTest.test-seed#[E5D67A84E70E48F6]) [    ] o.a.s.c.c.SolrZkClient Using default ZkCredentialsProvider
   [junit4]   2> 1230929 INFO  (TEST-ChaosMonkeySafeLeaderTest.test-seed#[E5D67A84E70E48F6]) [    ] o.a.s.c.c.ConnectionManager Waiting for client to connect to ZooKeeper
   [junit4]   2> 1230931 INFO  (zkCallback-1150-thread-1) [    ] o.a.s.c.c.ConnectionManager Watcher org.apache.solr.common.cloud.ConnectionManager@673e664 name:ZooKeeperConnection Watcher:127.0.0.1:60569 got event WatchedEvent state:SyncConnected type:None path:null path:null type:None
   [junit4]   2> 1230932 INFO  (TEST-ChaosMonkeySafeLeaderTest.test-seed#[E5D67A84E70E48F6]) [    ] o.a.s.c.c.ConnectionManager Client is connected to ZooKeeper
   [junit4]   2> 1230932 INFO  (TEST-ChaosMonkeySafeLeaderTest.test-seed#[E5D67A84E70E48F6]) [    ] o.a.s.c.c.SolrZkClient Using default ZkACLProvider
   [junit4]   2> 1230935 INFO  (TEST-ChaosMonkeySafeLeaderTest.test-seed#[E5D67A84E70E48F6]) [n:127.0.0.1:60573_    ] o.a.s.c.c.ConnectionManager Waiting for client to connect to ZooKeeper
   [junit4]   2> 1230938 INFO  (zkCallback-1151-thread-1-processing-n:127.0.0.1:60573_) [n:127.0.0.1:60573_    ] o.a.s.c.c.ConnectionManager Watcher org.apache.solr.common.cloud.ConnectionManager@4d45b29f name:ZooKeeperConnection Watcher:127.0.0.1:60569/solr got event WatchedEvent state:SyncConnected type:None path:null path:null type:None
   [junit4]   2> 1230938 INFO  (TEST-ChaosMonkeySafeLeaderTest.test-seed#[E5D67A84E70E48F6]) [n:127.0.0.1:60573_    ] o.a.s.c.c.ConnectionManager Client is connected to ZooKeeper
   [junit4]   2> 1230940 INFO  (TEST-ChaosMonkeySafeLeaderTest.test-seed#[E5D67A84E70E48F6]) [n:127.0.0.1:60573_    ] o.a.s.c.c.SolrZkClient makePath: /overseer/queue
   [junit4]   2> 1230945 INFO  (TEST-ChaosMonkeySafeLeaderTest.test-seed#[E5D67A84E70E48F6]) [n:127.0.0.1:60573_    ] o.a.s.c.c.SolrZkClient makePath: /overseer/collection-queue-work
   [junit4]   2> 1230950 INFO  (TEST-ChaosMonkeySafeLeaderTest.test-seed#[E5D67A84E70E48F6]) [n:127.0.0.1:60573_    ] o.a.s.c.c.SolrZkClient makePath: /overseer/collection-map-running
   [junit4]   2> 1230956 INFO  (TEST-ChaosMonkeySafeLeaderTest.test-seed#[E5D67A84E70E48F6]) [n:127.0.0.1:60573_    ] o.a.s.c.c.SolrZkClient makePath: /overseer/collection-map-completed
   [junit4]   2> 1230960 INFO  (TEST-ChaosMonkeySafeLeaderTest.test-seed#[E5D67A84E70E48F6]) [n:127.0.0.1:60573_    ] o.a.s.c.c.SolrZkClient makePath: /overseer/collection-map-failure
   [junit4]   2> 1230967 INFO  (TEST-ChaosMonkeySafeLeaderTest.test-seed#[E5D67A84E70E48F6]) [n:127.0.0.1:60573_    ] o.a.s.c.c.SolrZkClient makePath: /live_nodes
   [junit4]   2> 1230972 INFO  (TEST-ChaosMonkeySafeLeaderTest.test-seed#[E5D67A84E70E48F6]) [n:127.0.0.1:60573_    ] o.a.s.c.c.SolrZkClient makePath: /aliases.json
   [junit4]   2> 1230975 INFO  (TEST-ChaosMonkeySafeLeaderTest.test-seed#[E5D67A84E70E48F6]) [n:127.0.0.1:60573_    ] o.a.s.c.c.SolrZkClient makePath: /clusterstate.json
   [junit4]   2> 1230978 INFO  (TEST-ChaosMonkeySafeLeaderTest.test-seed#[E5D67A84E70E48F6]) [n:127.0.0.1:60573_    ] o.a.s.c.ZkController Register node as live in ZooKeeper:/live_nodes/127.0.0.1:60573_
   [junit4]   2> 1230979 INFO  (TEST-ChaosMonkeySafeLeaderTest.test-seed#[E5D67A84E70E48F6]) [n:127.0.0.1:60573_    ] o.a.s.c.c.SolrZkClient makePath: /live_nodes/127.0.0.1:60573_
   [junit4]   2> 1230983 INFO  (TEST-ChaosMonkeySafeLeaderTest.test-seed#[E5D67A84E70E48F6]) [n:127.0.0.1:60573_    ] o.a.s.c.c.SolrZkClient makePath: /overseer_elect
   [junit4]   2> 1230987 INFO  (TEST-ChaosMonkeySafeLeaderTest.test-seed#[E5D67A84E70E48F6]) [n:127.0.0.1:60573_    ] o.a.s.c.c.SolrZkClient makePath: /overseer_elect/election
   [junit4]   2> 1230990 INFO  (TEST-ChaosMonkeySafeLeaderTest.test-seed#[E5D67A84E70E48F6]) [n:127.0.0.1:60573_    ] o.a.s.c.Overseer Overseer (id=null) closing
   [junit4]   2> 1230991 INFO  (TEST-ChaosMonkeySafeLeaderTest.test-seed#[E5D67A84E70E48F6]) [n:127.0.0.1:60573_    ] o.a.s.c.LeaderElector Joined leadership election with path: /overseer_elect/election/94078442561208324-127.0.0.1:60573_-n_0000000000
   [junit4]   2> 1230993 INFO  (TEST-ChaosMonkeySafeLeaderTest.test-seed#[E5D67A84E70E48F6]) [n:127.0.0.1:60573_    ] o.a.s.c.OverseerElectionContext I am going to be the leader 127.0.0.1:60573_
   [junit4]   2> 1230993 INFO  (TEST-ChaosMonkeySafeLeaderTest.test-seed#[E5D67A84E70E48F6]) [n:127.0.0.1:60573_    ] o.a.s.c.c.SolrZkClient makePath: /overseer_elect/leader
   [junit4]   2> 1230996 INFO  (TEST-ChaosMonkeySafeLeaderTest.test-seed#[E5D67A84E70E48F6]) [n:127.0.0.1:60573_    ] o.a.s.c.Overseer Overseer (id=94078442561208324-127.0.0.1:60573_-n_0000000000) starting
   [junit4]   2> 1231001 INFO  (TEST-ChaosMonkeySafeLeaderTest.test-seed#[E5D67A84E70E48F6]) [n:127.0.0.1:60573_    ] o.a.s.c.c.SolrZkClient makePath: /overseer/queue-work
   [junit4]   2> 1231017 INFO  (TEST-ChaosMonkeySafeLeaderTest.test-seed#[E5D67A84E70E48F6]) [n:127.0.0.1:60573_    ] o.a.s.c.OverseerAutoReplicaFailoverThread Starting OverseerAutoReplicaFailoverThread autoReplicaFailoverWorkLoopDelay=10000 autoReplicaFailoverWaitAfterExpiration=30000 autoReplicaFailoverBadNodeExpiration=60000
   [junit4]   2> 1231019 INFO  (OverseerCollectionProcessor-94078442561208324-127.0.0.1:60573_-n_0000000000) [n:127.0.0.1:60573_    ] o.a.s.c.OverseerCollectionProcessor Process current queue of collection creations
   [junit4]   2> 1231019 INFO  (TEST-ChaosMonkeySafeLeaderTest.test-seed#[E5D67A84E70E48F6]) [n:127.0.0.1:60573_    ] o.a.s.c.c.ZkStateReader Updating cluster state from ZooKeeper... 
   [junit4]   2> 1231019 INFO  (OverseerStateUpdate-94078442561208324-127.0.0.1:60573_-n_0000000000) [n:127.0.0.1:60573_    ] o.a.s.c.Overseer Starting to work on the main queue
   [junit4]   2> 1231029 INFO  (TEST-ChaosMonkeySafeLeaderTest.test-seed#[E5D67A84E70E48F6]) [n:127.0.0.1:60573_    ] o.a.s.c.CoreContainer No authentication plugin used.
   [junit4]   2> 1231030 INFO  (TEST-ChaosMonkeySafeLeaderTest.test-seed#[E5D67A84E70E48F6]) [n:127.0.0.1:60573_    ] o.a.s.c.CoreContainer Security conf doesn't exist. Skipping setup for authorization module.
   [junit4]   2> 1231034 INFO  (TEST-ChaosMonkeySafeLeaderTest.test-seed#[E5D67A84E70E48F6]) [n:127.0.0.1:60573_    ] o.a.s.c.CoresLocator Looking for core definitions underneath /Users/jenkins/workspace/Lucene-Solr-5.x-MacOSX/solr/build/solr-core/test/J0/temp/solr.cloud.ChaosMonkeySafeLeaderTest_E5D67A84E70E48F6-001/control-001/cores
   [junit4]   2> 1231037 INFO  (TEST-ChaosMonkeySafeLeaderTest.test-seed#[E5D67A84E70E48F6]) [n:127.0.0.1:60573_    ] o.a.s.c.SolrCore Created CoreDescriptor: {transient=false, coreNodeName=, config=solrconfig.xml, collection=control_collection, dataDir=data/, loadOnStartup=true, schema=schema.xml, instanceDir=/Users/jenkins/workspace/Lucene-Solr-5.x-MacOSX/solr/build/solr-core/test/J0/temp/solr.cloud.ChaosMonkeySafeLeaderTest_E5D67A84E70E48F6-001/control-001/cores/collection1, shard=, name=collection1, absoluteInstDir=/Users/jenkins/workspace/Lucene-Solr-5.x-MacOSX/solr/build/solr-core/test/J0/temp/solr.cloud.ChaosMonkeySafeLeaderTest_E5D67A84E70E48F6-001/control-001/cores/collection1/}
   [junit4]   2> 1231037 INFO  (TEST-ChaosMonkeySafeLeaderTest.test-seed#[E5D67A84E70E48F6]) [n:127.0.0.1:60573_    ] o.a.s.c.CoresLocator Found core collection1 in /Users/jenkins/workspace/Lucene-Solr-5.x-MacOSX/solr/build/solr-core/test/J0/temp/solr.cloud.ChaosMonkeySafeLeaderTest_E5D67A84E70E48F6-001/control-001/cores/collection1/
   [junit4]   2> 1231037 INFO  (TEST-ChaosMonkeySafeLeaderTest.test-seed#[E5D67A84E70E48F6]) [n:127.0.0.1:60573_    ] o.a.s.c.CoresLocator Found 1 core definitions
   [junit4]   2> 1231039 INFO  (TEST-ChaosMonkeySafeLeaderTest.test-seed#[E5D67A84E70E48F6]) [n:127.0.0.1:60573_    ] o.a.s.s.SolrDispatchFilter user.dir=/Users/jenkins/workspace/Lucene-Solr-5.x-MacOSX/solr/build/solr-core/test/J0
   [junit4]   2> 1231039 INFO  (coreLoadExecutor-3781-thread-1-processing-n:127.0.0.1:60573_) [n:127.0.0.1:60573_ c:control_collection   x:collection1] o.a.s.c.ZkController publishing state=down
   [junit4]   2> 1231039 INFO  (coreLoadExecutor-3781-thread-1-processing-n:127.0.0.1:60573_) [n:127.0.0.1:60573_ c:control_collection   x:collection1] o.a.s.c.ZkController numShards not found on descriptor - reading it from system property
   [junit4]   2> 1231039 INFO  (TEST-ChaosMonkeySafeLeaderTest.test-seed#[E5D67A84E70E48F6]) [n:127.0.0.1:60573_    ] o.a.s.s.SolrDispatchFilter SolrDispatchFilter.init() done
   [junit4]   2> 1231041 INFO  (zkCallback-1151-thread-1-processing-n:127.0.0.1:60573_) [n:127.0.0.1:60573_    ] o.a.s.c.DistributedQueue NodeChildrenChanged fired on path /overseer/queue state SyncConnected
   [junit4]   2> 1231041 INFO  (coreLoadExecutor-3781-thread-1-processing-n:127.0.0.1:60573_) [n:127.0.0.1:60573_ c:control_collection   x:collection1] o.a.s.c.ZkController look for our core node name
   [junit4]   2> 1231043 INFO  (OverseerStateUpdate-94078442561208324-127.0.0.1:60573_-n_0000000000) [n:127.0.0.1:60573_    ] o.a.s.c.Overseer processMessage: queueSize: 1, message = {
   [junit4]   2>   "node_name":"127.0.0.1:60573_",
   [junit4]   2>   "collection":"control_collection",
   [junit4]   2>   "base_url":"https://127.0.0.1:60573",
   [junit4]   2>   "numShards":"1",
   [junit4]   2>   "roles":null,
   [junit4]   2>   "state":"down",
   [junit4]   2>   "shard":null,
   [junit4]   2>   "core":"collection1",
   [junit4]   2>   "operation":"state"} current state version: 0
   [junit4]   2> 1231045 INFO  (OverseerStateUpdate-94078442561208324-127.0.0.1:60573_-n_0000000000) [n:127.0.0.1:60573_    ] o.a.s.c.o.ReplicaMutator Update state numShards=1 message={
   [junit4]   2>   "node_name":"127.0.0.1:60573_",
   [junit4]   2>   "collection":"control_collection",
   [junit4]   2>   "base_url":"https://127.0.0.1:60573",
   [junit4]   2>   "numShards":"1",
   [junit4]   2>   "roles":null,
   [junit4]   2>   "state":"down",
   [junit4]   2>   "shard":null,
   [junit4]   2>   "core":"collection1",
   [junit4]   2>   "operation":"state"}
   [junit4]   2> 1231045 INFO  (OverseerStateUpdate-94078442561208324-127.0.0.1:60573_-n_0000000000) [n:127.0.0.1:60573_    ] o.a.s.c.o.ClusterStateMutator building a new cName: control_collection
   [junit4]   2> 1231045 INFO  (OverseerStateUpdate-94078442561208324-127.0.0.1:60573_-n_0000000000) [n:127.0.0.1:60573_    ] o.a.s.c.o.ReplicaMutator Assigning new node to shard shard=shard1
   [junit4]   2> 1231047 INFO  (zkCallback-1151-thread-1-processing-n:127.0.0.1:60573_) [n:127.0.0.1:60573_    ] o.a.s.c.c.ZkStateReader A cluster state change: WatchedEvent state:SyncConnected type:NodeDataChanged path:/clusterstate.json, has occurred - updating... (live nodes size: 1)
   [junit4]   2> 1231052 INFO  (zkCallback-1151-thread-1-processing-n:127.0.0.1:60573_) [n:127.0.0.1:60573_    ] o.a.s.c.c.ZkStateReader Updated cluster state version to 1
   [junit4]   2> 1232043 INFO  (coreLoadExecutor-3781-thread-1-processing-n:127.0.0.1:60573_) [n:127.0.0.1:60573_ c:control_collection   x:collection1] o.a.s.c.ZkController waiting to find shard id in clusterstate for collection1
   [junit4]   2> 1232044 INFO  (coreLoadExecutor-3781-thread-1-processing-n:127.0.0.1:60573_) [n:127.0.0.1:60573_ c:control_collection   x:collection1] o.a.s.c.ZkController Check for collection zkNode:control_collection
   [junit4]   2> 1232045 INFO  (coreLoadExecutor-3781-thread-1-processing-n:127.0.0.1:60573_) [n:127.0.0.1:60573_ c:control_collection   x:collection1] o.a.s.c.ZkController Collection zkNode exists
   [junit4]   2> 1232045 INFO  (coreLoadExecutor-3781-thread-1-processing-n:127.0.0.1:60573_) [n:127.0.0.1:60573_ c:control_collection   x:collection1] o.a.s.c.c.ZkStateReader Load collection config from:/collections/control_collection
   [junit4]   2> 1232046 INFO  (coreLoadExecutor-3781-thread-1-processing-n:127.0.0.1:60573_) [n:127.0.0.1:60573_ c:control_collection   x:collection1] o.a.s.c.c.ZkStateReader path=/collections/control_collection configName=conf1 specified config exists in ZooKeeper
   [junit4]   2> 1232046 INFO  (coreLoadExecutor-3781-thread-1-processing-n:127.0.0.1:60573_) [n:127.0.0.1:60573_ c:control_collection   x:collection1] o.a.s.c.SolrResourceLoader new SolrResourceLoader for directory: '/Users/jenkins/workspace/Lucene-Solr-5.x-MacOSX/solr/build/solr-core/test/J0/temp/solr.cloud.ChaosMonkeySafeLeaderTest_E5D67A84E70E48F6-001/control-001/cores/collection1/'
   [junit4]   2> 1232070 INFO  (coreLoadExecutor-3781-thread-1-processing-n:127.0.0.1:60573_) [n:127.0.0.1:60573_ c:control_collection   x:collection1] o.a.s.c.Config loaded config solrconfig.xml with version 0 
   [junit4]   2> 1232082 INFO  (coreLoadExecutor-3781-thread-1-processing-n:127.0.0.1:60573_) [n:127.0.0.1:60573_ c:control_collection   x:collection1] o.a.s.c.SolrConfig current version of requestparams : -1
   [junit4]   2> 1232103 INFO  (coreLoadExecutor-3781-thread-1-processing-n:127.0.0.1:60573_) [n:127.0.0.1:60573_ c:control_collection   x:collection1] o.a.s.c.SolrConfig Using Lucene MatchVersion: 5.3.0
   [junit4]   2> 1232149 INFO  (coreLoadExecutor-3781-thread-1-processing-n:127.0.0.1:60573_) [n:127.0.0.1:60573_ c:control_collection   x:collection1] o.a.s.c.Config Loaded SolrConfig: solrconfig.xml
   [junit4]   2> 1232151 INFO  (coreLoadExecutor-3781-thread-1-processing-n:127.0.0.1:60573_) [n:127.0.0.1:60573_ c:control_collection   x:collection1] o.a.s.s.IndexSchema Reading Solr Schema from /configs/conf1/schema.xml
   [junit4]   2> 1232158 INFO  (coreLoadExecutor-3781-thread-1-processing-n:127.0.0.1:60573_) [n:127.0.0.1:60573_ c:control_collection   x:collection1] o.a.s.s.IndexSchema [collection1] Schema name=test
   [junit4]   2> 1232418 INFO  (coreLoadExecutor-3781-thread-1-processing-n:127.0.0.1:60573_) [n:127.0.0.1:60573_ c:control_collection   x:collection1] o.a.s.s.IndexSchema default search field in schema is text
   [junit4]   2> 1232419 INFO  (coreLoadExecutor-3781-thread-1-processing-n:127.0.0.1:60573_) [n:127.0.0.1:60573_ c:control_collection   x:collection1] o.a.s.s.IndexSchema unique key field: id
   [junit4]   2> 1232421 INFO  (coreLoadExecutor-3781-thread-1-processing-n:127.0.0.1:60573_) [n:127.0.0.1:60573_ c:control_collection   x:collection1] o.a.s.s.FileExchangeRateProvider Reloading exchange rates from file currency.xml
   [junit4]   2> 1232425 INFO  (coreLoadExecutor-3781-thread-1-processing-n:127.0.0.1:60573_) [n:127.0.0.1:60573_ c:control_collection   x:collection1] o.a.s.s.FileExchangeRateProvider Reloading exchange rates from file currency.xml
   [junit4]   2> 1232465 INFO  (coreLoadExecutor-3781-thread-1-processing-n:127.0.0.1:60573_) [n:127.0.0.1:60573_ c:control_collection   x:collection1] o.a.s.c.CoreContainer Creating SolrCore 'collection1' using configuration from collection control_collection
   [junit4]   2> 1232465 INFO  (coreLoadExecutor-3781-thread-1-processing-n:127.0.0.1:60573_) [n:127.0.0.1:60573_ c:control_collection s:shard1 r:core_node1 x:collection1] o.a.s.c.SolrCore solr.StandardDirectoryFactory
   [junit4]   2> 1232465 INFO  (coreLoadExecutor-3781-thread-1-processing-n:127.0.0.1:60573_) [n:127.0.0.1:60573_ c:control_collection s:shard1 r:core_node1 x:collection1] o.a.s.c.SolrCore [[collection1] ] Opening new SolrCore at [/Users/jenkins/workspace/Lucene-Solr-5.x-MacOSX/solr/build/solr-core/test/J0/temp/solr.cloud.ChaosMonkeySafeLeaderTest_E5D67A84E70E48F6-001/control-001/cores/collection1/], dataDir=[null]
   [junit4]   2> 1232465 INFO  (coreLoadExecutor-3781-thread-1-processing-n:127.0.0.1:60573_) [n:127.0.0.1:60573_ c:control_collection s:shard1 r:core_node1 x:collection1] o.a.s.c.JmxMonitoredMap JMX monitoring is enabled. Adding Solr mbeans to JMX Server: com.sun.jmx.mbeanserver.JmxMBeanServer@8f35665
   [junit4]   2> 1232466 INFO  (coreLoadExecutor-3781-thread-1-processing-n:127.0.0.1:60573_) [n:127.0.0.1:60573_ c:control_collection s:shard1 r:core_node1 x:collection1] o.a.s.c.CachingDirectoryFactory return new directory for /Users/jenkins/workspace/Lucene-Solr-5.x-MacOSX/solr/build/solr-core/test/J0/temp/solr.cloud.ChaosMonkeySafeLeaderTest_E5D67A84E70E48F6-001/control-001/cores/collection1/data
   [junit4]   2> 1232467 INFO  (coreLoadExecutor-3781-thread-1-processing-n:127.0.0.1:60573_) [n:127.0.0.1:60573_ c:control_collection s:shard1 r:core_node1 x:collection1] o.a.s.c.SolrCore New index directory detected: old=null new=/Users/jenkins/workspace/Lucene-Solr-5.x-MacOSX/solr/build/solr-core/test/J0/temp/solr.cloud.ChaosMonkeySafeLeaderTest_E5D67A84E70E48F6-001/control-001/cores/collection1/data/index/
   [junit4]   2> 1232467 WARN  (coreLoadExecutor-3781-thread-1-processing-n:127.0.0.1:60573_) [n:127.0.0.1:60573_ c:control_collection s:shard1 r:core_node1 x:collection1] o.a.s.c.SolrCore [collection1] Solr index directory '/Users/jenkins/workspace/Lucene-Solr-5.x-MacOSX/solr/build/solr-core/test/J0/temp/solr.cloud.ChaosMonkeySafeLeaderTest_E5D67A84E70E48F6-001/control-001/cores/collection1/data/index' doesn't exist. Creating new index...
   [junit4]   2> 1232468 INFO  (coreLoadExecutor-3781-thread-1-processing-n:127.0.0.1:60573_) [n:127.0.0.1:60573_ c:control_collection s:shard1 r:core_node1 x:collection1] o.a.s.c.CachingDirectoryFactory return new directory for /Users/jenkins/workspace/Lucene-Solr-5.x-MacOSX/solr/build/solr-core/test/J0/temp/solr.cloud.ChaosMonkeySafeLeaderTest_E5D67A84E70E48F6-001/control-001/cores/collection1/data/index
   [junit4]   2> 1232468 INFO  (coreLoadExecutor-3781-thread-1-processing-n:127.0.0.1:60573_) [n:127.0.0.1:60573_ c:control_collection s:shard1 r:core_node1 x:collection1] o.a.s.u.RandomMergePolicy RandomMergePolicy wrapping class org.apache.lucene.index.LogByteSizeMergePolicy: [LogByteSizeMergePolicy: minMergeSize=1677721, mergeFactor=44, maxMergeSize=2147483648, maxMergeSizeForForcedMerge=9223372036854775807, calibrateSizeByDeletes=true, maxMergeDocs=2147483647, maxCFSSegmentSizeMB=8.796093022207999E12, noCFSRatio=0.41302749123028515]
   [junit4]   2> 1232472 INFO  (coreLoadExecutor-3781-thread-1-processing-n:127.0.0.1:60573_) [n:127.0.0.1:60573_ c:control_collection s:shard1 r:core_node1 x:collection1] o.a.s.c.SolrCore SolrDeletionPolicy.onCommit: commits: num=1
   [junit4]   2> 	commit{dir=/Users/jenkins/workspace/Lucene-Solr-5.x-MacOSX/solr/build/solr-core/test/J0/temp/solr.cloud.ChaosMonkeySafeLeaderTest_E5D67A84E70E48F6-001/control-001/cores/collection1/data/index,segFN=segments_1,generation=1}
   [junit4]   2> 1232472 INFO  (coreLoadExecutor-3781-thread-1-processing-n:127.0.0.1:60573_) [n:127.0.0.1:60573_ c:control_collection s:shard1 r:core_node1 x:collection1] o.a.s.c.SolrCore newest commit generation = 1
   [junit4]   2> 1232473 INFO  (OldIndexDirectoryCleanupThreadForCore-collection1) [n:127.0.0.1:60573_ c:control_collection s:shard1 r:core_node1 x:collection1] o.a.s.c.SolrCore Looking for old index directories to cleanup for core collection1 in /Users/jenkins/workspace/Lucene-Solr-5.x-MacOSX/solr/build/solr-core/test/J0/temp/solr.cloud.ChaosMonkeySafeLeaderTest_E5D67A84E70E48F6-001/control-001/cores/collection1/data/
   [junit4]   2> 1232478 INFO  (coreLoadExecutor-3781-thread-1-processing-n:127.0.0.1:60573_) [n:127.0.0.1:60573_ c:control_collection s:shard1 r:core_node1 x:collection1] o.a.s.u.p.UpdateRequestProcessorChain creating updateRequestProcessorChain "nodistrib"
   [junit4]   2> 1232478 INFO  (coreLoadExecutor-3781-thread-1-processing-n:127.0.0.1:60573_) [n:127.0.0.1:60573_ c:control_collection s:shard1 r:core_node1 x:collection1] o.a.s.u.p.UpdateRequestProcessorChain creating updateRequestProcessorChain "dedupe"
   [junit4]   2> 1232478 INFO  (coreLoadExecutor-3781-thread-1-processing-n:127.0.0.1:60573_) [n:127.0.0.1:60573_ c:control_collection s:shard1 r:core_node1 x:collection1] o.a.s.u.p.UpdateRequestProcessorChain inserting DistributedUpdateProcessorFactory into updateRequestProcessorChain "dedupe"
   [junit4]   2> 1232478 INFO  (coreLoadExecutor-3781-thread-1-processing-n:127.0.0.1:60573_) [n:127.0.0.1:60573_ c:control_collection s:shard1 r:core_node1 x:collection1] o.a.s.u.p.UpdateRequestProcessorChain creating updateRequestProcessorChain "stored_sig"
   [junit4]   2> 1232479 INFO  (coreLoadExecutor-3781-thread-1-processing-n:127.0.0.1:60573_) [n:127.0.0.1:60573_ c:control_collection s:shard1 r:core_node1 x:collection1] o.a.s.u.p.UpdateRequestProcessorChain inserting DistributedUpdateProcessorFactory into updateRequestProcessorChain "stored_sig"
   [junit4]   2> 1232479 INFO  (coreLoadExecutor-3781-thread-1-processing-n:127.0.0.1:60573_) [n:127.0.0.1:60573_ c:control_collection s:shard1 r:core_node1 x:collection1] o.a.s.u.p.UpdateRequestProcessorChain creating updateRequestProcessorChain "distrib-dup-test-chain-explicit"
   [junit4]   2> 1232479 INFO  (coreLoadExecutor-3781-thread-1-processing-n:127.0.0.1:60573_) [n:127.0.0.1:60573_ c:control_collection s:shard1 r:core_node1 x:collection1] o.a.s.u.p.UpdateRequestProcessorChain creating updateRequestProcessorChain "distrib-dup-test-chain-implicit"
   [junit4]   2> 1232480 INFO  (coreLoadExecutor-3781-thread-1-processing-n:127.0.0.1:60573_) [n:127.0.0.1:60573_ c:control_collection s:shard1 r:core_node1 x:collection1] o.a.s.u.p.UpdateRequestProcessorChain inserting DistributedUpdateProcessorFactory into updateRequestProcessorChain "distrib-dup-test-chain-implicit"
   [junit4]   2> 1232480 INFO  (coreLoadExecutor-3781-thread-1-processing-n:127.0.0.1:60573_) [n:127.0.0.1:60573_ c:control_collection s:shard1 r:core_node1 x:collection1] o.a.s.c.SolrCore no updateRequestProcessorChain defined as default, creating implicit default
   [junit4]   2> 1232491 INFO  (coreLoadExecutor-3781-thread-1-processing-n:127.0.0.1:60573_) [n:127.0.0.1:60573_ c:control_collection s:shard1 r:core_node1 x:collection1] o.a.s.h.l.XMLLoader xsltCacheLifetimeSeconds=60
   [junit4]   2> 1232493 INFO  (coreLoadExecutor-3781-thread-1-processing-n:127.0.0.1:60573_) [n:127.0.0.1:60573_ c:control_collection s:shard1 r:core_node1 x:collection1] o.a.s.h.l.XMLLoader xsltCacheLifetimeSeconds=60
   [junit4]   2> 1232495 INFO  (coreLoadExecutor-3781-thread-1-processing-n:127.0.0.1:60573_) [n:127.0.0.1:60573_ c:control_collection s:shard1 r:core_node1 x:collection1] o.a.s.h.l.XMLLoader xsltCacheLifetimeSeconds=60
   [junit4]   2> 1232497 INFO  (coreLoadExecutor-3781-thread-1-processing-n:127.0.0.1:60573_) [n:127.0.0.1:60573_ c:control_collection s:shard1 r:core_node1 x:collection1] o.a.s.h.l.XMLLoader xsltCacheLifetimeSeconds=60
   [junit4]   2> 1232503 INFO  (coreLoadExecutor-3781-thread-1-processing-n:127.0.0.1:60573_) [n:127.0.0.1:60573_ c:control_collection s:shard1 r:core_node1 x:collection1] o.a.s.c.RequestHandlers Registered paths: /update/json,/admin/plugins,/admin/system,/update/csv,/admin/threads,/replication,/admin/properties,/update,/admin/ping,/admin/logging,/schema,/config,standard,/admin/mbeans,/admin/file,/get,/admin/luke,/update/json/docs,/admin/segments
   [junit4]   2> 1232504 INFO  (coreLoadExecutor-3781-thread-1-processing-n:127.0.0.1:60573_) [n:127.0.0.1:60573_ c:control_collection s:shard1 r:core_node1 x:collection1] o.a.s.c.SolrCore Using default statsCache cache: org.apache.solr.search.stats.LocalStatsCache
   [junit4]   2> 1232505 INFO  (coreLoadExecutor-3781-thread-1-processing-n:127.0.0.1:60573_) [n:127.0.0.1:60573_ c:control_collection s:shard1 r:core_node1 x:collection1] o.a.s.u.UpdateHandler Using UpdateLog implementation: org.apache.solr.update.UpdateLog
   [junit4]   2> 1232505 INFO  (coreLoadExecutor-3781-thread-1-processing-n:127.0.0.1:60573_) [n:127.0.0.1:60573_ c:control_collection s:shard1 r:core_node1 x:collection1] o.a.s.u.UpdateLog Initializing UpdateLog: dataDir= defaultSyncLevel=FLUSH numRecordsToKeep=100 maxNumLogsToKeep=10 numVersionBuckets=65536
   [junit4]   2> 1232507 INFO  (coreLoadExecutor-3781-thread-1-processing-n:127.0.0.1:60573_) [n:127.0.0.1:60573_ c:control_collection s:shard1 r:core_node1 x:collection1] o.a.s.c.SolrCore Hard AutoCommit: disabled
   [junit4]   2> 1232507 INFO  (coreLoadExecutor-3781-thread-1-processing-n:127.0.0.1:60573_) [n:127.0.0.1:60573_ c:control_collection s:shard1 r:core_node1 x:collection1] o.a.s.c.SolrCore Soft AutoCommit: disabled
   [junit4]   2> 1232507 INFO  (coreLoadExecutor-3781-thread-1-processing-n:127.0.0.1:60573_) [n:127.0.0.1:60573_ c:control_collection s:shard1 r:core_node1 x:collection1] o.a.s.u.RandomMergePolicy RandomMergePolicy wrapping class org.apache.lucene.index.LogByteSizeMergePolicy: [LogByteSizeMergePolicy: minMergeSize=1677721, mergeFactor=24, maxMergeSize=2147483648, maxMergeSizeForForcedMerge=9223372036854775807, calibrateSizeByDeletes=true, maxMergeDocs=2147483647, maxCFSSegmentSizeMB=8.796093022207999E12, noCFSRatio=0.0]
   [junit4]   2> 1232508 INFO  (coreLoadExecutor-3781-thread-1-processing-n:127.0.0.1:60573_) [n:127.0.0.1:60573_ c:control_collection s:shard1 r:core_node1 x:collection1] o.a.s.c.SolrCore SolrDeletionPolicy.onInit: commits: num=1
   [junit4]   2> 	commit{dir=/Users/jenkins/workspace/Lucene-Solr-5.x-MacOSX/solr/build/solr-core/test/J0/temp/solr.cloud.ChaosMonkeySafeLeaderTest_E5D67A84E70E48F6-001/control-001/cores/collection1/data/index,segFN=segments_1,generation=1}
   [junit4]   2> 1232509 INFO  (coreLoadExecutor-3781-thread-1-processing-n:127.0.0.1:60573_) [n:127.0.0.1:60573_ c:control_collection s:shard1 r:core_node1 x:collection1] o.a.s.c.SolrCore newest commit generation = 1
   [junit4]   2> 1232509 INFO  (coreLoadExecutor-3781-thread-1-processing-n:127.0.0.1:60573_) [n:127.0.0.1:60573_ c:control_collection s:shard1 r:core_node1 x:collection1] o.a.s.s.SolrIndexSearcher Opening Searcher@7a8e2b1d[collection1] main
   [junit4]   2> 1232509 INFO  (coreLoadExecutor-3781-thread-1-processing-n:127.0.0.1:60573_) [n:127.0.0.1:60573_ c:control_collection s:shard1 r:core_node1 x:collection1] o.a.s.c.c.ZkStateReader Load collection config from:/collections/control_collection
   [junit4]   2> 1232511 INFO  (coreLoadExecutor-3781-thread-1-processing-n:127.0.0.1:60573_) [n:127.0.0.1:60573_ c:control_collection s:shard1 r:core_node1 x:collection1] o.a.s.c.c.ZkStateReader path=/collections/control_collection configName=conf1 specified config exists in ZooKeeper
   [junit4]   2> 1232511 INFO  (coreLoadExecutor-3781-thread-1-processing-n:127.0.0.1:60573_) [n:127.0.0.1:60573_ c:control_collection s:shard1 r:core_node1 x:collection1] o.a.s.r.ManagedResourceStorage Setting up ZooKeeper-based storage for the RestManager with znodeBase: /configs/conf1
   [junit4]   2> 1232512 INFO  (coreLoadExecutor-3781-thread-1-processing-n:127.0.0.1:60573_) [n:127.0.0.1:60573_ c:control_collection s:shard1 r:core_node1 x:collection1] o.a.s.r.ManagedResourceStorage Configured ZooKeeperStorageIO with znodeBase: /configs/conf1
   [junit4]   2> 1232512 INFO  (coreLoadExecutor-3781-thread-1-processing-n:127.0.0.1:60573_) [n:127.0.0.1:60573_ c:control_collection s:shard1 r:core_node1 x:collection1] o.a.s.r.RestManager Initializing RestManager with initArgs: {}
   [junit4]   2> 1232512 INFO  (coreLoadExecutor-3781-thread-1-processing-n:127.0.0.1:60573_) [n:127.0.0.1:60573_ c:control_collection s:shard1 r:core_node1 x:collection1] o.a.s.r.ManagedResourceStorage Reading _rest_managed.json using ZooKeeperStorageIO:path=/configs/conf1
   [junit4]   2> 1232513 INFO  (coreLoadExecutor-3781-thread-1-processing-n:127.0.0.1:60573_) [n:127.0.0.1:60573_ c:control_collection s:shard1 r:core_node1 x:collection1] o.a.s.r.ManagedResourceStorage No data found for znode /configs/conf1/_rest_managed.json
   [junit4]   2> 1232514 INFO  (coreLoadExecutor-3781-thread-1-processing-n:127.0.0.1:60573_) [n:127.0.0.1:60573_ c:control_collection s:shard1 r:core_node1 x:collection1] o.a.s.r.ManagedResourceStorage Loaded null at path _rest_managed.json using ZooKeeperStorageIO:path=/configs/conf1
   [junit4]   2> 1232514 INFO  (coreLoadExecutor-3781-thread-1-processing-n:127.0.0.1:60573_) [n:127.0.0.1:60573_ c:control_collection s:shard1 r:core_node1 x:collection1] o.a.s.r.RestManager Initializing 0 registered ManagedResources
   [junit4]   2> 1232514 INFO  (coreLoadExecutor-3781-thread-1-processing-n:127.0.0.1:60573_) [n:127.0.0.1:60573_ c:control_collection s:shard1 r:core_node1 x:collection1] o.a.s.h.ReplicationHandler Commits will be reserved for  10000
   [junit4]   2> 1232515 INFO  (searcherExecutor-3782-thread-1-processing-n:127.0.0.1:60573_ c:control_collection r:core_node1 x:collection1 s:shard1) [n:127.0.0.1:60573_ c:control_collection s:shard1 r:core_node1 x:collection1] o.a.s.c.SolrCore [collection1] Registered new searcher Searcher@7a8e2b1d[collection1] main{ExitableDirectoryReader(UninvertingDirectoryReader())}
   [junit4]   2> 1232515 INFO  (coreLoadExecutor-3781-thread-1-processing-n:127.0.0.1:60573_) [n:127.0.0.1:60573_ c:control_collection s:shard1 r:core_node1 x:collection1] o.a.s.u.UpdateLog Looking up max value of version field to seed version buckets
   [junit4]   2> 1232515 INFO  (coreLoadExecutor-3781-thread-1-processing-n:127.0.0.1:60573_) [n:127.0.0.1:60573_ c:control_collection s:shard1 r:core_node1 x:collection1] o.a.s.u.VersionInfo Refreshing highest value of _version_ for 65536 version buckets from index
   [junit4]   2> 1232516 INFO  (coreLoadExecutor-3781-thread-1-processing-n:127.0.0.1:60573_) [n:127.0.0.1:60573_ c:control_collection s:shard1 r:core_node1 x:collection1] o.a.s.u.VersionInfo No terms found for _version_, cannot seed version bucket highest value from index
   [junit4]   2> 1232516 INFO  (coreLoadExecutor-3781-thread-1-processing-n:127.0.0.1:60573_) [n:127.0.0.1:60573_ c:control_collection s:shard1 r:core_node1 x:collection1] o.a.s.u.UpdateLog Could not find max version in index or recent updates, using new clock 1505255083518984192
   [junit4]   2> 1232518 INFO  (coreLoadExecutor-3781-thread-1-processing-n:127.0.0.1:60573_) [n:127.0.0.1:60573_ c:control_collection s:shard1 r:core_node1 x:collection1] o.a.s.u.UpdateLog Took 2 ms to seed version buckets with highest version 1505255083518984192
   [junit4]   2> 1232518 INFO  (coreLoadExecutor-3781-thread-1-processing-n:127.0.0.1:60573_) [n:127.0.0.1:60573_ c:control_collection s:shard1 r:core_node1 x:collection1] o.a.s.c.ZkController watch zkdir /configs/conf1
   [junit4]   2> 1232519 INFO  (coreLoadExecutor-3781-thread-1-processing-n:127.0.0.1:60573_) [n:127.0.0.1:60573_ c:control_collection s:shard1 r:core_node1 x:collection1] o.a.s.c.CoreContainer registering core: collection1
   [junit4]   2> 1232520 INFO  (coreZkRegister-3775-thread-1-processing-n:127.0.0.1:60573_ c:control_collection r:core_node1 x:collection1 s:shard1) [n:127.0.0.1:60573_ c:control_collection s:shard1 r:core_node1 x:collection1] o.a.s.c.ZkController Register replica - core:collection1 address:https://127.0.0.1:60573 collection:control_collection shard:shard1
   [junit4]   2> 1232522 INFO  (coreZkRegister-3775-thread-1-processing-n:127.0.0.1:60573_ c:control_collection r:core_node1 x:collection1 s:shard1) [n:127.0.0.1:60573_ c:control_collection s:shard1 r:core_node1 x:collection1] o.a.s.c.c.SolrZkClient makePath: /collections/control_collection/leader_elect/shard1/election
   [junit4]   2> 1232531 INFO  (coreZkRegister-3775-thread-1-processing-n:127.0.0.1:60573_ c:control_collection r:core_node1 x:collection1 s:shard1) [n:127.0.0.1:60573_ c:control_collection s:shard1 r:core_node1 x:collection1] o.a.s.c.LeaderElector Joined leadership election with path: /collections/control_collection/leader_elect/shard1/election/94078442561208324-core_node1-n_0000000000
   [junit4]   2> 1232533 INFO  (coreZkRegister-3775-thread-1-processing-n:127.0.0.1:60573_ c:control_collection r:core_node1 x:collection1 s:shard1) [n:127.0.0.1:60573_ c:control_collection s:shard1 r:core_node1 x:collection1] o.a.s.c.ShardLeaderElectionContext Running the leader process for shard shard1
   [junit4]   2> 1232536 INFO  (zkCallback-1151-thread-1-processing-n:127.0.0.1:60573_) [n:127.0.0.1:60573_    ] o.a.s.c.DistributedQueue NodeChildrenChanged fired on path /overseer/queue state SyncConnected
   [junit4]   2> 1232537 INFO  (coreZkRegister-3775-thread-1-processing-n:127.0.0.1:60573_ c:control_collection r:core_node1 x:collection1 s:shard1) [n:127.0.0.1:60573_ c:control_collection s:shard1 r:core_node1 x:collection1] o.a.s.c.ShardLeaderElectionContext Enough replicas found to continue.
   [junit4]   2> 1232537 INFO  (coreZkRegister-3775-thread-1-processing-n:127.0.0.1:60573_ c:control_collection r:core_node1 x:collection1 s:shard1) [n:127.0.0.1:60573_ c:control_collection s:shard1 r:core_node1 x:collection1] o.a.s.c.ShardLeaderElectionContext I may be the new leader - try and sync
   [junit4]   2> 1232537 INFO  (coreZkRegister-3775-thread-1-processing-n:127.0.0.1:60573_ c:control_collection r:core_node1 x:collection1 s:shard1) [n:127.0.0.1:60573_ c:control_collection s:shard1 r:core_node1 x:collection1] o.a.s.c.SyncStrategy Sync replicas to https://127.0.0.1:60573/collection1/
   [junit4]   2> 1232537 INFO  (coreZkRegister-3775-thread-1-processing-n:127.0.0.1:60573_ c:control_collection r:core_node1 x:collection1 s:shard1) [n:127.0.0.1:60573_ c:control_collection s:shard1 r:core_node1 x:collection1] o.a.s.c.SyncStrategy Sync Success - now sync replicas to me
   [junit4]   2> 1232537 INFO  (coreZkRegister-3775-thread-1-processing-n:127.0.0.1:60573_ c:control_collection r:core_node1 x:collection1 s:shard1) [n:127.0.0.1:60573_ c:control_collection s:shard1 r:core_node1 x:collection1] o.a.s.c.SyncStrategy https://127.0.0.1:60573/collection1/ has no replicas
   [junit4]   2> 1232537 INFO  (coreZkRegister-3775-thread-1-processing-n:127.0.0.1:60573_ c:control_collection r:core_node1 x:collection1 s:shard1) [n:127.0.0.1:60573_ c:control_collection s:shard1 r:core_node1 x:collection1] o.a.s.c.ShardLeaderElectionContext I am the new leader: https://127.0.0.1:60573/collection1/ shard1
   [junit4]   2> 1232538 INFO  (coreZkRegister-3775-thread-1-processing-n:127.0.0.1:60573_ c:control_collection r:core_node1 x:collection1 s:shard1) [n:127.0.0.1:60573_ c:control_collection s:shard1 r:core_node1 x:collection1] o.a.s.c.c.SolrZkClient makePath: /collections/control_collection/leaders/shard1
   [junit4]   2> 1232538 INFO  (OverseerStateUpdate-94078442561208324-127.0.0.1:60573_-n_0000000000) [n:127.0.0.1:60573_    ] o.a.s.c.Overseer processMessage: queueSize: 1, message = {
   [junit4]   2>   "operation":"leader",
   [junit4]   2>   "shard":"shard1",
   [junit4]   2>   "collection":"control_collection"} current state version: 1
   [junit4]   2> 1232547 INFO  (zkCallback-1151-thread-1-processing-n:127.0.0.1:60573_) [n:127.0.0.1:60573_    ] o.a.s.c.DistributedQueue NodeChildrenChanged fired on path /overseer/queue state SyncConnected
   [junit4]   2> 1232549 INFO  (OverseerStateUpdate-94078442561208324-127.0.0.1:60573_-n_0000000000) [n:127.0.0.1:60573_    ] o.a.s.c.Overseer processMessage: queueSize: 1, message = {
   [junit4]   2>   "operation":"leader",
   [junit4]   2>   "shard":"shard1",
   [junit4]   2>   "collection":"control_collection",
   [junit4]   2>   "base_url":"https://127.0.0.1:60573",
   [junit4]   2>   "core":"collection1",
   [junit4]   2>   "state":"active"} current state version: 1
   [junit4]   2> 1232550 INFO  (TEST-ChaosMonkeySafeLeaderTest.test-seed#[E5D67A84E70E48F6]) [    ] o.a.s.c.c.SolrZkClient Using default ZkCredentialsProvider
   [junit4]   2> 1232551 INFO  (zkCallback-1151-thread-1-processing-n:127.0.0.1:60573_) [n:127.0.0.1:60573_    ] o.a.s.c.c.ZkStateReader A cluster state change: WatchedEvent state:SyncConnected type:NodeDataChanged path:/clusterstate.json, has occurred - updating... (live nodes size: 1)
   [junit4]   2> 1232551 INFO  (TEST-ChaosMonkeySafeLeaderTest.test-seed#[E5D67A84E70E48F6]) [    ] o.a.s.c.c.ConnectionManager Waiting for client to connect to ZooKeeper
   [junit4]   2> 1232554 INFO  (zkCallback-1153-thread-1) [    ] o.a.s.c.c.ConnectionManager Watcher org.apache.solr.common.cloud.ConnectionManager@56f1444b name:ZooKeeperConnection Watcher:127.0.0.1:60569/solr got event WatchedEvent state:SyncConnected type:None path:null path:null type:None
   [junit4]   2> 1232554 INFO  (TEST-ChaosMonkeySafeLeaderTest.test-seed#[E5D67A84E70E48F6]) [    ] o.a.s.c.c.ConnectionManager Client is connected to ZooKeeper
   [junit4]   2> 1232555 INFO  (TEST-ChaosMonkeySafeLeaderTest.test-seed#[E5D67A84E70E48F6]) [    ] o.a.s.c.c.SolrZkClient Using default ZkACLProvider
   [junit4]   2> 1232555 INFO  (TEST-ChaosMonkeySafeLeaderTest.test-seed#[E5D67A84E70E48F6]) [    ] o.a.s.c.c.ZkStateReader Updating cluster state from ZooKeeper... 
   [junit4]   2> 1232556 INFO  (zkCallback-1151-thread-1-processing-n:127.0.0.1:60573_) [n:127.0.0.1:60573_    ] o.a.s.c.c.ZkStateReader Updated cluster state version to 2
   [junit4]   2> 1232561 INFO  (TEST-ChaosMonkeySafeLeaderTest.test-seed#[E5D67A84E70E48F6]) [    ] o.a.s.c.ChaosMonkey monkey: init - expire sessions:false cause connection loss:false
   [junit4]   2> 1232561 INFO  (TEST-ChaosMonkeySafeLeaderTest.test-seed#[E5D67A84E70E48F6]) [    ] o.a.s.c.AbstractFullDistribZkTestBase Creating collection1 with stateFormat=2
   [junit4]   2> 1232562 INFO  (TEST-ChaosMonkeySafeLeaderTest.test-seed#[E5D67A84E70E48F6]) [    ] o.a.s.c.c.SolrZkClient Using default ZkCredentialsProvider
   [junit4]   2> 1232562 INFO  (TEST-ChaosMonkeySafeLeaderTest.test-seed#[E5D67A84E70E48F6]) [    ] o.a.s.c.c.ConnectionManager Waiting for client to connect to ZooKeeper
   [junit4]   2> 1232565 INFO  (zkCallback-1154-thread-1) [    ] o.a.s.c.c.ConnectionManager Watcher org.apache.solr.common.cloud.ConnectionManager@d33c92a name:ZooKeeperConnection Watcher:127.0.0.1:60569/solr got event WatchedEvent state:SyncConnected type:None path:null path:null type:None
   [junit4]   2> 1232565 INFO  (TEST-ChaosMonkeySafeLeaderTest.test-seed#[E5D67A84E70E48F6]) [    ] o.a.s.c.c.ConnectionManager Client is connected to ZooKeeper
   [junit4]   2> 1232566 INFO  (TEST-ChaosMonkeySafeLeaderTest.test-seed#[E5D67A84E70E48F6]) [    ] o.a.s.c.c.SolrZkClient Using default ZkACLProvider
   [junit4]   2> 1232569 INFO  (zkCallback-1151-thread-1-processing-n:127.0.0.1:60573_) [n:127.0.0.1:60573_    ] o.a.s.c.DistributedQueue NodeChildrenChanged fired on path /overseer/queue state SyncConnected
   [junit4]   2> 1232571 INFO  (OverseerStateUpdate-94078442561208324-127.0.0.1:60573_-n_0000000000) [n:127.0.0.1:60573_    ] o.a.s.c.Overseer processMessage: queueSize: 1, message = {
   [junit4]   2>   "operation":"create",
   [junit4]   2>   "name":"collection1",
   [junit4]   2>   "numShards":"3",
   [junit4]   2>   "stateFormat":"2"} current state version: 2
   [junit4]   2> 1232571 INFO  (OverseerStateUpdate-94078442561208324-127.0.0.1:60573_-n_0000000000) [n:127.0.0.1:60573_    ] o.a.s.c.o.ClusterStateMutator building a new cName: collection1
   [junit4]   2> 1232600 INFO  (coreZkRegister-3775-thread-1-processing-n:127.0.0.1:60573_ c:control_collection r:core_node1 x:collection1 s:shard1) [n:127.0.0.1:60573_ c:control_collection s:shard1 r:core_node1 x:collection1] o.a.s.c.ZkController We are https://127.0.0.1:60573/collection1/ and leader is https://127.0.0.1:60573/collection1/
   [junit4]   2> 1232600 INFO  (coreZkRegister-3775-thread-1-processing-n:127.0.0.1:60573_ c:control_collection r:core_node1 x:collection1 s:shard1) [n:127.0.0.1:60573_ c:control_collection s:shard1 r:core_node1 x:collection1] o.a.s.c.ZkController No LogReplay needed for core=collection1 baseURL=https://127.0.0.1:60573
   [junit4]   2> 1232600 INFO  (coreZkRegister-3775-thread-1-processing-n:127.0.0.1:60573_ c:control_collection r:core_node1 x:collection1 s:shard1) [n:127.0.0.1:60573_ c:control_collection s:shard1 r:core_node1 x:collection1] o.a.s.c.ZkController I am the leader, no recovery necessary
   [junit4]   2> 1232600 INFO  (coreZkRegister-3775-thread-1-processing-n:127.0.0.1:60573_ c:control_collection r:core_node1 x:collection1 s:shard1) [n:127.0.0.1:60573_ c:control_collection s:shard1 r:core_node1 x:collection1] o.a.s.c.ZkController publishing state=active
   [junit4]   2> 1232600 INFO  (coreZkRegister-3775-thread-1-processing-n:127.0.0.1:60573_ c:control_collection r:core_node1 x:collection1 s:shard1) [n:127.0.0.1:60573_ c:control_collection s:shard1 r:core_node1 x:collection1] o.a.s.c.ZkController numShards not found on descriptor - reading it from system property
   [junit4]   2> 1232603 INFO  (zkCallback-1151-thread-1-processing-n:127.0.0.1:60573_) [n:127.0.0.1:60573_    ] o.a.s.c.DistributedQueue NodeChildrenChanged fired on path /overseer/queue state SyncConnected
   [junit4]   2> 1232605 INFO  (OverseerStateUpdate-94078442561208324-127.0.0.1:60573_-n_0000000000) [n:127.0.0.1:60573_    ] o.a.s.c.Overseer processMessage: queueSize: 1, message = {
   [junit4]   2>   "node_name":"127.0.0.1:60573_",
   [junit4]   2>   "collection":"control_collection",
   [junit4]   2>   "base_url":"https://127.0.0.1:60573",
   [junit4]   2>   "numShards":"3",
   [junit4]   2>   "roles":null,
   [junit4]   2>   "core_node_name":"core_node1",
   [junit4]   2>   "state":"active",
   [junit4]   2>   "shard":"shard1",
   [junit4]   2>   "core":"collection1",
   [junit4]   2>   "operation":"state"} current state version: 2
   [junit4]   2> 1232607 INFO  (OverseerStateUpdate-94078442561208324-127.0.0.1:60573_-n_0000000000) [n:127.0.0.1:60573_    ] o.a.s.c.o.ReplicaMutator Update state numShards=3 message={
   [junit4]   2>   "node_name":"127.0.0.1:60573_",
   [junit4]   2>   "collection":"control_collection",
   [junit4]   2>   "base_url":"https://127.0.0.1:60573",
   [junit4]   2>   "numShards":"3",
   [junit4]   2>   "roles":null,
   [junit4]   2>   "core_node_name":"core_node1",
   [junit4]   2>   "state":"active",
   [junit4]   2>   "shard":"shard1",
   [junit4]   2>   "core":"collection1",
   [junit4]   2>   "operation":"state"}
   [junit4]   2> 1232608 INFO  (OverseerStateUpdate-94078442561208324-127.0.0.1:60573_-n_0000000000) [n:127.0.0.1:60573_    ] o.a.s.c.o.ZkStateWriter going to create_collection /collections/collection1/state.json
   [junit4]   2> 1232611 INFO  (zkCallback-1151-thread-1-processing-n:127.0.0.1:60573_) [n:127.0.0.1:60573_    ] o.a.s.c.c.ZkStateReader A cluster state change: WatchedEvent state:SyncConnected type:NodeDataChanged path:/clusterstate.json, has occurred - updating... (live nodes size: 1)
   [junit4]   2> 1232611 INFO  (zkCallback-1153-thread-1) [    ] o.a.s.c.c.ZkStateReader A cluster state change: WatchedEvent state:SyncConnected type:NodeDataChanged path:/clusterstate.json, has occurred - updating... (live nodes size: 1)
   [junit4]   2> 1232618 INFO  (zkCallback-1153-thread-1) [    ] o.a.s.c.c.ZkStateReader Updated cluster state version to 3
   [junit4]   2> 1232618 INFO  (zkCallback-1151-thread-1-processing-n:127.0.0.1:60573_) [n:127.0.0.1:60573_    ] o.a.s.c.c.ZkStateReader Updated cluster state version to 3
   [junit4]   2> 1232726 INFO  (zkCallback-1151-thread-1-processing-n:127.0.0.1:60573_) [n:127.0.0.1:60573_    ] o.a.s.c.c.ZkStateReader A cluster state change: WatchedEvent state:SyncConnected type:NodeDataChanged path:/clusterstate.json, has occurred - updating... (live nodes size: 1)
   [junit4]   2> 1232726 INFO  (zkCallback-1153-thread-1) [    ] o.a.s.c.c.ZkStateReader A cluster state change: WatchedEvent state:SyncConnected type:NodeDataChanged path:/clusterstate.json, has occurred - updating... (live nodes size: 1)
   [junit4]   2> 1232731 INFO  (zkCallback-1153-thread-1) [    ] o.a.s.c.c.ZkStateReader Updated cluster state version to 4
   [junit4]   2> 1232731 INFO  (zkCallback-1151-thread-1-processing-n:127.0.0.1:60573_) [n:127.0.0.1:60573_    ] o.a.s.c.c.ZkStateReader Updated cluster state version to 4
   [junit4]   2> 1232934 INFO  (TEST-ChaosMonkeySafeLeaderTest.test-seed#[E5D67A84E70E48F6]) [    ] o.a.s.SolrTestCaseJ4 Writing core.properties file to /Users/jenkins/workspace/Lucene-Solr-5.x-MacOSX/solr/build/solr-core/test/J0/temp/solr.cloud.ChaosMonkeySafeLeaderTest_E5D67A84E70E48F6-001/shard-1-001/cores/collection1
   [junit4]   2> 1232936 INFO  (TEST-ChaosMonkeySafeLeaderTest.test-seed#[E5D67A84E70E48F6]) [    ] o.a.s.c.AbstractFullDistribZkTestBase create jetty 1 in directory /Users/jenkins/workspace/Lucene-Solr-5.x-MacOSX/solr/build/solr-core/test/J0/temp/solr.cloud.ChaosMonkeySafeLeaderTest_E5D67A84E70E48F6-001/shard-1-001
   [junit4]   2> 1232937 INFO  (TEST-ChaosMonkeySafeLeaderTest.test-seed#[E5D67A84E70E48F6]) [    ] o.e.j.s.Server jetty-9.2.11.v20150529
   [junit4]   2> 1232941 INFO  (TEST-ChaosMonkeySafeLeaderTest.test-seed#[E5D67A84E70E48F6]) [    ] o.e.j.s.h.ContextHandler Started o.e.j.s.ServletContextHandler@6eb5c8db{/,null,AVAILABLE}
   [junit4]   2> 1232945 INFO  (TEST-ChaosMonkeySafeLeaderTest.test-seed#[E5D67A84E70E48F6]) [    ] o.e.j.s.ServerConnector Started ServerConnector@6095daa5{SSL-http/1.1}{127.0.0.1:60578}
   [junit4]   2> 1232946 INFO  (TEST-ChaosMonkeySafeLeaderTest.test-seed#[E5D67A84E70E48F6]) [    ] o.e.j.s.Server Started @1239693ms
   [junit4]   2> 1232946 INFO  (TEST-ChaosMonkeySafeLeaderTest.test-seed#[E5D67A84E70E48F6]) [    ] o.a.s.c.s.e.JettySolrRunner Jetty properties: {coreRootDirectory=/Users/jenkins/workspace/Lucene-Solr-5.x-MacOSX/solr/build/solr-core/test/J0/temp/solr.cloud.ChaosMonkeySafeLeaderTest_E5D67A84E70E48F6-001/shard-1-001/cores, hostPort=60578, solrconfig=solrconfig.xml, solr.data.dir=/Users/jenkins/workspace/Lucene-Solr-5.x-MacOSX/solr/build/solr-core/test/J0/temp/solr.cloud.ChaosMonkeySafeLeaderTest_E5D67A84E70E48F6-001/tempDir-001/jetty1, hostContext=/}
   [junit4]   2> 1232948 INFO  (TEST-ChaosMonkeySafeLeaderTest.test-seed#[E5D67A84E70E48F6]) [    ] o.a.s.s.SolrDispatchFilter SolrDispatchFilter.init(): sun.misc.Launcher$AppClassLoader@6629a046
   [junit4]   2> 1232949 INFO  (TEST-ChaosMonkeySafeLeaderTest.test-seed#[E5D67A84E70E48F6]) [    ] o.a.s.c.SolrResourceLoader new SolrResourceLoader for directory: '/Users/jenkins/workspace/Lucene-Solr-5.x-MacOSX/solr/build/solr-core/test/J0/temp/solr.cloud.ChaosMonkeySafeLeaderTest_E5D67A84E70E48F6-001/shard-1-001/'
   [junit4]   2> 1232980 INFO  (TEST-ChaosMonkeySafeLeaderTest.test-seed#[E5D67A84E70E48F6]) [    ] o.a.s.c.SolrXmlConfig Loading container configuration from /Users/jenkins/workspace/Lucene-Solr-5.x-MacOSX/solr/build/solr-core/test/J0/temp/solr.cloud.ChaosMonkeySafeLeaderTest_E5D67A84E70E48F6-001/shard-1-001/solr.xml
   [junit4]   2> 1233011 INFO  (TEST-ChaosMonkeySafeLeaderTest.test-seed#[E5D67A84E70E48F6]) [    ] o.a.s.c.CoresLocator Config-defined core root directory: /Users/jenkins/workspace/Lucene-Solr-5.x-MacOSX/solr/build/solr-core/test/J0/temp/solr.cloud.ChaosMonkeySafeLeaderTest_E5D67A84E70E48F6-001/shard-1-001/cores
   [junit4]   2> 1233011 INFO  (TEST-ChaosMonkeySafeLeaderTest.test-seed#[E5D67A84E70E48F6]) [    ] o.a.s.c.CoreContainer New CoreContainer 603695705
   [junit4]   2> 1233011 INFO  (TEST-ChaosMonkeySafeLeaderTest.test-seed#[E5D67A84E70E48F6]) [    ] o.a.s.c.CoreContainer Loading cores into CoreContainer [instanceDir=/Users/jenkins/workspace/Lucene-Solr-5.x-MacOSX/solr/build/solr-core/test/J0/temp/solr.cloud.ChaosMonkeySafeLeaderTest_E5D67A84E70E48F6-001/shard-1-001/]
   [junit4]   2> 1233011 INFO  (TEST-ChaosMonkeySafeLeaderTest.test-seed#[E5D67A84E70E48F6]) [    ] o.a.s.c.CoreContainer loading shared library: /Users/jenkins/workspace/Lucene-Solr-5.x-MacOSX/solr/build/solr-core/test/J0/temp/solr.cloud.ChaosMonkeySafeLeaderTest_E5D67A84E70E48F6-001/shard-1-001/lib
   [junit4]   2> 1233012 WARN  (TEST-ChaosMonkeySafeLeaderTest.test-seed#[E5D67A84E70E48F6]) [    ] o.a.s.c.SolrResourceLoader Can't find (or read) directory to add to classloader: lib (resolved as: /Users/jenkins/workspace/Lucene-Solr-5.x-MacOSX/solr/build/solr-core/test/J0/temp/solr.cloud.ChaosMonkeySafeLeaderTest_E5D67A84E70E48F6-001/shard-1-001/lib).
   [junit4]   2> 1233022 INFO  (TEST-ChaosMonkeySafeLeaderTest.test-seed#[E5D67A84E70E48F6]) [    ] o.a.s.h.c.HttpShardHandlerFactory created with socketTimeout : 90000,urlScheme : ,connTimeout : 15000,maxConnectionsPerHost : 20,maxConnections : 10000,corePoolSize : 0,maximumPoolSize : 2147483647,maxThreadIdleTime : 5,sizeOfQueue : -1,fairnessPolicy : false,useRetries : false,
   [junit4]   2> 1233026 INFO  (TEST-ChaosMonkeySafeLeaderTest.test-seed#[E5D67A84E70E48F6]) [    ] o.a.s.u.UpdateShardHandler Creating UpdateShardHandler HTTP client with params: socketTimeout=340000&connTimeout=45000&retry=true
   [junit4]   2> 1233029 INFO  (TEST-ChaosMonkeySafeLeaderTest.test-seed#[E5D67A84E70E48F6]) [    ] o.a.s.l.LogWatcher SLF4J impl is org.slf4j.impl.Log4jLoggerFactory
   [junit4]   2> 1233029 INFO  (TEST-ChaosMonkeySafeLeaderTest.test-seed#[E5D67A84E70E48F6]) [    ] o.a.s.l.LogWatcher Registering Log Listener [Log4j (org.slf4j.impl.Log4jLoggerFactory)]
   [junit4]   2> 1233029 INFO  (TEST-ChaosMonkeySafeLeaderTest.test-seed#[E5D67A84E70E48F6]) [    ] o.a.s.c.ZkContainer Zookeeper client=127.0.0.1:60569/solr
   [junit4]   2> 1233029 INFO  (TEST-ChaosMonkeySafeLeaderTest.test-seed#[E5D67A84E70E48F6]) [    ] o.a.s.c.ZkController zkHost includes chroot
   [junit4]   2> 1233029 INFO  (TEST-ChaosMonkeySafeLeaderTest.test-seed#[E5D67A84E70E48F6]) [    ] o.a.s.c.c.SolrZkClient Using default ZkCredentialsProvider
   [junit4]   2> 1233030 INFO  (TEST-ChaosMonkeySafeLeaderTest.test-seed#[E5D67A84E70E48F6]) [    ] o.a.s.c.c.ConnectionManager Waiting for client to connect to ZooKeeper
   [junit4]   2> 1233033 INFO  (zkCallback-1156-thread-1) [    ] o.a.s.c.c.ConnectionManager Watcher org.apache.solr.common.cloud.ConnectionManager@74eff36b name:ZooKeeperConnection Watcher:127.0.0.1:60569 got event WatchedEvent state:SyncConnected type:None path:null path:null type:None
   [junit4]   2> 1233033 INFO  (TEST-ChaosMonkeySafeLeaderTest.test-seed#[E5D67A84E70E48F6]) [    ] o.a.s.c.c.ConnectionManager Client is connected to ZooKeeper
   [junit4]   2> 1233033 INFO  (TEST-ChaosMonkeySafeLeaderTest.test-seed#[E5D67A84E70E48F6]) [    ] o.a.s.c.c.SolrZkClient Using default ZkACLProvider
   [junit4]   2> 1233036 INFO  (TEST-ChaosMonkeySafeLeaderTest.test-seed#[E5D67A84E70E48F6]) [n:127.0.0.1:60578_    ] o.a.s.c.c.ConnectionManager Waiting for client to connect to ZooKeeper
   [junit4]   2> 1233038 INFO  (zkCallback-1157-thread-1-processing-n:127.0.0.1:60578_) [n:127.0.0.1:60578_    ] o.a.s.c.c.ConnectionManager Watcher org.apache.solr.common.cloud.ConnectionManager@6f616161 name:ZooKeeperConnection Watcher:127.0.0.1:60569/solr got event WatchedEvent state:SyncConnected type:None path:null path:null type:None
   [junit4]   2> 1233038 INFO  (TEST-ChaosMonkeySafeLeaderTest.test-seed#[E5D67A84E70E48F6]) [n:127.0.0.1:60578_    ] o.a.s.c.c.ConnectionManager Client is connected to ZooKeeper
   [junit4]   2> 1233051 INFO  (TEST-ChaosMonkeySafeLeaderTest.test-seed#[E5D67A84E70E48F6]) [n:127.0.0.1:60578_    ] o.a.s.c.c.ZkStateReader Updating cluster state from ZooKeeper... 
   [junit4]   2> 1234065 INFO  (TEST-ChaosMonkeySafeLeaderTest.test-seed#[E5D67A84E70E48F6]) [n:127.0.0.1:60578_    ] o.a.s.c.ZkController Register node as live in ZooKeeper:/live_nodes/127.0.0.1:60578_
   [junit4]   2> 1234066 INFO  (TEST-ChaosMonkeySafeLeaderTest.test-seed#[E5D67A84E70E48F6]) [n:127.0.0.1:60578_    ] o.a.s.c.c.SolrZkClient makePath: /live_nodes/127.0.0.1:60578_
   [junit4]   2> 1234072 INFO  (TEST-ChaosMonkeySafeLeaderTest.test-seed#[E5D67A84E70E48F6]) [n:127.0.0.1:60578_    ] o.a.s.c.Overseer Overseer (id=null) closing
   [junit4]   2> 1234074 INFO  (TEST-ChaosMonkeySafeLeaderTest.test-seed#[E5D67A84E70E48F6]) [n:127.0.0.1:60578_    ] o.a.s.c.LeaderElector Joined leadership election with path: /overseer_elect/election/94078442561208328-127.0.0.1:60578_-n_0000000001
   [junit4]   2> 1234076 INFO  (TEST-ChaosMonkeySafeLeaderTest.test-seed#[E5D67A84E70E48F6]) [n:127.0.0.1:60578_    ] o.a.s.c.LeaderElector Watching path /overseer_elect/election/94078442561208324-127.0.0.1:60573_-n_0000000000 to know if I could be the leader
   [junit4]   2> 1234077 INFO  (TEST-ChaosMonkeySafeLeaderTest.test-seed#[E5D67A84E70E48F6]) [n:127.0.0.1:60578_    ] o.a.s.c.CoreContainer No authentication plugin used.
   [junit4]   2> 1234078 INFO  (TEST-ChaosMonkeySafeLeaderTest.test-seed#[E5D67A84E70E48F6]) [n:127.0.0.1:60578_    ] o.a.s.c.CoreContainer Security conf doesn't exist. Skipping setup for authorization module.
   [junit4]   2> 1234079 INFO  (TEST-ChaosMonkeySafeLeaderTest.test-seed#[E5D67A84E70E48F6]) [n:127.0.0.1:60578_    ] o.a.s.c.CoresLocator Looking for core definitions underneath /Users/jenkins/workspace/Lucene-Solr-5.x-MacOSX/solr/build/solr-core/test/J0/temp/solr.cloud.ChaosMonkeySafeLeaderTest_E5D67A84E70E48F6-001/shard-1-001/cores
   [junit4]   2> 1234080 INFO  (TEST-ChaosMonkeySafeLeaderTest.test-seed#[E5D67A84E70E48F6]) [n:127.0.0.1:60578_    ] o.a.s.c.SolrCore Created CoreDescriptor: {loadOnStartup=true, name=collection1, coreNodeName=, transient=false, collection=collection1, instanceDir=/Users/jenkins/workspace/Lucene-Solr-5.x-MacOSX/solr/build/solr-core/test/J0/temp/solr.cloud.ChaosMonkeySafeLeaderTest_E5D67A84E70E48F6-001/shard-1-001/cores/collection1, config=solrconfig.xml, absoluteInstDir=/Users/jenkins/workspace/Lucene-Solr-5.x-MacOSX/solr/build/solr-core/test/J0/temp/solr.cloud.ChaosMonkeySafeLeaderTest_E5D67A84E70E48F6-001/shard-1-001/cores/collection1/, dataDir=data/, schema=schema.xml, shard=}
   [junit4]   2> 1234080 INFO  (TEST-ChaosMonkeySafeLeaderTest.test-seed#[E5D67A84E70E48F6]) [n:127.0.0.1:60578_    ] o.a.s.c.CoresLocator Found core collection1 in /Users/jenkins/workspace/Lucene-Solr-5.x-MacOSX/solr/build/solr-core/test/J0/temp/solr.cloud.ChaosMonkeySafeLeaderTest_E5D67A84E70E48F6-001/shard-1-001/cores/collection1/
   [junit4]   2> 1234080 INFO  (TEST-ChaosMonkeySafeLeaderTest.test-seed#[E5D67A84E70E48F6]) [n:127.0.0.1:60578_    ] o.a.s.c.CoresLocator Found 1 core definitions
   [junit4]   2> 1234083 INFO  (TEST-ChaosMonkeySafeLeaderTest.test-seed#[E5D67A84E70E48F6]) [n:127.0.0.1:60578_    ] o.a.s.s.SolrDispatchFilter user.dir=/Users/jenkins/workspace/Lucene-Solr-5.x-MacOSX/solr/build/solr-core/test/J0
   [junit4]   2> 1234083 INFO  (TEST-ChaosMonkeySafeLeaderTest.test-seed#[E5D67A84E70E48F6]) [n:127.0.0.1:60578_    ] o.a.s.s.SolrDispatchFilter SolrDispatchFilter.init() done
   [junit4]   2> 1234085 INFO  (coreLoadExecutor-3792-thread-1-processing-n:127.0.0.1:60578_) [n:127.0.0.1:60578_ c:collection1   x:collection1] o.a.s.c.ZkController publishing state=down
   [junit4]   2> 1234086 INFO  (coreLoadExecutor-3792-thread-1-processing-n:127.0.0.1:60578_) [n:127.0.0.1:60578_ c:collection1   x:collection1] o.a.s.c.ZkController numShards not found on descriptor - reading it from system property
   [junit4]   2> 1234088 INFO  (zkCallback-1151-thread-1-processing-n:127.0.0.1:60573_) [n:127.0.0.1:60573_    ] o.a.s.c.DistributedQueue NodeChildrenChanged fired on path /overseer/queue state SyncConnected
   [junit4]   2> 1234089 INFO  (coreLoadExecutor-3792-thread-1-processing-n:127.0.0.1:60578_) [n:127.0.0.1:60578_ c:collection1   x:collection1] o.a.s.c.ZkController Registering watch for external collection collection1
   [junit4]   2> 1234089 INFO  (coreLoadExecutor-3792-thread-1-processing-n:127.0.0.1:60578_) [n:127.0.0.1:60578_ c:collection1   x:collection1] o.a.s.c.c.ZkStateReader addZkWatch collection1
   [junit4]   2> 1234090 INFO  (coreLoadExecutor-3792-thread-1-processing-n:127.0.0.1:60578_) [n:127.0.0.1:60578_ c:collection1   x:collection1] o.a.s.c.c.ZkStateReader Updating collection state at /collections/collection1/state.json from ZooKeeper... 
   [junit4]   2> 1234091 INFO  (OverseerStateUpdate-94078442561208324-127.0.0.1:60573_-n_0000000000) [n:127.0.0.1:60573_    ] o.a.s.c.Overseer processMessage: queueSize: 1, message = {
   [junit4]   2>   "node_name":"127.0.0.1:60578_",
   [junit4]   2>   "collection":"collection1",
   [junit4]   2>   "base_url":"https://127.0.0.1:60578",
   [junit4]   2>   "numShards":"3",
   [junit4]   2>   "roles":null,
   [junit4]   2>   "state":"down",
   [junit4]   2>   "shard":null,
   [junit4]   2>   "core":"collection1",
   [junit4]   2>   "operation":"state"} current state version: 4
   [junit4]   2> 1234092 INFO  (coreLoadExecutor-3792-thread-1-processing-n:127.0.0.1:60578_) [n:127.0.0.1:60578_ c:collection1   x:collection1] o.a.s.c.c.ZkStateReader Updating data for collection1 to ver 0 
   [junit4]   2> 1234092 INFO  (coreLoadExecutor-3792-thread-1-processing-n:127.0.0.1:60578_) [n:127.0.0.1:60578_ c:collection1   x:collection1] o.a.s.c.ZkController look for our core node name
   [junit4]   2> 1234092 INFO  (OverseerStateUpdate-94078442561208324-127.0.0.1:60573_-n_0000000000) [n:127.0.0.1:60573_    ] o.a.s.c.o.ReplicaMutator Update state numShards=3 message={
   [junit4]   2>   "node_name":"127.0.0.1:60578_",
   [junit4]   2>   "collection":"collection1",
   [junit4]   2>   "base_url":"https://127.0.0.1:60578",
   [junit4]   2>   "numShards":"3",
   [junit4]   2>   "roles":null,
   [junit4]   2>   "state":"down",
   [junit4]   2>   "shard":null,
   [junit4]   2>   "core":"collection1",
   [junit4]   2>   "operation":"state"}
   [junit4]   2> 1234093 INFO  (OverseerStateUpdate-94078442561208324-127.0.0.1:60573_-n_0000000000) [n:127.0.0.1:60573_    ] o.a.s.c.o.ReplicaMutator Collection already exists with numShards=3
   [junit4]   2> 1234093 INFO  (OverseerStateUpdate-94078442561208324-127.0.0.1:60573_-n_0000000000) [n:127.0.0.1:60573_    ] o.a.s.c.o.ReplicaMutator Assigning new node to shard shard=shard2
   [junit4]   2> 1234201 INFO  (OverseerStateUpdate-94078442561208324-127.0.0.1:60573_-n_0000000000) [n:127.0.0.1:60573_    ] o.a.s.c.o.ZkStateWriter going to update_collection /collections/collection1/state.json version: 0
   [junit4]   2> 1234202 INFO  (zkCallback-1157-thread-1-processing-n:127.0.0.1:60578_) [n:127.0.0.1:60578_    ] o.a.s.c.c.ZkStateReader A cluster state change: WatchedEvent state:SyncConnected type:NodeDataChanged path:/collections/collection1/state.json for collection collection1 has occurred - updating... (live nodes size: 2)
   [junit4]   2> 1234203 INFO  (zkCallback-1157-thread-1-processing-n:127.0.0.1:60578_) [n:127.0.0.1:60578_    ] o.a.s.c.c.ZkStateReader Updating data for collection1 to ver 1 
   [junit4]   2> 1235095 INFO  (coreLoadExecutor-3792-thread-1-processing-n:127.0.0.1:60578_) [n:127.0.0.1:60578_ c:collection1   x:collection1] o.a.s.c.ZkController waiting to find shard id in clusterstate for collection1
   [junit4]   2> 1235095 INFO  (coreLoadExecutor-3792-thread-1-processing-n:127.0.0.1:60578_) [n:127.0.0.1:60578_ c:collection1   x:collection1] o.a.s.c.ZkController Check for collection zkNode:collection1
   [junit4]   2> 1235096 INFO  (coreLoadExecutor-3792-thread-1-processing-n:127.0.0.1:60578_) [n:127.0.0.1:60578_ c:collection1   x:collection1] o.a.s.c.ZkController Collection zkNode exists
   [junit4]   2> 1235096 INFO  (coreLoadExecutor-3792-thread-1-processing-n:127.0.0.1:60578_) [n:127.0.0.1:60578_ c:collection1   x:collection1] o.a.s.c.c.ZkStateReader Load collection config from:/collections/collection1
   [junit4]   2> 1235098 INFO  (coreLoadExecutor-3792-thread-1-processing-n:127.0.0.1:60578_) [n:127.0.0.1:60578_ c:collection1   x:collection1] o.a.s.c.c.ZkStateReader path=/collections/collection1 configName=conf1 specified config exists in ZooKeeper
   [junit4]   2> 1235099 INFO  (coreLoadExecutor-3792-thread-1-processing-n:127.0.0.1:60578_) [n:127.0.0.1:60578_ c:collection1   x:collection1] o.a.s.c.SolrResourceLoader new SolrResourceLoader for directory: '/Users/jenkins/workspace/Lucene-Solr-5.x-MacOSX/solr/build/solr-core/test/J0/temp/solr.cloud.ChaosMonkeySafeLeaderTest_E5D67A84E70E48F6-001/shard-1-001/cores/collection1/'
   [junit4]   2> 1235119 INFO  (coreLoadExecutor-3792-thread-1-processing-n:127.0.0.1:60578_) [n:127.0.0.1:60578_ c:collection1   x:collection1] o.a.s.c.Config loaded config solrconfig.xml with version 0 
   [junit4]   2> 1235129 INFO  (coreLoadExecutor-3792-thread-1-processing-n:127.0.0.1:60578_) [n:127.0.0.1:60578_ c:collection1   x:collection1] o.a.s.c.SolrConfig current version of requestparams : -1
   [junit4]   2> 1235146 INFO  (coreLoadExecutor-3792-thread-1-processing-n:127.0.0.1:60578_) [n:127.0.0.1:60578_ c:collection1   x:collection1] o.a.s.c.SolrConfig Using Lucene MatchVersion: 5.3.0
   [junit4]   2> 1235184 INFO  (coreLoadExecutor-3792-thread-1-processing-n:127.0.0.1:60578_) [n:127.0.0.1:60578_ c:collection1   x:collection1] o.a.s.c.Config Loaded SolrConfig: solrconfig.xml
   [junit4]   2> 1235186 INFO  (coreLoadExecutor-3792-thread-1-processing-n:127.0.0.1:60578_) [n:127.0.0.1:60578_ c:collection1   x:collection1] o.a.s.s.IndexSchema Reading Solr Schema from /configs/conf1/schema.xml
   [junit4]   2> 1235194 INFO  (coreLoadExecutor-3792-thread-1-processing-n:127.0.0.1:60578_) [n:127.0.0.1:60578_ c:collection1   x:collection1] o.a.s.s.IndexSchema [collection1] Schema name=test
   [junit4]   2> 1235509 INFO  (coreLoadExecutor-3792-thread-1-processing-n:127.0.0.1:60578_) [n:127.0.0.1:60578_ c:collection1   x:collection1] o.a.s.s.IndexSchema default search field in schema is text
   [junit4]   2> 1235510 INFO  (coreLoadExecutor-3792-thread-1-processing-n:127.0.0.1:60578_) [n:127.0.0.1:60578_ c:collection1   x:collection1] o.a.s.s.IndexSchema unique key field: id
   [junit4]   2> 1235511 INFO  (coreLoadExecutor-3792-thread-1-processing-n:127.0.0.1:60578_) [n:127.0.0.1:60578_ c:collection1   x:collection1] o.a.s.s.FileExchangeRateProvider Reloading exchange rates from file currency.xml
   [junit4]   2> 1235516 INFO  (coreLoadExecutor-3792-thread-1-processing-n:127.0.0.1:60578_) [n:127.0.0.1:60578_ c:collection1   x:collection1] o.a.s.s.FileExchangeRateProvider Reloading exchange rates from file currency.xml
   [junit4]   2> 1235556 INFO  (coreLoadExecutor-3792-thread-1-processing-n:127.0.0.1:60578_) [n:127.0.0.1:60578_ c:collection1   x:collection1] o.a.s.c.CoreContainer Creating SolrCore 'collection1' using configuration from collection collection1
   [junit4]   2> 1235556 INFO  (coreLoadExecutor-3792-thread-1-processing-n:127.0.0.1:60578_) [n:127.0.0.1:60578_ c:collection1 s:shard2 r:core_node1 x:collection1] o.a.s.c.SolrCore solr.StandardDirectoryFactory
   [junit4]   2> 1235557 INFO  (coreLoadExecutor-3792-thread-1-processing-n:127.0.0.1:60578_) [n:127.0.0.1:60578_ c:collection1 s:shard2 r:core_node1 x:collection1] o.a.s.c.SolrCore [[collection1] ] Opening new SolrCore at [/Users/jenkins/workspace/Lucene-Solr-5.x-MacOSX/solr/build/solr-core/test/J0/temp/solr.cloud.ChaosMonkeySafeLeaderTest_E5D67A84E70E48F6-001/shard-1-001/cores/collection1/], dataDir=[null]
   [junit4]   2> 1235557 INFO  (coreLoadExecutor-3792-thread-1-processing-n:127.0.0.1:60578_) [n:127.0.0.1:60578_ c:collection1 s:shard2 r:core_node1 x:collection1] o.a.s.c.JmxMonitoredMap JMX monitoring is enabled. Adding Solr mbeans to JMX Server: com.sun.jmx.mbeanserver.JmxMBeanServer@8f35665
   [junit4]   2> 1235558 INFO  (coreLoadExecutor-3792-thread-1-processing-n:127.0.0.1:60578_) [n:127.0.0.1:60578_ c:collection1 s:shard2 r:core_node1 x:collection1] o.a.s.c.CachingDirectoryFactory return new directory for /Users/jenkins/workspace/Lucene-Solr-5.x-MacOSX/solr/build/solr-core/test/J0/temp/solr.cloud.ChaosMonkeySafeLeaderTest_E5D67A84E70E48F6-001/shard-1-001/cores/collection1/data
   [junit4]   2> 1235558 INFO  (coreLoadExecutor-3792-thread-1-processing-n:127.0.0.1:60578_) [n:127.0.0.1:60578_ c:collection1 s:shard2 r:core_node1 x:collection1] o.a.s.c.SolrCore New index directory detected: old=null new=/Users/jenkins/workspace/Lucene-Solr-5.x-MacOSX/solr/build/solr-core/test/J0/temp/solr.cloud.ChaosMonkeySafeLeaderTest_E5D67A84E70E48F6-001/shard-1-001/cores/collection1/data/index/
   [junit4]   2> 1235559 WARN  (coreLoadExecutor-3792-thread-1-processing-n:127.0.0.1:60578_) [n:127.0.0.1:60578_ c:collection1 s:shard2 r:core_node1 x:collection1] o.a.s.c.SolrCore [collection1] Solr index directory '/Users/jenkins/workspace/Lucene-Solr-5.x-MacOSX/solr/build/solr-core/test/J0/temp/solr.cloud.ChaosMonkeySafeLeaderTest_E5D67A84E70E48F6-001/shard-1-001/cores/collection1/data/index' doesn't exist. Creating new index...
   [junit4]   2> 1235559 INFO  (coreLoadExecutor-3792-thread-1-processing-n:127.0.0.1:60578_) [n:127.0.0.1:60578_ c:collection1 s:shard2 r:core_node1 x:collection1] o.a.s.c.CachingDirectoryFactory return new directory for /Users/jenkins/workspace/Lucene-Solr-5.x-MacOSX/solr/build/solr-core/test/J0/temp/solr.cloud.ChaosMonkeySafeLeaderTest_E5D67A84E70E48F6-001/shard-1-001/cores/collection1/data/index
   [junit4]   2> 1235560 INFO  (coreLoadExecutor-3792-thread-1-processing-n:127.0.0.1:60578_) [n:127.0.0.1:60578_ c:collection1 s:shard2 r:core_node1 x:collection1] o.a.s.u.RandomMergePolicy RandomMergePolicy wrapping class org.apache.lucene.index.LogByteSizeMergePolicy: [LogByteSizeMergePolicy: minMergeSize=1677721, mergeFactor=44, maxMergeSize=2147483648, maxMergeSizeForForcedMerge=9223372036854775807, calibrateSizeByDeletes=true, maxMergeDocs=2147483647, maxCFSSegmentSizeMB=8.796093022207999E12, noCFSRatio=0.41302749123028515]
   [junit4]   2> 1235562 INFO  (coreLoadExecutor-3792-thread-1-processing-n:127.0.0.1:60578_) [n:127.0.0.1:60578_ c:collection1 s:shard2 r:core_node1 x:collection1] o.a.s.c.SolrCore SolrDeletionPolicy.onCommit: commits: num=1
   [junit4]   2> 	commit{dir=/Users/jenkins/workspace/Lucene-Solr-5.x-MacOSX/solr/build/solr-core/test/J0/temp/solr.cloud.ChaosMonkeySafeLeaderTest_E5D67A84E70E48F6-001/shard-1-001/cores/collection1/data/index,segFN=segments_1,generation=1}
   [junit4]   2> 1235563 INFO  (coreLoadExecutor-3792-thread-1-processing-n:127.0.0.1:60578_) [n:127.0.0.1:60578_ c:collection1 s:shard2 r:core_node1 x:collection1] o.a.s.c.SolrCore newest commit generation = 1
   [junit4]   2> 1235564 INFO  (OldIndexDirectoryCleanupThreadForCore-collection1) [n:127.0.0.1:60578_ c:collection1 s:shard2 r:core_node1 x:collection1] o.a.s.c.SolrCore Looking for old index directories to cleanup for core collection1 in /Users/jenkins/workspace/Lucene-Solr-5.x-MacOSX/solr/build/solr-core/test/J0/temp/solr.cloud.ChaosMonkeySafeLeaderTest_E5D67A84E70E48F6-001/shard-1-001/cores/collection1/data/
   [junit4]   2> 1235569 INFO  (coreLoadExecutor-3792-thread-1-processing-n:127.0.0.1:60578_) [n:127.0.0.1:60578_ c:collection1 s:shard2 r:core_node1 x:collection1] o.a.s.u.p.UpdateRequestProcessorChain creating updateRequestProcessorChain "nodistrib"
   [junit4]   2> 1235570 INFO  (coreLoadExecutor-3792-thread-1-processing-n:127.0.0.1:60578_) [n:127.0.0.1:60578_ c:collection1 s:shard2 r:core_node1 x:collection1] o.a.s.u.p.UpdateRequestProcessorChain creating updateRequestProcessorChain "dedupe"
   [junit4]   2> 1235570 INFO  (coreLoadExecutor-3792-thread-1-processing-n:127.0.0.1:60578_) [n:127.0.0.1:60578_ c:collection1 s:shard2 r:core_node1 x:collection1] o.a.s.u.p.UpdateRequestProcessorChain inserting DistributedUpdateProcessorFactory into updateRequestProcessorChain "dedupe"
   [junit4]   2> 1235570 INFO  (coreLoadExecutor-3792-thread-1-processing-n:127.0.0.1:60578_) [n:127.0.0.1:60578_ c:collection1 s:shard2 r:core_node1 x:collection1] o.a.s.u.p.UpdateRequestProcessorChain creating updateRequestProcessorChain "stored_sig"
   [junit4]   2> 1235570 INFO  (coreLoadExecutor-3792-thread-1-processing-n:127.0.0.1:60578_) [n:127.0.0.1:60578_ c:collection1 s:shard2 r:core_node1 x:collection1] o.a.s.u.p.UpdateRequestProcessorChain inserting DistributedUpdateProcessorFactory into updateRequestProcessorChain "stored_sig"
   [junit4]   2> 1235571 INFO  (coreLoadExecutor-3792-thread-1-processing-n:127.0.0.1:60578_) [n:127.0.0.1:60578_ c:collection1 s:shard2 r:core_node1 x:collection1] o.a.s.u.p.UpdateRequestProcessorChain creating updateRequestProcessorChain "distrib-dup-test-chain-explicit"
   [junit4]   2> 1235572 INFO  (coreLoadExecutor-3792-thread-1-processing-n:127.0.0.1:60578_) [n:127.0.0.1:60578_ c:collection1 s:shard2 r:core_node1 x:collection1] o.a.s.u.p.UpdateRequestProcessorChain creating updateRequestProcessorChain "distrib-dup-test-chain-implicit"
   [junit4]   2> 1235572 INFO  (coreLoadExecutor-3792-thread-1-processing-n:127.0.0.1:60578_) [n:127.0.0.1:60578_ c:collection1 s:shard2 r:core_node1 x:collection1] o.a.s.u.p.UpdateRequestProcessorChain inserting DistributedUpdateProcessorFactory into updateRequestProcessorChain "distrib-dup-test-chain-implicit"
   [junit4]   2> 1235572 INFO  (coreLoadExecutor-3792-thread-1-processing-n:127.0.0.1:60578_) [n:127.0.0.1:60578_ c:collection1 s:shard2 r:core_node1 x:collection1] o.a.s.c.SolrCore no updateRequestProcessorChain defined as default, creating implicit default
   [junit4]   2> 1235583 INFO  (coreLoadExecutor-3792-thread-1-processing-n:127.0.0.1:60578_) [n:127.0.0.1:60578_ c:collection1 s:shard2 r:core_node1 x:collection1] o.a.s.h.l.XMLLoader xsltCacheLifetimeSeconds=60
   [junit4]   2> 1235585 INFO  (coreLoadExecutor-3792-thread-1-processing-n:127.0.0.1:60578_) [n:127.0.0.1:60578_ c:collection1 s:shard2 r:core_node1 x:collection1] o.a.s.h.l.XMLLoader xsltCacheLifetimeSeconds=60
   [junit4]   2> 1235587 INFO  (coreLoadExecutor-3792-thread-1-processing-n:127.0.0.1:60578_) [n:127.0.0.1:60578_ c:collection1 s:shard2 r:core_node1 x:collection1] o.a.s.h.l.XMLLoader xsltCacheLifetimeSeconds=60
   [junit4]   2> 1235589 INFO  (coreLoadExecutor-3792-thread-1-processing-n:127.0.0.1:60578_) [n:127.0.0.1:60578_ c:collection1 s:shard2 r:core_node1 x:collection1] o.a.s.h.l.XMLLoader xsltCacheLifetimeSeconds=60
   [junit4]   2> 1235597 INFO  (coreLoadExecutor-3792-thread-1-processing-n:127.0.0.1:60578_) [n:127.0.0.1:60578_ c:collection1 s:shard2 r:core_node1 x:collection1] o.a.s.c.RequestHandlers Registered paths: /update/json,/admin/plugins,/admin/system,/update/csv,/admin/threads,/replication,/admin/properties,/update,/admin/ping,/admin/logging,/schema,/config,standard,/admin/mbeans,/admin/file,/get,/admin/luke,/update/json/docs,/admin/segments
   [junit4]   2> 1235598 INFO  (coreLoadExecutor-3792-thread-1-processing-n:127.0.0.1:60578_) [n:127.0.0.1:60578_ c:collection1 s:shard2 r:core_node1 x:collectio

[...truncated too long message...]

#[E5D67A84E70E48F6]) [n:127.0.0.1:60608_ c:collection1 s:shard1 r:core_node5 x:collection1] o.a.s.c.CachingDirectoryFactory looking to close /Users/jenkins/workspace/Lucene-Solr-5.x-MacOSX/solr/build/solr-core/test/J0/temp/solr.cloud.ChaosMonkeySafeLeaderTest_E5D67A84E70E48F6-001/shard-5-001/cores/collection1/data/index [CachedDir<<refCount=0;path=/Users/jenkins/workspace/Lucene-Solr-5.x-MacOSX/solr/build/solr-core/test/J0/temp/solr.cloud.ChaosMonkeySafeLeaderTest_E5D67A84E70E48F6-001/shard-5-001/cores/collection1/data/index;done=false>>]
   [junit4]   2> 1274473 INFO  (TEST-ChaosMonkeySafeLeaderTest.test-seed#[E5D67A84E70E48F6]) [n:127.0.0.1:60608_ c:collection1 s:shard1 r:core_node5 x:collection1] o.a.s.c.CachingDirectoryFactory Closing directory: /Users/jenkins/workspace/Lucene-Solr-5.x-MacOSX/solr/build/solr-core/test/J0/temp/solr.cloud.ChaosMonkeySafeLeaderTest_E5D67A84E70E48F6-001/shard-5-001/cores/collection1/data/index
   [junit4]   2> 1274476 INFO  (TEST-ChaosMonkeySafeLeaderTest.test-seed#[E5D67A84E70E48F6]) [n:127.0.0.1:60608_ c:collection1 s:shard1 r:core_node5 x:collection1] o.a.s.c.Overseer Overseer (id=94078442561208338-127.0.0.1:60608_-n_0000000006) closing
   [junit4]   2> 1274476 INFO  (OverseerStateUpdate-94078442561208338-127.0.0.1:60608_-n_0000000006) [n:127.0.0.1:60608_    ] o.a.s.c.Overseer Overseer Loop exiting : 127.0.0.1:60608_
   [junit4]   2> 1275982 WARN  (zkCallback-1174-thread-2-processing-n:127.0.0.1:60608_) [n:127.0.0.1:60608_    ] o.a.s.c.c.ZkStateReader ZooKeeper watch triggered, but Solr cannot talk to ZK
   [junit4]   2> 1275985 INFO  (TEST-ChaosMonkeySafeLeaderTest.test-seed#[E5D67A84E70E48F6]) [    ] o.e.j.s.ServerConnector Stopped ServerConnector@1120c510{SSL-http/1.1}{127.0.0.1:60608}
   [junit4]   2> 1275987 INFO  (TEST-ChaosMonkeySafeLeaderTest.test-seed#[E5D67A84E70E48F6]) [    ] o.e.j.s.h.ContextHandler Stopped o.e.j.s.ServletContextHandler@75a2c4b6{/,null,UNAVAILABLE}
   [junit4]   2> 1275991 INFO  (TEST-ChaosMonkeySafeLeaderTest.test-seed#[E5D67A84E70E48F6]) [n:127.0.0.1:60608_ c:collection1 s:shard1 r:core_node5 x:collection1] o.a.s.c.ZkTestServer connecting to 127.0.0.1:60569 60569
   [junit4]   2> 1276021 INFO  (Thread-3140) [    ] o.a.s.c.ZkTestServer connecting to 127.0.0.1:60569 60569
   [junit4]   2> 1276924 WARN  (Thread-3140) [    ] o.a.s.c.ZkTestServer Watch limit violations: 
   [junit4]   2> Maximum concurrent create/delete watches above limit:
   [junit4]   2> 
   [junit4]   2> 	9	/solr/aliases.json
   [junit4]   2> 	9	/solr/clusterstate.json
   [junit4]   2> 	8	/solr/configs/conf1
   [junit4]   2> 	7	/solr/collections/collection1/state.json
   [junit4]   2> 
   [junit4]   2> Maximum concurrent data watches above limit:
   [junit4]   2> 
   [junit4]   2> 	3	/solr/overseer_elect/election/94078442561208332-127.0.0.1:60595_-n_0000000003
   [junit4]   2> 	2	/solr/collections/collection1/leader_elect/shard2/election/94078442561208328-core_node1-n_0000000000
   [junit4]   2> 	2	/solr/collections/collection1/leader_elect/shard1/election/94078442561208330-core_node2-n_0000000000
   [junit4]   2> 
   [junit4]   2> Maximum concurrent children watches above limit:
   [junit4]   2> 
   [junit4]   2> 	7	/solr/live_nodes
   [junit4]   2> 	3	/solr/overseer/collection-queue-work
   [junit4]   2> 	3	/solr/overseer/queue
   [junit4]   2> 
   [junit4]   2> NOTE: reproduce with: ant test  -Dtestcase=ChaosMonkeySafeLeaderTest -Dtests.method=test -Dtests.seed=E5D67A84E70E48F6 -Dtests.slow=true -Dtests.locale=sr -Dtests.timezone=Etc/GMT-7 -Dtests.asserts=true -Dtests.file.encoding=ISO-8859-1
   [junit4] FAILURE 46.9s J0 | ChaosMonkeySafeLeaderTest.test <<<
   [junit4]    > Throwable #1: java.lang.AssertionError: shard1 is not consistent.  Got 203 from https://127.0.0.1:60584/collection1lastClient and got 96 from https://127.0.0.1:60608/collection1
   [junit4]    > 	at __randomizedtesting.SeedInfo.seed([E5D67A84E70E48F6:6D82455E49F2250E]:0)
   [junit4]    > 	at org.apache.solr.cloud.AbstractFullDistribZkTestBase.checkShardConsistency(AbstractFullDistribZkTestBase.java:1244)
   [junit4]    > 	at org.apache.solr.cloud.AbstractFullDistribZkTestBase.checkShardConsistency(AbstractFullDistribZkTestBase.java:1223)
   [junit4]    > 	at org.apache.solr.cloud.ChaosMonkeySafeLeaderTest.test(ChaosMonkeySafeLeaderTest.java:165)
   [junit4]    > 	at org.apache.solr.BaseDistributedSearchTestCase$ShardsRepeatRule$ShardsFixedStatement.callStatement(BaseDistributedSearchTestCase.java:960)
   [junit4]    > 	at org.apache.solr.BaseDistributedSearchTestCase$ShardsRepeatRule$ShardsStatement.evaluate(BaseDistributedSearchTestCase.java:935)
   [junit4]    > 	at java.lang.Thread.run(Thread.java:745)
   [junit4]   2> 1277018 INFO  (SUITE-ChaosMonkeySafeLeaderTest-seed#[E5D67A84E70E48F6]-worker) [n:127.0.0.1:60608_ c:collection1 s:shard1 r:core_node5 x:collection1] o.a.s.SolrTestCaseJ4 ###deleteCore
   [junit4]   2> NOTE: leaving temporary files on disk at: /Users/jenkins/workspace/Lucene-Solr-5.x-MacOSX/solr/build/solr-core/test/J0/temp/solr.cloud.ChaosMonkeySafeLeaderTest_E5D67A84E70E48F6-001
   [junit4]   2> NOTE: test params are: codec=Asserting(Lucene53): {_version_=PostingsFormat(name=MockRandom), id=PostingsFormat(name=Direct), a_t=PostingsFormat(name=MockRandom), rnd_b=PostingsFormat(name=Direct), a_i=PostingsFormat(name=Direct)}, docValues:{}, sim=DefaultSimilarity, locale=sr, timezone=Etc/GMT-7
   [junit4]   2> NOTE: Mac OS X 10.8.5 x86_64/Oracle Corporation 1.7.0_80 (64-bit)/cpus=3,threads=1,free=248571880,total=535822336
   [junit4]   2> NOTE: All tests run in this JVM: [TestDocumentBuilder, HardAutoCommitTest, SimpleFacetsTest, SuggesterWFSTTest, TestBM25SimilarityFactory, TestAddFieldRealTimeGet, CoreAdminCreateDiscoverTest, TestLRUCache, TestIndexingPerformance, AnalysisErrorHandlingTest, AddSchemaFieldsUpdateProcessorFactoryTest, DistributedFacetPivotSmallAdvancedTest, TestFunctionQuery, AddBlockUpdateTest, AlternateDirectoryTest, OutOfBoxZkACLAndCredentialsProvidersTest, DirectUpdateHandlerTest, QueryElevationComponentTest, TestBinaryField, SortByFunctionTest, HdfsDirectoryFactoryTest, TestShardHandlerFactory, TestJmxIntegration, CacheHeaderTest, LukeRequestHandlerTest, TestIndexSearcher, ScriptEngineTest, TestNoOpRegenerator, TestCSVResponseWriter, UUIDUpdateProcessorFallbackTest, TestSort, HdfsThreadLeakTest, HdfsNNFailoverTest, DistanceUnitsTest, TestStressLucene, CachingDirectoryFactoryTest, TestDynamicFieldCollectionResource, TestCursorMarkWithoutUniqueKey, AsyncCallRequestStatusResponseTest, ZkCLITest, RecoveryAfterSoftCommitTest, TestObjectReleaseTracker, TestDefaultStatsCache, TestSolrQueryParserResource, DocumentAnalysisRequestHandlerTest, TestReplicaProperties, TestReqParamsAPI, TestQueryTypes, RuleEngineTest, SampleTest, ClusterStateUpdateTest, TestSimpleTrackingShardHandler, TestJsonRequest, TestAnalyzedSuggestions, OverriddenZkACLAndCredentialsProvidersTest, TestExtendedDismaxParser, SoftAutoCommitTest, TestBulkSchemaAPI, TestUniqueKeyFieldResource, DocValuesMissingTest, TestSimpleQParserPlugin, TestSchemaNameResource, TestExactStatsCache, SynonymTokenizerTest, TestSmileRequest, CustomCollectionTest, TestLeaderElectionZkExpiry, BufferStoreTest, DistributedQueueTest, ResponseLogComponentTest, RemoteQueryErrorTest, DocValuesMultiTest, TriLevelCompositeIdRoutingTest, TestPerFieldSimilarity, TestReloadAndDeleteDocs, SuggesterTest, SolrCoreCheckLockOnStartupTest, SpatialHeatmapFacetsTest, TestQueryUtils, TestAtomicUpdateErrorCases, VMParamsZkACLAndCredentialsProvidersTest, DateRangeFieldTest, TestSolr4Spatial2, TestMissingGroups, VersionInfoTest, TestHashPartitioner, DistribDocExpirationUpdateProcessorTest, TestDocBasedVersionConstraints, TestCharFilters, TestManagedSchemaDynamicFieldResource, SolrInfoMBeanTest, ConcurrentDeleteAndCreateCollectionTest, TestCustomDocTransformer, TestElisionMultitermQuery, PrimUtilsTest, TestSweetSpotSimilarityFactory, TestOmitPositions, TestFieldTypeResource, TestSolrConfigHandlerConcurrent, URLClassifyProcessorTest, TestFreeTextSuggestions, TestShortCircuitedRequests, AnalyticsMergeStrategyTest, DeleteReplicaTest, PeerSyncTest, SimpleCollectionCreateDeleteTest, NoCacheHeaderTest, TestSchemaResource, TestWordDelimiterFilterFactory, SSLMigrationTest, TestConfigSets, FacetPivotSmallTest, TestInitParams, SuggesterFSTTest, ShardSplitTest, DistributedDebugComponentTest, SolrTestCaseJ4Test, TestNonDefinedSimilarityFactory, TestExceedMaxTermLength, OverseerTest, DistributedFacetPivotWhiteBoxTest, PathHierarchyTokenizerFactoryTest, DistributedVersionInfoTest, BasicDistributedZkTest, ChaosMonkeySafeLeaderTest]
   [junit4] Completed [226/507] on J0 in 47.00s, 1 test, 1 failure <<< FAILURES!

[...truncated 900 lines...]
BUILD FAILED
/Users/jenkins/workspace/Lucene-Solr-5.x-MacOSX/build.xml:536: The following error occurred while executing this line:
/Users/jenkins/workspace/Lucene-Solr-5.x-MacOSX/build.xml:484: The following error occurred while executing this line:
/Users/jenkins/workspace/Lucene-Solr-5.x-MacOSX/build.xml:61: The following error occurred while executing this line:
/Users/jenkins/workspace/Lucene-Solr-5.x-MacOSX/extra-targets.xml:39: The following error occurred while executing this line:
/Users/jenkins/workspace/Lucene-Solr-5.x-MacOSX/solr/build.xml:230: The following error occurred while executing this line:
/Users/jenkins/workspace/Lucene-Solr-5.x-MacOSX/solr/common-build.xml:512: The following error occurred while executing this line:
/Users/jenkins/workspace/Lucene-Solr-5.x-MacOSX/lucene/common-build.xml:1444: The following error occurred while executing this line:
/Users/jenkins/workspace/Lucene-Solr-5.x-MacOSX/lucene/common-build.xml:999: There were test failures: 507 suites, 2008 tests, 1 failure, 64 ignored (24 assumptions)

Total time: 100 minutes 54 seconds
Build step 'Invoke Ant' marked build as failure
Archiving artifacts
Recording test results
Email was triggered for: Failure - Any
Sending email for trigger: Failure - Any