You are viewing a plain text version of this content. The canonical link for it is here.
Posted to dev@royale.apache.org by Apache Royale CI Server <ap...@gmail.com> on 2019/07/08 21:50:24 UTC

Build failed in Jenkins: royale-asjs #2443

See <http://apacheroyaleci.westus2.cloudapp.azure.com:8080/job/royale-asjs/2443/display/redirect?page=changes>

Changes:

[carlosrovira] we don't need bracket access for Element.animate method is already part

[carlosrovira] tour-de-jewel: update version in welcome page to 0.9.6 and remove search

------------------------------------------
[...truncated 1.79 MB...]

SparkRoyale:
     [echo] swc-date is 07/08/19 21:49 +0000

clean:
     [echo] swc-date is 07/08/19 21:49 +0000

check-for-tests:

clean-tests:

check-compiler-home:

check-transpiler-home:

check-compiler:

compile:
     [echo] swc-date is 07/08/19 21:49 +0000

compile-swf:
     [echo] Compiling libs/SparkRoyale.swc
     [echo] ROYALE_HOME: <http://apacheroyaleci.westus2.cloudapp.azure.com:8080/job/royale-asjs/ws/>
     [echo] ROYALE_SWF_COMPILER_HOME: <http://apacheroyaleci.westus2.cloudapp.azure.com:8080/job/royale-asjs/ws/>
     [echo] ROYALE_COMPILER_HOME: <http://apacheroyaleci.westus2.cloudapp.azure.com:8080/job/royale-asjs/ws/js>
     [java] args:
     [java] +royalelib=<http://apacheroyaleci.westus2.cloudapp.azure.com:8080/job/royale-asjs/ws/frameworks>
     [java] +playerglobal.version=11.7
     [java] +env.AIR_HOME=C:\adobe\air\4.0\AdobeAIRSDK
     [java] -compiler.strict-xml=true
     [java] -compiler.targets=SWF,JSRoyale
     [java] -compiler.define+=GOOG::DEBUG,true
     [java] -metadata.date=07/08/19 21:49 +0000
     [java] -metadata.dateFormat=MM/dd/yy HH:mm Z
     [java] -swf-debugfile-alias=/org/apache/royale/0.9.6
     [java] -output=<http://apacheroyaleci.westus2.cloudapp.azure.com:8080/job/royale-asjs/ws/frameworks/projects/SparkRoyale/target/SparkRoyale.swc>
     [java] -load-config=<http://apacheroyaleci.westus2.cloudapp.azure.com:8080/job/royale-asjs/ws/frameworks/projects/SparkRoyale/src/main/config/compile-swf-config.xml>
     [java] -js-compiler-define+=GOOG::DEBUG,goog.DEBUG
     [java] -js-compiler-define+=COMPILE::SWF,false
     [java] -js-compiler-define+=COMPILE::JS,true
     [java] -js-load-config=<http://apacheroyaleci.westus2.cloudapp.azure.com:8080/job/royale-asjs/ws/frameworks/js-config.xml>
     [java] -js-load-config+=<http://apacheroyaleci.westus2.cloudapp.azure.com:8080/job/royale-asjs/ws/frameworks/projects/SparkRoyale/../../js/projects/SparkRoyaleJS/src/main/config/compile-js-config.xml>
     [java] target:SWF
     [java] target:JSRoyale
     [java] COMPC
     [java] Loading configuration: <http://apacheroyaleci.westus2.cloudapp.azure.com:8080/job/royale-asjs/ws/frameworks/projects/SparkRoyale/src/main/config/compile-swf-config.xml>
     [java] 
     [java] 348603 bytes written to C:\jenkins\workspace\royale-asjs\frameworks\projects\SparkRoyale\target\SparkRoyale.swc in 7.915 seconds
     [java] COMPCJSCRoyale
     [java] 17.5799358 seconds
     [java] Picked up JAVA_TOOL_OPTIONS: -Dfile.encoding=UTF-8 -Xms384m -Xmx1g 

compile-js:
     [echo] swc-date is 07/08/19 21:49 +0000
   [delete] Deleting: <http://apacheroyaleci.westus2.cloudapp.azure.com:8080/job/royale-asjs/ws/frameworks/js/projects/SparkRoyaleJS/SparkRoyaleJS.swc.properties>

clean:
     [echo] swc-date is 07/08/19 21:49 +0000
   [delete] Deleting: <http://apacheroyaleci.westus2.cloudapp.azure.com:8080/job/royale-asjs/ws/frameworks/js/projects/SparkRoyaleJS/SparkRoyaleJS.swc.properties>

check-for-tests:

clean-tests:

check-compiler-home:

check-transpiler-home:

check-compiler:

compile:
     [echo] Cross-compiling SparkRoyaleJS.swc
     [echo] ROYALE_COMPILER_HOME: <http://apacheroyaleci.westus2.cloudapp.azure.com:8080/job/royale-asjs/ws/js>
    [mkdir] Created dir: <http://apacheroyaleci.westus2.cloudapp.azure.com:8080/job/royale-asjs/ws/frameworks/js/projects/SparkRoyaleJS/target/generated-sources/royale>
     [java] args:
     [java] +royalelib=<http://apacheroyaleci.westus2.cloudapp.azure.com:8080/job/royale-asjs/ws/frameworks>
     [java] -compiler.define+=GOOG::DEBUG,goog.DEBUG
     [java] -compiler.strict-xml=true
     [java] -compiler.targets=SWF,JSRoyale
     [java] -metadata.date=07/08/19 21:49 +0000
     [java] -metadata.dateFormat=MM/dd/yy HH:mm Z
     [java] -swf-debugfile-alias=/org/apache/royale/0.9.6
     [java] -output=<http://apacheroyaleci.westus2.cloudapp.azure.com:8080/job/royale-asjs/ws/frameworks/js/projects/SparkRoyaleJS/target/SparkRoyaleJS.swc>
     [java] -load-config=<http://apacheroyaleci.westus2.cloudapp.azure.com:8080/job/royale-asjs/ws/frameworks/js-config.xml>
     [java] -load-config+=<http://apacheroyaleci.westus2.cloudapp.azure.com:8080/job/royale-asjs/ws/frameworks/js/projects/SparkRoyaleJS/src/main/config/compile-js-config.xml>
     [java] target:SWF
     [java] target:JSRoyale
     [java] COMPC
     [java] Loading configuration: <http://apacheroyaleci.westus2.cloudapp.azure.com:8080/job/royale-asjs/ws/frameworks/js-config.xml>
     [java] Loading configuration: <http://apacheroyaleci.westus2.cloudapp.azure.com:8080/job/royale-asjs/ws/frameworks/js/projects/SparkRoyaleJS/src/main/config/compile-js-config.xml>
     [java] 
     [java] blockCount is: 15
     [java] block 0
     [java] [getlocal0, pushscope, newcatch(0), dup, setlocal(5), dup, pushscope, swap, setslot(1), getlex[Qname: e::{PackageInternalNs:"org.apache.royale.events"}], debugline(97), getproperty[Qname: name::{PackageNs:""}], pushstring[stopImmediatePropagation], equals, not, debugline(97), iffalse[org.apache.royale.abc.semantics.Label@2af31aba => 71]]
     [java] visiting block: 0
     [java] max_scope is now:2
     [java] scpDepth is now:2
     [java] block 1
     [java] [popscope, debugline(100)]
     [java] visiting block: 1
     [java] max_scope is now:2
     [java] scpDepth is now:1
     [java] block 2
     [java] [pushfalse, returnvalue]
     [java] visiting block: 2
     [java] max_scope is now:2
     [java] scpDepth is now:1
     [java] block 3
     [java] [getlex[Qname: e::{PackageInternalNs:"org.apache.royale.events"}], debugline(98), throw]
     [java] visiting block: 3
     [java] max_scope is now:2
     [java] scpDepth is now:2
     [java] block 4
     [java] [getlocal0, pushscope, debugfile[/org/apache/royale/0.9.6;org/apache/royale/events;EventDispatcher.as], debug[1,event1,0,0,]]
     [java] visiting block: 4
     [java] max_scope is now:3
     [java] scpDepth is now:3
     [java] block 5
     [java] [getlocal1, debugline(81), iffalse[org.apache.royale.abc.semantics.Label@17b387ef => 38]]
     [java] visiting block: 5
     [java] max_scope is now:3
     [java] scpDepth is now:3
     [java] block 6
     [java] [pushfalse, setlocal3, getlocal3, returnvalue]
     [java] visiting block: 6
     [java] max_scope is now:3
     [java] scpDepth is now:3
     [java] block 7
     [java] [debugline(82), getlocal1, typeof, pushstring[string], equals, debugline(82), iffalse[org.apache.royale.abc.semantics.Label@496c6d94 => 28]]
     [java] visiting block: 7
     [java] max_scope is now:3
     [java] scpDepth is now:3
     [java] block 8
     [java] [pushstring[target], getlocal1, in, iffalse[org.apache.royale.abc.semantics.Label@1693d505 => 36]]
     [java] visiting block: 8
     [java] max_scope is now:3
     [java] scpDepth is now:3
     [java] block 9
     [java] [jump[org.apache.royale.abc.semantics.Label@489b7559 => 43]]
     [java] visiting block: 9
     [java] max_scope is now:3
     [java] scpDepth is now:3
     [java] block 10
     [java] [getlocal0, getlocal1, callsuper[Qname: dispatchEvent::{PackageNs:""},1,], dup, setlocal(4), returnvalue]
     [java] visiting block: 10
     [java] max_scope is now:3
     [java] scpDepth is now:3
     [java] block 11
     [java] [getlocal1, getlex[Qname: _dispatcher::{PrivateNs:"org.apache.royale.events:EventDispatcher"}], debugline(88), setproperty[Multiname: target::{PrivateNs:"org.apache.royale.events:EventDispatcher",ProtectedNs:"org.apache.royale.events:EventDispatcher",StaticProtectedNs:"org.apache.royale.events:EventDispatcher",StaticProtectedNs:"goog.events:EventTarget",StaticProtectedNs:"goog:Disposable",StaticProtectedNs:"Object",PackageNs:"org.apache.royale.events",PackageInternalNs:"org.apache.royale.events",PrivateNs:"FilePrivateNS:EventDispatcher",PackageNs:"",Ns:"http://adobe.com/AS3/2006/builtin"}]]
     [java] visiting block: 11
     [java] max_scope is now:3
     [java] scpDepth is now:3
     [java] block 12
     [java] [jump[org.apache.royale.abc.semantics.Label@489b7559 => 43]]
     [java] visiting block: 12
     [java] max_scope is now:3
     [java] scpDepth is now:3
     [java] block 13
     [java] [findpropstrict[Qname: Event::{PackageNs:"org.apache.royale.events"}], debugline(83), pushstring[], getlocal1, add, constructprop[Qname: Event::{PackageNs:"org.apache.royale.events"},1,], coerce[Qname: Object::{PackageNs:""}], setlocal1, getlocal1, getlex[Qname: _dispatcher::{PrivateNs:"org.apache.royale.events:EventDispatcher"}], debugline(84), setproperty[Multiname: target::{PrivateNs:"org.apache.royale.events:EventDispatcher",ProtectedNs:"org.apache.royale.events:EventDispatcher",StaticProtectedNs:"org.apache.royale.events:EventDispatcher",StaticProtectedNs:"goog.events:EventTarget",StaticProtectedNs:"goog:Disposable",StaticProtectedNs:"Object",PackageNs:"org.apache.royale.events",PackageInternalNs:"org.apache.royale.events",PrivateNs:"FilePrivateNS:EventDispatcher",PackageNs:"",Ns:"http://adobe.com/AS3/2006/builtin"}], jump[org.apache.royale.abc.semantics.Label@1693d505 => 36]]
     [java] visiting block: 13
     [java] max_scope is now:3
     [java] scpDepth is now:3
     [java] block 14
     [java] [jump[org.apache.royale.abc.semantics.Label@489b7559 => 43]]
     [java] visiting block: 14
     [java] max_scope is now:3
     [java] scpDepth is now:3
     [java] ComputedFrameCounts: 3 3
     [java] 1385789 bytes written to C:\jenkins\workspace\royale-asjs\frameworks\js\projects\SparkRoyaleJS\target\SparkRoyaleJS.swc in 8.585 seconds
     [java] COMPCJSCRoyale
     [java] 17.4534136 seconds
     [java] Picked up JAVA_TOOL_OPTIONS: -Dfile.encoding=UTF-8 -Xms384m -Xmx1g 
     [copy] Copying 1 file to <http://apacheroyaleci.westus2.cloudapp.azure.com:8080/job/royale-asjs/ws/frameworks/js/libs>

main:

copy-swc:
     [copy] Copying 1 file to <http://apacheroyaleci.westus2.cloudapp.azure.com:8080/job/royale-asjs/ws/frameworks/libs>

check-for-tests:

test:

main:

Jewel:
     [echo] swc-date is 07/08/19 21:50 +0000

clean:
     [echo] swc-date is 07/08/19 21:50 +0000

check-for-tests:

clean-tests:

check-compiler-home:

check-transpiler-home:

check-compiler:

compile:
     [echo] swc-date is 07/08/19 21:50 +0000

compile-swf:
     [echo] Compiling libs/Jewel.swc
     [echo] ROYALE_HOME: <http://apacheroyaleci.westus2.cloudapp.azure.com:8080/job/royale-asjs/ws/>
     [echo] ROYALE_SWF_COMPILER_HOME: <http://apacheroyaleci.westus2.cloudapp.azure.com:8080/job/royale-asjs/ws/>
     [echo] ROYALE_COMPILER_HOME: <http://apacheroyaleci.westus2.cloudapp.azure.com:8080/job/royale-asjs/ws/js>
     [java] args:
     [java] +royalelib=<http://apacheroyaleci.westus2.cloudapp.azure.com:8080/job/royale-asjs/ws/frameworks>
     [java] +playerglobal.version=11.7
     [java] +env.AIR_HOME=C:\adobe\air\4.0\AdobeAIRSDK
     [java] -compiler.strict-xml=true
     [java] -compiler.targets=SWF,JSRoyale
     [java] -metadata.date=07/08/19 21:50 +0000
     [java] -metadata.dateFormat=MM/dd/yy HH:mm Z
     [java] -swf-debugfile-alias=/org/apache/royale/0.9.6
     [java] -output=<http://apacheroyaleci.westus2.cloudapp.azure.com:8080/job/royale-asjs/ws/frameworks/projects/Jewel/target/Jewel.swc>
     [java] -load-config=<http://apacheroyaleci.westus2.cloudapp.azure.com:8080/job/royale-asjs/ws/frameworks/projects/Jewel/src/main/config/compile-swf-config.xml>
     [java] -js-load-config=<http://apacheroyaleci.westus2.cloudapp.azure.com:8080/job/royale-asjs/ws/frameworks/js-config.xml>
     [java] -js-load-config+=<http://apacheroyaleci.westus2.cloudapp.azure.com:8080/job/royale-asjs/ws/frameworks/projects/Jewel/../../js/projects/JewelJS/src/main/config/compile-js-config.xml>
     [java] target:SWF
     [java] target:JSRoyale
     [java] COMPC
     [java] Loading configuration: <http://apacheroyaleci.westus2.cloudapp.azure.com:8080/job/royale-asjs/ws/frameworks/projects/Jewel/src/main/config/compile-swf-config.xml>
     [java] 
     [java] 469454 bytes written to C:\jenkins\workspace\royale-asjs\frameworks\projects\Jewel\target\Jewel.swc in 7.999 seconds
     [java] COMPCJSCRoyale
     [java] <http://apacheroyaleci.westus2.cloudapp.azure.com:8080/job/royale-asjs/ws/frameworks/projects/Jewel/src/main/royale/org/apache/royale/jewel/itemRenderers/TabBarButtonItemRenderer.as(197)>: col: 22 Call to a possibly undefined method animate through a reference with static type HTMLSpanElement.
     [java] 
     [java] 			indicator_content.animate(
     [java] 			                  ^
     [java] 
     [java] Picked up JAVA_TOOL_OPTIONS: -Dfile.encoding=UTF-8 -Xms384m -Xmx1g 
     [java] 12.3360654 seconds
     [java] Java Result: 3

BUILD FAILED
<http://apacheroyaleci.westus2.cloudapp.azure.com:8080/job/royale-asjs/ws/build.xml>:652: The following error occurred while executing this line:
<http://apacheroyaleci.westus2.cloudapp.azure.com:8080/job/royale-asjs/ws/frameworks/build.xml>:143: The following error occurred while executing this line:
<http://apacheroyaleci.westus2.cloudapp.azure.com:8080/job/royale-asjs/ws/frameworks/build.xml>:368: The following error occurred while executing this line:
<http://apacheroyaleci.westus2.cloudapp.azure.com:8080/job/royale-asjs/ws/frameworks/projects/Jewel/build.xml>:85: The following error occurred while executing this line:
<http://apacheroyaleci.westus2.cloudapp.azure.com:8080/job/royale-asjs/ws/frameworks/projects/Jewel/build.xml>:111: condition satisfied

Total time: 18 minutes 8 seconds
Picked up JAVA_TOOL_OPTIONS: -Dfile.encoding=UTF-8 -Xms384m -Xmx1g 
Build step 'Invoke Ant' marked build as failure
Skipped archiving because build is not successful

Jenkins build is back to normal : royale-asjs #2445

Posted by Apache Royale CI Server <ap...@gmail.com>.
See <http://apacheroyaleci.westus2.cloudapp.azure.com:8080/job/royale-asjs/2445/display/redirect>


Build failed in Jenkins: royale-asjs #2444

Posted by Apache Royale CI Server <ap...@gmail.com>.
See <http://apacheroyaleci.westus2.cloudapp.azure.com:8080/job/royale-asjs/2444/display/redirect?page=changes>

Changes:

[shiffy] added colors

[tzivi] Only set the content-type if it’s defined in URLRequest

[carlosrovira] Revert "we don't need bracket access for Element.animate method is

------------------------------------------
[...truncated 1.85 MB...]
[royaleunit] Sending acknowledgement to player to start sending test data ...
[royaleunit] 
[royaleunit] 
[royaleunit] Stopping server ...
[royaleunit] End of test data reached, sending acknowledgement to player ...
[royaleunit] Closing client connection ...
[royaleunit] Closing server on port [1024] ...
[royaleunit] Analyzing reports ...
[royaleunit] 
[royaleunit] Suite: tests.ScopeTests
[royaleunit] Tests run: 1, Failures: 0, Errors: 0, Skipped: 0, Time elapsed: 0.123 sec
[royaleunit] Suite: tests.BeforeAndAfterTests
[royaleunit] Tests run: 3, Failures: 0, Errors: 0, Skipped: 0, Time elapsed: 0.369 sec
[royaleunit] Suite: tests.IgnoreTests
[royaleunit] Tests run: 2, Failures: 0, Errors: 0, Skipped: 0, Time elapsed: 0.246 sec
[royaleunit] Suite: tests.BeforeClassAndAfterClassTests
[royaleunit] Tests run: 3, Failures: 0, Errors: 0, Skipped: 0, Time elapsed: 0.369 sec
[royaleunit] 
[royaleunit] Results :
[royaleunit] 
[royaleunit] Tests run: 9, Failures: 0, Errors: 0, Skipped: 0, Time elapsed: 1.107 sec
[royaleunit] 
[junitreport] Processing <http://apacheroyaleci.westus2.cloudapp.azure.com:8080/job/royale-asjs/ws/frameworks/projects/RoyaleUnit/src/test/royale/out/TESTS-TestSuites.xml> to C:\Users\APACHE~1\AppData\Local\Temp\2\null1942219580
[junitreport] Loading stylesheet jar:file:/C:/apache/apache-ant-1.9.9/lib/ant-junit.jar!/org/apache/tools/ant/taskdefs/optional/junit/xsl/junit-frames.xsl
[junitreport] Transform time: 1219ms
[junitreport] Deleting: C:\Users\APACHE~1\AppData\Local\Temp\2\null1942219580

main:
     [echo] swc-date is 07/09/19 12:19 +0000

test-js:
     [echo] swc-date is 07/09/19 12:20 +0000
   [delete] Deleting: <http://apacheroyaleci.westus2.cloudapp.azure.com:8080/job/royale-asjs/ws/frameworks/js/projects/RoyaleUnitJS/RoyaleUnitJS.swc.properties>

check-for-tests:

check-compiler-home:

check-transpiler-home:

check-compiler:

test:

clean:

compile:
     [echo] Cross-compiling tests
     [echo] ROYALE_HOME: <http://apacheroyaleci.westus2.cloudapp.azure.com:8080/job/royale-asjs/ws/>
     [echo] ROYALE_SWF_COMPILER_HOME: <http://apacheroyaleci.westus2.cloudapp.azure.com:8080/job/royale-asjs/ws/>
     [echo] playerglobal.version: 11.7
Trying to override old definition of task compc
Trying to override old definition of task mxmlc
    [mxmlc] MXMLJSC
    [mxmlc] -debug
    [mxmlc] -compiler.targets=JSRoyale
    [mxmlc] -js-output=target
    [mxmlc] +playerglobal.version=11.7
    [mxmlc] +env.PLAYERGLOBAL_HOME=C:\adobe\flash
    [mxmlc] +royalelib=<http://apacheroyaleci.westus2.cloudapp.azure.com:8080/job/royale-asjs/ws/frameworks/>
    [mxmlc] --
    [mxmlc] <http://apacheroyaleci.westus2.cloudapp.azure.com:8080/job/royale-asjs/ws/frameworks/js/projects/RoyaleUnitJS/src/test/royale/../../../../../../projects/RoyaleUnit/src/test/royale/FlexUnitRoyaleApplication.mxml>
    [mxmlc] <http://apacheroyaleci.westus2.cloudapp.azure.com:8080/job/royale-asjs/ws/frameworks/projects/RoyaleUnit/src/test/royale/tests/RoyaleUnitSuite.as(25)>: col: 3 Warning: public var may not work in minified JS output.  Use getter/setter instead.
    [mxmlc] 
    [mxmlc] 		public var beforeAndAfterTests:BeforeAndAfterTests;
    [mxmlc] 		^
    [mxmlc] 
    [mxmlc] <http://apacheroyaleci.westus2.cloudapp.azure.com:8080/job/royale-asjs/ws/frameworks/projects/RoyaleUnit/src/test/royale/tests/RoyaleUnitSuite.as(26)>: col: 3 Warning: public var may not work in minified JS output.  Use getter/setter instead.
    [mxmlc] 
    [mxmlc] 		public var beforeClassAndAfterClassTests:BeforeClassAndAfterClassTests;
    [mxmlc] 		^
    [mxmlc] 
    [mxmlc] <http://apacheroyaleci.westus2.cloudapp.azure.com:8080/job/royale-asjs/ws/frameworks/projects/RoyaleUnit/src/test/royale/tests/RoyaleUnitSuite.as(27)>: col: 3 Warning: public var may not work in minified JS output.  Use getter/setter instead.
    [mxmlc] 
    [mxmlc] 		public var ignoreTests:IgnoreTests;
    [mxmlc] 		^
    [mxmlc] 
    [mxmlc] <http://apacheroyaleci.westus2.cloudapp.azure.com:8080/job/royale-asjs/ws/frameworks/projects/RoyaleUnit/src/test/royale/tests/RoyaleUnitSuite.as(28)>: col: 3 Warning: public var may not work in minified JS output.  Use getter/setter instead.
    [mxmlc] 
    [mxmlc] 		public var scopeTests:ScopeTests;
    [mxmlc] 		^
    [mxmlc] 
    [mxmlc] The project 'FlexUnitRoyaleApplication' has been successfully compiled.
    [mxmlc] 8.1604114 seconds
    [mxmlc] Picked up JAVA_TOOL_OPTIONS: -Dfile.encoding=UTF-8 -Xms384m -Xmx1g 

check-royaleunit-browser:

test:
    [mkdir] Created dir: <http://apacheroyaleci.westus2.cloudapp.azure.com:8080/job/royale-asjs/ws/frameworks/js/projects/RoyaleUnitJS/src/test/royale/out>
[royaleunit] Validating task attributes ...
[royaleunit] Generating default values ...
[royaleunit] Using the following settings for the test run:
[royaleunit] 	ROYALE_HOME: [<http://apacheroyaleci.westus2.cloudapp.azure.com:8080/job/royale-asjs/ws/]>
[royaleunit] 	haltonfailure: [true]
[royaleunit] 	headless: [false]
[royaleunit] 	display: [99]
[royaleunit] 	localTrusted: [true]
[royaleunit] 	player: [html]
[royaleunit] 	command: [C:\Program Files (x86)\Google\Chrome\Application\chrome.exe]
[royaleunit] 	port: [1024]
[royaleunit] 	swf: [<http://apacheroyaleci.westus2.cloudapp.azure.com:8080/job/royale-asjs/ws/frameworks/js/projects/RoyaleUnitJS/src/test/royale/target/bin/js-debug/index.html]>
[royaleunit] 	timeout: [90000ms]
[royaleunit] 	toDir: [<http://apacheroyaleci.westus2.cloudapp.azure.com:8080/job/royale-asjs/ws/frameworks/js/projects/RoyaleUnitJS/src/test/royale/out]>
[royaleunit] Setting up server process ...
[royaleunit] SLF4J: Failed to load class "org.slf4j.impl.StaticLoggerBinder".
[royaleunit] SLF4J: Defaulting to no-operation (NOP) logger implementation
[royaleunit] SLF4J: See http://www.slf4j.org/codes.html#StaticLoggerBinder for further details.
[royaleunit] Entry [<http://apacheroyaleci.westus2.cloudapp.azure.com:8080/job/royale-asjs/ws/frameworks/js/projects/RoyaleUnitJS/src/test/royale/target/bin/js-debug]> already available in local trust file at [C:\Users\apacheroyale\AppData\Roaming\Macromedia\Flash Player\#Security\FlashPlayerTrust\royaleUnit.cfg].
[royaleunit] Executing 'C:\Program Files (x86)\Google\Chrome\Application\chrome.exe' with arguments:
[royaleunit] '<http://apacheroyaleci.westus2.cloudapp.azure.com:8080/job/royale-asjs/ws/frameworks/js/projects/RoyaleUnitJS/src/test/royale/target/bin/js-debug/index.html'>
[royaleunit] 
[royaleunit] The ' characters around the executable and arguments are
[royaleunit] not part of the command.
[royaleunit] 
[royaleunit] Starting server ...
[royaleunit] Waiting for client connection ...
[royaleunit] Client connected.
[royaleunit] Receiving data ...
[royaleunit] Sending acknowledgement to player to start sending test data ...
[royaleunit] 
[royaleunit] 
[royaleunit] Stopping server ...
[royaleunit] End of test data reached, sending acknowledgement to player ...

BUILD FAILED
<http://apacheroyaleci.westus2.cloudapp.azure.com:8080/job/royale-asjs/ws/build.xml>:652: The following error occurred while executing this line:
<http://apacheroyaleci.westus2.cloudapp.azure.com:8080/job/royale-asjs/ws/frameworks/build.xml>:149: The following error occurred while executing this line:
<http://apacheroyaleci.westus2.cloudapp.azure.com:8080/job/royale-asjs/ws/frameworks/build.xml>:343: The following error occurred while executing this line:
<http://apacheroyaleci.westus2.cloudapp.azure.com:8080/job/royale-asjs/ws/frameworks/projects/RoyaleUnit/build.xml>:69: The following error occurred while executing this line:
<http://apacheroyaleci.westus2.cloudapp.azure.com:8080/job/royale-asjs/ws/frameworks/projects/RoyaleUnit/build.xml>:73: The following error occurred while executing this line:
<http://apacheroyaleci.westus2.cloudapp.azure.com:8080/job/royale-asjs/ws/frameworks/js/projects/RoyaleUnitJS/build.xml>:53: The following error occurred while executing this line:
<http://apacheroyaleci.westus2.cloudapp.azure.com:8080/job/royale-asjs/ws/frameworks/js/projects/RoyaleUnitJS/src/test/royale/build.xml>:181: java.util.concurrent.ExecutionException: java.nio.channels.ClosedSelectorException
	at java.util.concurrent.FutureTask.report(FutureTask.java:122)
	at java.util.concurrent.FutureTask.get(FutureTask.java:192)
	at org.apache.royale.test.ant.tasks.TestRun.run(TestRun.java:77)
	at org.apache.royale.test.ant.tasks.RoyaleUnitTask.execute(RoyaleUnitTask.java:192)
	at org.apache.tools.ant.UnknownElement.execute(UnknownElement.java:293)
	at sun.reflect.GeneratedMethodAccessor4.invoke(Unknown Source)
	at sun.reflect.DelegatingMethodAccessorImpl.invoke(DelegatingMethodAccessorImpl.java:43)
	at java.lang.reflect.Method.invoke(Method.java:498)
	at org.apache.tools.ant.dispatch.DispatchUtils.execute(DispatchUtils.java:106)
	at org.apache.tools.ant.Task.perform(Task.java:348)
	at org.apache.tools.ant.Target.execute(Target.java:435)
	at org.apache.tools.ant.Target.performTasks(Target.java:456)
	at org.apache.tools.ant.Project.executeSortedTargets(Project.java:1405)
	at org.apache.tools.ant.helper.SingleCheckExecutor.executeTargets(SingleCheckExecutor.java:38)
	at org.apache.tools.ant.Project.executeTargets(Project.java:1260)
	at org.apache.tools.ant.taskdefs.Ant.execute(Ant.java:441)
	at org.apache.tools.ant.UnknownElement.execute(UnknownElement.java:293)
	at sun.reflect.GeneratedMethodAccessor4.invoke(Unknown Source)
	at sun.reflect.DelegatingMethodAccessorImpl.invoke(DelegatingMethodAccessorImpl.java:43)
	at java.lang.reflect.Method.invoke(Method.java:498)
	at org.apache.tools.ant.dispatch.DispatchUtils.execute(DispatchUtils.java:106)
	at org.apache.tools.ant.Task.perform(Task.java:348)
	at org.apache.tools.ant.Target.execute(Target.java:435)
	at org.apache.tools.ant.Target.performTasks(Target.java:456)
	at org.apache.tools.ant.Project.executeSortedTargets(Project.java:1405)
	at org.apache.tools.ant.helper.SingleCheckExecutor.executeTargets(SingleCheckExecutor.java:38)
	at org.apache.tools.ant.Project.executeTargets(Project.java:1260)
	at org.apache.tools.ant.taskdefs.Ant.execute(Ant.java:441)
	at org.apache.tools.ant.UnknownElement.execute(UnknownElement.java:293)
	at sun.reflect.GeneratedMethodAccessor4.invoke(Unknown Source)
	at sun.reflect.DelegatingMethodAccessorImpl.invoke(DelegatingMethodAccessorImpl.java:43)
	at java.lang.reflect.Method.invoke(Method.java:498)
	at org.apache.tools.ant.dispatch.DispatchUtils.execute(DispatchUtils.java:106)
	at org.apache.tools.ant.Task.perform(Task.java:348)
	at org.apache.tools.ant.Target.execute(Target.java:435)
	at org.apache.tools.ant.Target.performTasks(Target.java:456)
	at org.apache.tools.ant.Project.executeSortedTargets(Project.java:1405)
	at org.apache.tools.ant.helper.SingleCheckExecutor.executeTargets(SingleCheckExecutor.java:38)
	at org.apache.tools.ant.Project.executeTargets(Project.java:1260)
	at org.apache.tools.ant.taskdefs.Ant.execute(Ant.java:441)
	at org.apache.tools.ant.taskdefs.CallTarget.execute(CallTarget.java:105)
	at org.apache.tools.ant.UnknownElement.execute(UnknownElement.java:293)
	at sun.reflect.GeneratedMethodAccessor4.invoke(Unknown Source)
	at sun.reflect.DelegatingMethodAccessorImpl.invoke(DelegatingMethodAccessorImpl.java:43)
	at java.lang.reflect.Method.invoke(Method.java:498)
	at org.apache.tools.ant.dispatch.DispatchUtils.execute(DispatchUtils.java:106)
	at org.apache.tools.ant.Task.perform(Task.java:348)
	at org.apache.tools.ant.Target.execute(Target.java:435)
	at org.apache.tools.ant.Target.performTasks(Target.java:456)
	at org.apache.tools.ant.Project.executeSortedTargets(Project.java:1405)
	at org.apache.tools.ant.helper.SingleCheckExecutor.executeTargets(SingleCheckExecutor.java:38)
	at org.apache.tools.ant.Project.executeTargets(Project.java:1260)
	at org.apache.tools.ant.taskdefs.Ant.execute(Ant.java:441)
	at org.apache.tools.ant.UnknownElement.execute(UnknownElement.java:293)
	at sun.reflect.GeneratedMethodAccessor4.invoke(Unknown Source)
	at sun.reflect.DelegatingMethodAccessorImpl.invoke(DelegatingMethodAccessorImpl.java:43)
	at java.lang.reflect.Method.invoke(Method.java:498)
	at org.apache.tools.ant.dispatch.DispatchUtils.execute(DispatchUtils.java:106)
	at org.apache.tools.ant.Task.perform(Task.java:348)
	at org.apache.tools.ant.Target.execute(Target.java:435)
	at org.apache.tools.ant.Target.performTasks(Target.java:456)
	at org.apache.tools.ant.Project.executeSortedTargets(Project.java:1405)
	at org.apache.tools.ant.helper.SingleCheckExecutor.executeTargets(SingleCheckExecutor.java:38)
	at org.apache.tools.ant.Project.executeTargets(Project.java:1260)
	at org.apache.tools.ant.taskdefs.Ant.execute(Ant.java:441)
	at org.apache.tools.ant.taskdefs.CallTarget.execute(CallTarget.java:105)
	at org.apache.tools.ant.UnknownElement.execute(UnknownElement.java:293)
	at sun.reflect.GeneratedMethodAccessor4.invoke(Unknown Source)
	at sun.reflect.DelegatingMethodAccessorImpl.invoke(DelegatingMethodAccessorImpl.java:43)
	at java.lang.reflect.Method.invoke(Method.java:498)
	at org.apache.tools.ant.dispatch.DispatchUtils.execute(DispatchUtils.java:106)
	at org.apache.tools.ant.Task.perform(Task.java:348)
	at org.apache.tools.ant.Target.execute(Target.java:435)
	at org.apache.tools.ant.Target.performTasks(Target.java:456)
	at org.apache.tools.ant.Project.executeSortedTargets(Project.java:1405)
	at org.apache.tools.ant.helper.SingleCheckExecutor.executeTargets(SingleCheckExecutor.java:38)
	at org.apache.tools.ant.Project.executeTargets(Project.java:1260)
	at org.apache.tools.ant.taskdefs.Ant.execute(Ant.java:441)
	at org.apache.tools.ant.UnknownElement.execute(UnknownElement.java:293)
	at sun.reflect.GeneratedMethodAccessor4.invoke(Unknown Source)
	at sun.reflect.DelegatingMethodAccessorImpl.invoke(DelegatingMethodAccessorImpl.java:43)
	at java.lang.reflect.Method.invoke(Method.java:498)
	at org.apache.tools.ant.dispatch.DispatchUtils.execute(DispatchUtils.java:106)
	at org.apache.tools.ant.Task.perform(Task.java:348)
	at org.apache.tools.ant.Target.execute(Target.java:435)
	at org.apache.tools.ant.Target.performTasks(Target.java:456)
	at org.apache.tools.ant.Project.executeSortedTargets(Project.java:1405)
	at org.apache.tools.ant.Project.executeTarget(Project.java:1376)
	at org.apache.tools.ant.helper.DefaultExecutor.executeTargets(DefaultExecutor.java:41)
	at org.apache.tools.ant.Project.executeTargets(Project.java:1260)
	at org.apache.tools.ant.Main.runBuild(Main.java:857)
	at org.apache.tools.ant.Main.startAnt(Main.java:236)
	at org.apache.tools.ant.launch.Launcher.run(Launcher.java:287)
	at org.apache.tools.ant.launch.Launcher.main(Launcher.java:113)
Caused by: java.nio.channels.ClosedSelectorException
	at sun.nio.ch.WindowsSelectorImpl.putEventOps(WindowsSelectorImpl.java:594)
	at sun.nio.ch.SocketChannelImpl.translateAndSetInterestOps(SocketChannelImpl.java:974)
	at sun.nio.ch.SelectionKeyImpl.nioInterestOps(SelectionKeyImpl.java:105)
	at sun.nio.ch.SelectionKeyImpl.interestOps(SelectionKeyImpl.java:83)
	at org.java_websocket.server.WebSocketServer.onWriteDemand(WebSocketServer.java:725)
	at org.java_websocket.WebSocketImpl.flushAndClose(WebSocketImpl.java:560)
	at org.java_websocket.WebSocketImpl.close(WebSocketImpl.java:466)
	at org.java_websocket.WebSocketImpl.close(WebSocketImpl.java:591)
	at org.java_websocket.server.WebSocketServer.stop(WebSocketServer.java:258)
	at org.java_websocket.server.WebSocketServer.stop(WebSocketServer.java:271)
	at org.apache.royale.test.ant.RoyaleUnitWebSocketServer.stop(RoyaleUnitWebSocketServer.java:72)
	at org.apache.royale.test.ant.RoyaleUnitSocketThread.call(RoyaleUnitSocketThread.java:76)
	at java.util.concurrent.FutureTask.run(FutureTask.java:266)
	at java.util.concurrent.ThreadPoolExecutor.runWorker(ThreadPoolExecutor.java:1149)
	at java.util.concurrent.ThreadPoolExecutor$Worker.run(ThreadPoolExecutor.java:624)
	at java.lang.Thread.run(Thread.java:748)

Total time: 22 minutes 15 seconds
Picked up JAVA_TOOL_OPTIONS: -Dfile.encoding=UTF-8 -Xms384m -Xmx1g 
Build step 'Invoke Ant' marked build as failure
Skipped archiving because build is not successful