You are viewing a plain text version of this content. The canonical link for it is here.
Posted to builds@cassandra.apache.org by Apache Jenkins Server <je...@builds.apache.org> on 2025/12/16 00:30:07 UTC

Build complete: Cassandra-trunk #2356 [ABORTED] e4684a11ec4fd52baaf0da141e24db6a92f63725

-------------------------------------------------------------------------------
  Build Cassandra-trunk #2356 Aborted
  URL: https://ci-cassandra.apache.org/job/Cassandra-trunk/2356/
  -------------------------------------------------------------------------------
  Changes:
  [Benedict Elliott Smith] Fix:


  -------------------------------------------------------------------------------
  Failed Tests:
  8 tests failed.
FAILED:  org.apache.cassandra.distributed.test.accord.MigrationFromAccordWriteRaceTest.Tests / jvm-dtest jdk11 5/16 / testSplitAndRetryNonSerialLoggedBatchTwoTablesTwoPkeyHintedViaBatchLogRoutingFailure-_jdk11_x86_64
FAILED:  org.apache.cassandra.distributed.test.accord.MigrationFromAccordWriteRaceTest.Tests / jvm-dtest jdk17 5/16 / testSplitAndRetryNonSerialLoggedBatchTwoTablesTwoPkeyHintedViaBatchLogRoutingFailure-_jdk17_x86_64
FAILED:  org.apache.cassandra.simulator.test.AccordHarrySimulationTest.Tests / simulator-dtest jdk11 / test-_jdk11_x86_64
FAILED:  junit.framework.TestSuite.Tests / jvm-dtest jdk11 5/16 / org.apache.cassandra.distributed.test.accord.MigrationFromAccordWriteRaceTest-_jdk11_x86_64
FAILED:  junit.framework.TestSuite.Tests / jvm-dtest jdk17 5/16 / org.apache.cassandra.distributed.test.accord.MigrationFromAccordWriteRaceTest-_jdk17_x86_64
FAILED:  org.apache.cassandra.simulator.test.ShortPaxosSimulationTest.Tests / simulator-dtest jdk11 / selfReconcileTest-cassandra.testtag_IS_UNDEFINED
FAILED:  org.apache.cassandra.io.sstable.indexsummary.IndexSummaryTest.Tests / test-oa jdk17 3/20 / testLargeIndexSummary-cassandra.testtag_IS_UNDEFINED
FAILED:  org.apache.cassandra.distributed.upgrade.ClusterMetadataUpgradeHarryTest.Tests / jvm-dtest-upgrade jdk11 3/6 / simpleUpgradeTest-cassandra.testtag_IS_UNDEFINED

  -------------------------------------------------------------------------------
  For complete test report and logs see https://nightlies.apache.org/cassandra/Cassandra-trunk/2356/