You are viewing a plain text version of this content. The canonical link for it is here.
Posted to dev@atlas.apache.org by Apache Jenkins Server <je...@builds.apache.org> on 2018/03/26 07:01:32 UTC

Build failed in Jenkins: Atlas-master-IntegrationTests #863

See <https://builds.apache.org/job/Atlas-master-IntegrationTests/863/display/redirect>

------------------------------------------
[...truncated 655.99 KB...]
[INFO] Started Jetty Server
[INFO] 
[INFO] --- maven-failsafe-plugin:2.18.1:integration-test (integration-test) @ falcon-bridge ---
[WARNING] useSystemClassloader setting has no effect when not forking
[INFO] Failsafe report directory: <https://builds.apache.org/job/Atlas-master-IntegrationTests/ws/addons/falcon-bridge/target/failsafe-reports>
Running org.apache.atlas.falcon.hook.FalconHookIT
127.0.0.1 - - [26/Mar/2018:06:51:09 +0000] "GET //localhost:31000/api/atlas/entities?type=falcon_cluster&property=qualifiedName&value=clusterdrpkN8IYun HTTP/1.1" 404 106 "-" "Java/1.8.0_152"
127.0.0.1 - - [26/Mar/2018:06:51:10 +0000] "GET //localhost:31000/api/atlas/entities?type=falcon_cluster&property=qualifiedName&value=clusterdrpkN8IYun HTTP/1.1" 404 106 "-" "Java/1.8.0_152"
127.0.0.1 - - [26/Mar/2018:06:51:10 +0000] "GET //localhost:31000/api/atlas/entities?type=falcon_cluster&property=qualifiedName&value=clusterdrpkN8IYun HTTP/1.1" 404 106 "-" "Java/1.8.0_152"
127.0.0.1 - - [26/Mar/2018:06:51:11 +0000] "GET //localhost:31000/api/atlas/entities?type=falcon_cluster&property=qualifiedName&value=clusterdrpkN8IYun HTTP/1.1" 404 106 "-" "Java/1.8.0_152"
127.0.0.1 - - [26/Mar/2018:06:51:11 +0000] "GET //localhost:31000/api/atlas/entities?type=falcon_cluster&property=qualifiedName&value=clusterdrpkN8IYun HTTP/1.1" 404 106 "-" "Java/1.8.0_152"
127.0.0.1 - - [26/Mar/2018:06:51:12 +0000] "GET //localhost:31000/api/atlas/entities?type=falcon_cluster&property=qualifiedName&value=clusterdrpkN8IYun HTTP/1.1" 404 106 "-" "Java/1.8.0_152"
127.0.0.1 - - [26/Mar/2018:06:51:12 +0000] "GET //localhost:31000/api/atlas/entities?type=falcon_feed&property=qualifiedName&value=feedcUqDEFMsiC@clusterj6UdtbbWzD HTTP/1.1" 404 118 "-" "Java/1.8.0_152"
127.0.0.1 - - [26/Mar/2018:06:51:12 +0000] "GET //localhost:31000/api/atlas/entities?type=falcon_feed&property=qualifiedName&value=feedcUqDEFMsiC@clusterj6UdtbbWzD HTTP/1.1" 404 118 "-" "Java/1.8.0_152"
127.0.0.1 - - [26/Mar/2018:06:51:13 +0000] "GET //localhost:31000/api/atlas/entities?type=falcon_feed&property=qualifiedName&value=feedcUqDEFMsiC@clusterj6UdtbbWzD HTTP/1.1" 404 118 "-" "Java/1.8.0_152"
127.0.0.1 - - [26/Mar/2018:06:51:13 +0000] "GET //localhost:31000/api/atlas/entities?type=falcon_feed&property=qualifiedName&value=feedcUqDEFMsiC@clusterj6UdtbbWzD HTTP/1.1" 200 923 "-" "Java/1.8.0_152"
127.0.0.1 - - [26/Mar/2018:06:51:13 +0000] "GET //localhost:31000/api/atlas/entities?type=falcon_feed&property=qualifiedName&value=feedcUqDEFMsiC@clusterj6UdtbbWzD HTTP/1.1" 200 923 "-" "Java/1.8.0_152"
127.0.0.1 - - [26/Mar/2018:06:51:13 +0000] "GET //localhost:31000/api/atlas/entities/b6b69390-358f-49ef-98be-a68651aa1a02 HTTP/1.1" 200 923 "-" "Java/1.8.0_152"
127.0.0.1 - - [26/Mar/2018:06:51:13 +0000] "GET //localhost:31000/api/atlas/entities?type=falcon_feed_creation&property=qualifiedName&value=feedcUqDEFMsiC@clusterj6UdtbbWzD HTTP/1.1" 200 1266 "-" "Java/1.8.0_152"
127.0.0.1 - - [26/Mar/2018:06:51:13 +0000] "GET //localhost:31000/api/atlas/entities?type=falcon_feed_creation&property=qualifiedName&value=feedcUqDEFMsiC@clusterj6UdtbbWzD HTTP/1.1" 200 1266 "-" "Java/1.8.0_152"
127.0.0.1 - - [26/Mar/2018:06:51:13 +0000] "GET //localhost:31000/api/atlas/entities/c4bfc27b-3a43-436d-8c4d-7ea7cf6324d2 HTTP/1.1" 200 1266 "-" "Java/1.8.0_152"
127.0.0.1 - - [26/Mar/2018:06:51:13 +0000] "GET //localhost:31000/api/atlas/entities/038449b5-e97f-4de4-a1ff-64677c7deb0e HTTP/1.1" 200 1018 "-" "Java/1.8.0_152"
127.0.0.1 - - [26/Mar/2018:06:51:14 +0000] "GET //localhost:31000/api/atlas/entities?type=falcon_feed&property=qualifiedName&value=feed5DYFklqOGv@clusterj6UdtbbWzD HTTP/1.1" 404 118 "-" "Java/1.8.0_152"
127.0.0.1 - - [26/Mar/2018:06:51:14 +0000] "GET //localhost:31000/api/atlas/entities?type=falcon_feed&property=qualifiedName&value=feed5DYFklqOGv@clusterj6UdtbbWzD HTTP/1.1" 200 923 "-" "Java/1.8.0_152"
127.0.0.1 - - [26/Mar/2018:06:51:14 +0000] "GET //localhost:31000/api/atlas/entities?type=falcon_feed&property=qualifiedName&value=feed5DYFklqOGv@clusterj6UdtbbWzD HTTP/1.1" 200 923 "-" "Java/1.8.0_152"
127.0.0.1 - - [26/Mar/2018:06:51:14 +0000] "GET //localhost:31000/api/atlas/entities/db3d46fe-ae36-4faa-b1a0-5aa53f92cd4e HTTP/1.1" 200 923 "-" "Java/1.8.0_152"
127.0.0.1 - - [26/Mar/2018:06:51:14 +0000] "GET //localhost:31000/api/atlas/entities?type=falcon_feed_creation&property=qualifiedName&value=feed5DYFklqOGv@clusterj6UdtbbWzD HTTP/1.1" 200 1267 "-" "Java/1.8.0_152"
127.0.0.1 - - [26/Mar/2018:06:51:14 +0000] "GET //localhost:31000/api/atlas/entities?type=falcon_feed_creation&property=qualifiedName&value=feed5DYFklqOGv@clusterj6UdtbbWzD HTTP/1.1" 200 1267 "-" "Java/1.8.0_152"
127.0.0.1 - - [26/Mar/2018:06:51:14 +0000] "GET //localhost:31000/api/atlas/entities/21be8a6a-e2fc-483c-b65e-0c57d00260c3 HTTP/1.1" 200 1267 "-" "Java/1.8.0_152"
127.0.0.1 - - [26/Mar/2018:06:51:14 +0000] "GET //localhost:31000/api/atlas/entities/a8e7c020-e1f2-4b5a-937f-7eb5e923803a HTTP/1.1" 200 1127 "-" "Java/1.8.0_152"
127.0.0.1 - - [26/Mar/2018:06:51:14 +0000] "GET //localhost:31000/api/atlas/entities?type=falcon_feed&property=qualifiedName&value=feed5DYFklqOGv@clusterj6UdtbbWzD HTTP/1.1" 200 923 "-" "Java/1.8.0_152"
127.0.0.1 - - [26/Mar/2018:06:51:15 +0000] "GET //localhost:31000/api/atlas/entities?type=falcon_process&property=qualifiedName&value=processuS8L2jlcAU@clusterj6UdtbbWzD HTTP/1.1" 404 124 "-" "Java/1.8.0_152"
127.0.0.1 - - [26/Mar/2018:06:51:15 +0000] "GET //localhost:31000/api/atlas/entities?type=falcon_process&property=qualifiedName&value=processuS8L2jlcAU@clusterj6UdtbbWzD HTTP/1.1" 404 124 "-" "Java/1.8.0_152"
127.0.0.1 - - [26/Mar/2018:06:51:15 +0000] "GET //localhost:31000/api/atlas/entities?type=falcon_process&property=qualifiedName&value=processuS8L2jlcAU@clusterj6UdtbbWzD HTTP/1.1" 200 1492 "-" "Java/1.8.0_152"
127.0.0.1 - - [26/Mar/2018:06:51:15 +0000] "GET //localhost:31000/api/atlas/entities?type=falcon_process&property=qualifiedName&value=processuS8L2jlcAU@clusterj6UdtbbWzD HTTP/1.1" 200 1492 "-" "Java/1.8.0_152"
127.0.0.1 - - [26/Mar/2018:06:51:15 +0000] "GET //localhost:31000/api/atlas/entities/54f9c59c-4898-44a5-9cb3-15a84eceb06d HTTP/1.1" 200 1492 "-" "Java/1.8.0_152"
127.0.0.1 - - [26/Mar/2018:06:51:16 +0000] "GET //localhost:31000/api/atlas/entities?type=falcon_cluster&property=qualifiedName&value=clusterLHlByNtKj8 HTTP/1.1" 404 106 "-" "Java/1.8.0_152"
127.0.0.1 - - [26/Mar/2018:06:51:16 +0000] "GET //localhost:31000/api/atlas/entities?type=falcon_cluster&property=qualifiedName&value=clusterLHlByNtKj8 HTTP/1.1" 200 704 "-" "Java/1.8.0_152"
127.0.0.1 - - [26/Mar/2018:06:51:16 +0000] "GET //localhost:31000/api/atlas/entities?type=falcon_cluster&property=qualifiedName&value=clusterLHlByNtKj8 HTTP/1.1" 200 704 "-" "Java/1.8.0_152"
127.0.0.1 - - [26/Mar/2018:06:51:16 +0000] "GET //localhost:31000/api/atlas/entities?type=falcon_cluster&property=qualifiedName&value=clusterDpdowdBnIe HTTP/1.1" 404 106 "-" "Java/1.8.0_152"
127.0.0.1 - - [26/Mar/2018:06:51:17 +0000] "GET //localhost:31000/api/atlas/entities?type=falcon_cluster&property=qualifiedName&value=clusterDpdowdBnIe HTTP/1.1" 200 704 "-" "Java/1.8.0_152"
127.0.0.1 - - [26/Mar/2018:06:51:17 +0000] "GET //localhost:31000/api/atlas/entities?type=falcon_cluster&property=qualifiedName&value=clusterDpdowdBnIe HTTP/1.1" 200 704 "-" "Java/1.8.0_152"
127.0.0.1 - - [26/Mar/2018:06:51:17 +0000] "GET //localhost:31000/api/atlas/entities?type=falcon_feed&property=qualifiedName&value=feedzHzr8LLHuj@clusterLHlByNtKj8 HTTP/1.1" 404 118 "-" "Java/1.8.0_152"
127.0.0.1 - - [26/Mar/2018:06:51:17 +0000] "GET //localhost:31000/api/atlas/entities?type=falcon_feed&property=qualifiedName&value=feedzHzr8LLHuj@clusterLHlByNtKj8 HTTP/1.1" 404 118 "-" "Java/1.8.0_152"
127.0.0.1 - - [26/Mar/2018:06:51:17 +0000] "GET //localhost:31000/api/atlas/entities?type=falcon_feed&property=qualifiedName&value=feedzHzr8LLHuj@clusterLHlByNtKj8 HTTP/1.1" 200 923 "-" "Java/1.8.0_152"
127.0.0.1 - - [26/Mar/2018:06:51:17 +0000] "GET //localhost:31000/api/atlas/entities?type=falcon_feed&property=qualifiedName&value=feedzHzr8LLHuj@clusterLHlByNtKj8 HTTP/1.1" 200 923 "-" "Java/1.8.0_152"
127.0.0.1 - - [26/Mar/2018:06:51:18 +0000] "GET //localhost:31000/api/atlas/entities/5e6c1004-68d5-490e-9837-717296a8db13 HTTP/1.1" 200 923 "-" "Java/1.8.0_152"
127.0.0.1 - - [26/Mar/2018:06:51:18 +0000] "GET //localhost:31000/api/atlas/entities?type=falcon_feed_creation&property=qualifiedName&value=feedzHzr8LLHuj@clusterLHlByNtKj8 HTTP/1.1" 200 1267 "-" "Java/1.8.0_152"
127.0.0.1 - - [26/Mar/2018:06:51:18 +0000] "GET //localhost:31000/api/atlas/entities?type=falcon_feed_creation&property=qualifiedName&value=feedzHzr8LLHuj@clusterLHlByNtKj8 HTTP/1.1" 200 1267 "-" "Java/1.8.0_152"
127.0.0.1 - - [26/Mar/2018:06:51:18 +0000] "GET //localhost:31000/api/atlas/entities/665f90d8-44f1-45db-9c1f-9ea0622ff696 HTTP/1.1" 200 1267 "-" "Java/1.8.0_152"
127.0.0.1 - - [26/Mar/2018:06:51:18 +0000] "GET //localhost:31000/api/atlas/entities/e1b7b29f-e578-45b4-bf99-e6076e5144c6 HTTP/1.1" 200 1127 "-" "Java/1.8.0_152"
127.0.0.1 - - [26/Mar/2018:06:51:18 +0000] "GET //localhost:31000/api/atlas/entities?type=falcon_feed&property=qualifiedName&value=feedzHzr8LLHuj@clusterDpdowdBnIe HTTP/1.1" 200 923 "-" "Java/1.8.0_152"
127.0.0.1 - - [26/Mar/2018:06:51:18 +0000] "GET //localhost:31000/api/atlas/entities?type=falcon_feed&property=qualifiedName&value=feedzHzr8LLHuj@clusterDpdowdBnIe HTTP/1.1" 200 923 "-" "Java/1.8.0_152"
127.0.0.1 - - [26/Mar/2018:06:51:18 +0000] "GET //localhost:31000/api/atlas/entities/59fc73a5-22ec-4bc8-935b-fe974f13411b HTTP/1.1" 200 923 "-" "Java/1.8.0_152"
127.0.0.1 - - [26/Mar/2018:06:51:18 +0000] "GET //localhost:31000/api/atlas/entities?type=falcon_feed_creation&property=qualifiedName&value=feedzHzr8LLHuj@clusterDpdowdBnIe HTTP/1.1" 200 1267 "-" "Java/1.8.0_152"
127.0.0.1 - - [26/Mar/2018:06:51:18 +0000] "GET //localhost:31000/api/atlas/entities?type=falcon_feed_creation&property=qualifiedName&value=feedzHzr8LLHuj@clusterDpdowdBnIe HTTP/1.1" 200 1267 "-" "Java/1.8.0_152"
127.0.0.1 - - [26/Mar/2018:06:51:18 +0000] "GET //localhost:31000/api/atlas/entities/b2c506be-122d-4bca-bf24-6765d3dbb86b HTTP/1.1" 200 1267 "-" "Java/1.8.0_152"
127.0.0.1 - - [26/Mar/2018:06:51:18 +0000] "GET //localhost:31000/api/atlas/entities/ccfd2d77-ed27-41fb-8f62-628c589c7fd3 HTTP/1.1" 200 1127 "-" "Java/1.8.0_152"
127.0.0.1 - - [26/Mar/2018:06:51:18 +0000] "GET //localhost:31000/api/atlas/entities?type=falcon_feed&property=qualifiedName&value=feedzHzr8LLHuj@clusterLHlByNtKj8 HTTP/1.1" 200 923 "-" "Java/1.8.0_152"
127.0.0.1 - - [26/Mar/2018:06:51:18 +0000] "GET //localhost:31000/api/atlas/entities?type=falcon_feed&property=qualifiedName&value=feedzHzr8LLHuj@clusterDpdowdBnIe HTTP/1.1" 200 923 "-" "Java/1.8.0_152"
127.0.0.1 - - [26/Mar/2018:06:51:18 +0000] "GET //localhost:31000/api/atlas/entities?type=falcon_feed_replication&property=qualifiedName&value=feedzHzr8LLHuj HTTP/1.1" 200 1040 "-" "Java/1.8.0_152"
127.0.0.1 - - [26/Mar/2018:06:51:18 +0000] "GET //localhost:31000/api/atlas/entities?type=falcon_feed_replication&property=qualifiedName&value=feedzHzr8LLHuj HTTP/1.1" 200 1040 "-" "Java/1.8.0_152"
127.0.0.1 - - [26/Mar/2018:06:51:18 +0000] "GET //localhost:31000/api/atlas/entities/03b80090-0bae-4072-a59d-a232bcdf15fd HTTP/1.1" 200 1040 "-" "Java/1.8.0_152"
Tests run: 3, Failures: 1, Errors: 0, Skipped: 0, Time elapsed: 10.368 sec <<< FAILURE! - in org.apache.atlas.falcon.hook.FalconHookIT
testCreateProcess(org.apache.atlas.falcon.hook.FalconHookIT)  Time elapsed: 2.934 sec  <<< FAILURE!
java.lang.AssertionError: Assertions failed. Failing after waiting for timeout 2000 msecs
	at org.apache.atlas.AtlasBaseClient.callAPIWithResource(AtlasBaseClient.java:388)
	at org.apache.atlas.AtlasBaseClient.callAPIWithResource(AtlasBaseClient.java:323)
	at org.apache.atlas.AtlasBaseClient.callAPIWithRetries(AtlasBaseClient.java:472)
	at org.apache.atlas.AtlasClient.callAPIWithRetries(AtlasClient.java:931)
	at org.apache.atlas.AtlasClient.getEntity(AtlasClient.java:640)
	at org.apache.atlas.falcon.hook.FalconHookIT$1.evaluate(FalconHookIT.java:310)
	at org.apache.atlas.falcon.hook.FalconHookIT.waitFor(FalconHookIT.java:340)
	at org.apache.atlas.falcon.hook.FalconHookIT.assertEntityIsRegistered(FalconHookIT.java:307)
	at org.apache.atlas.falcon.hook.FalconHookIT.assertClusterIsRegistered(FalconHookIT.java:161)
	at org.apache.atlas.falcon.hook.FalconHookIT.testCreateProcess(FalconHookIT.java:130)


Results :

Failed tests: 
  FalconHookIT.testCreateProcess:130->assertClusterIsRegistered:161->assertEntityIsRegistered:307->waitFor:344 Assertions failed. Failing after waiting for timeout 2000 msecs

Tests run: 3, Failures: 1, Errors: 0, Skipped: 0

[INFO] 
[INFO] --- jetty-maven-plugin:9.3.14.v20161028:stop (stop-jetty) @ falcon-bridge ---
[INFO] Waiting 10 seconds for jetty to stop
[INFO] Stopped ServerConnector@5d6a7aff{HTTP/1.1,[http/1.1]}{0.0.0.0:31000}
[INFO] Closing Spring root WebApplicationContext
[INFO] Shutting down log4j
[INFO] Stopped o.e.j.m.p.JettyWebAppContext@f75b427{/,file://<https://builds.apache.org/job/Atlas-master-IntegrationTests/ws/webapp/target/atlas-webapp-1.0.0-SNAPSHOT/,UNAVAILABLE}{/home/jenkins/jenkins-slave/workspace/Atlas-master-IntegrationTests/webapp/target/atlas-webapp-1.0.0-SNAPSHOT.war}>
[INFO] Server reports itself as stopped
[INFO] 
[INFO] --- maven-antrun-plugin:1.7:run (default) @ falcon-bridge ---
[WARNING] Parameter tasks is deprecated, use target instead
log4j:WARN No appenders could be found for logger (org.apache.zookeeper.ClientCnxn).
log4j:WARN Please initialize the log4j system properly.
log4j:WARN See http://logging.apache.org/log4j/1.2/faq.html#noconfig for more info.
[INFO] Executing tasks

main:
   [delete] Deleting directory <https://builds.apache.org/job/Atlas-master-IntegrationTests/ws/addons/hive-bridge/target/data>
   [delete] Deleting directory <https://builds.apache.org/job/Atlas-master-IntegrationTests/ws/addons/hive-bridge/target/logs>
[INFO] Executed tasks
[INFO] 
[INFO] --- maven-source-plugin:2.4:jar-no-fork (attach-sources) @ falcon-bridge ---
[INFO] Building jar: <https://builds.apache.org/job/Atlas-master-IntegrationTests/ws/addons/falcon-bridge/target/falcon-bridge-1.0.0-SNAPSHOT-sources.jar>
[INFO] 
[INFO] --- maven-source-plugin:2.4:test-jar-no-fork (attach-sources) @ falcon-bridge ---
[INFO] Building jar: <https://builds.apache.org/job/Atlas-master-IntegrationTests/ws/addons/falcon-bridge/target/falcon-bridge-1.0.0-SNAPSHOT-test-sources.jar>
[INFO] 
[INFO] --- maven-failsafe-plugin:2.18.1:verify (verify) @ falcon-bridge ---
[INFO] Failsafe report directory: <https://builds.apache.org/job/Atlas-master-IntegrationTests/ws/addons/falcon-bridge/target/failsafe-reports>
[INFO] ------------------------------------------------------------------------
[INFO] Reactor Summary:
[INFO] 
[INFO] Apache Atlas Server Build Tools .................... SUCCESS [  0.628 s]
[INFO] apache-atlas ....................................... SUCCESS [  3.991 s]
[INFO] Apache Atlas Test Utility Tools .................... SUCCESS [  9.950 s]
[INFO] Open Connector Framework (OCF) ..................... SUCCESS [ 11.435 s]
[INFO] Apache Atlas Integration ........................... SUCCESS [ 21.071 s]
[INFO] Apache Atlas Common ................................ SUCCESS [  9.369 s]
[INFO] Apache Atlas Client ................................ SUCCESS [  0.502 s]
[INFO] atlas-client-common ................................ SUCCESS [  6.549 s]
[INFO] atlas-client-v1 .................................... SUCCESS [  7.498 s]
[INFO] Apache Atlas Server API ............................ SUCCESS [  5.597 s]
[INFO] Apache Atlas Notification .......................... SUCCESS [  9.153 s]
[INFO] atlas-client-v2 .................................... SUCCESS [  5.793 s]
[INFO] Apache Atlas Graph Database Projects ............... SUCCESS [  0.460 s]
[INFO] Apache Atlas Graph Database API .................... SUCCESS [  4.859 s]
[INFO] Graph Database Common Code ......................... SUCCESS [  4.858 s]
[INFO] Apache Atlas JanusGraph DB Impl .................... SUCCESS [ 11.310 s]
[INFO] Apache Atlas Graph Database Implementation Dependencies SUCCESS [  2.120 s]
[INFO] Shaded version of Apache hbase client .............. SUCCESS [  7.708 s]
[INFO] Apache Atlas Titan 0.5.4 Graph DB Impl ............. SUCCESS [ 37.942 s]
[INFO] Shaded version of Apache hbase server .............. SUCCESS [ 19.979 s]
[INFO] Apache Atlas Authorization ......................... SUCCESS [  7.724 s]
[INFO] Apache Atlas Repository ............................ SUCCESS [ 28.511 s]
[INFO] Apache Atlas UI .................................... SUCCESS [01:12 min]
[INFO] Apache Atlas Web Application ....................... SUCCESS [04:16 min]
[INFO] Apache Atlas Documentation ......................... SUCCESS [  3.305 s]
[INFO] Apache Atlas FileSystem Model ...................... SUCCESS [  2.078 s]
[INFO] Apache Atlas Plugin Classloader .................... SUCCESS [  5.682 s]
[INFO] Apache Atlas Hive Bridge Shim ...................... SUCCESS [  4.801 s]
[INFO] Apache Atlas Hive Bridge ........................... SUCCESS [07:41 min]
[INFO] Apache Atlas Falcon Bridge Shim .................... SUCCESS [  5.535 s]
[INFO] Apache Atlas Falcon Bridge ......................... FAILURE [01:02 min]
[INFO] Apache Atlas Sqoop Bridge Shim ..................... SKIPPED
[INFO] Apache Atlas Sqoop Bridge .......................... SKIPPED
[INFO] Apache Atlas Storm Bridge Shim ..................... SKIPPED
[INFO] Apache Atlas Storm Bridge .......................... SKIPPED
[INFO] Apache Atlas Hbase Bridge Shim ..................... SKIPPED
[INFO] Apache Atlas Hbase Bridge .......................... SKIPPED
[INFO] Apache Atlas Distribution .......................... SKIPPED
[INFO] ------------------------------------------------------------------------
[INFO] BUILD FAILURE
[INFO] ------------------------------------------------------------------------
[INFO] Total time: 18:12 min
[INFO] Finished at: 2018-03-26T06:51:23Z
[INFO] Final Memory: 755M/3440M
[INFO] ------------------------------------------------------------------------
[ERROR] Failed to execute goal org.apache.maven.plugins:maven-failsafe-plugin:2.18.1:verify (verify) on project falcon-bridge: There are test failures.
[ERROR] 
[ERROR] Please refer to <https://builds.apache.org/job/Atlas-master-IntegrationTests/ws/addons/falcon-bridge/target/failsafe-reports> for the individual test results.
[ERROR] -> [Help 1]
[ERROR] 
[ERROR] To see the full stack trace of the errors, re-run Maven with the -e switch.
[ERROR] Re-run Maven using the -X switch to enable full debug logging.
[ERROR] 
[ERROR] For more information about the errors and possible solutions, please read the following articles:
[ERROR] [Help 1] http://cwiki.apache.org/confluence/display/MAVEN/MojoFailureException
[ERROR] 
[ERROR] After correcting the problems, you can resume the build with the command
[ERROR]   mvn <goals> -rf :falcon-bridge
Build step 'Execute shell' marked build as failure
[CHECKSTYLE] Collecting checkstyle analysis files...
[CHECKSTYLE] Searching for all files in <https://builds.apache.org/job/Atlas-master-IntegrationTests/ws/> that match the pattern **/target/checkstyle-result.xml
[CHECKSTYLE] Parsing 29 files in <https://builds.apache.org/job/Atlas-master-IntegrationTests/ws/>
[CHECKSTYLE] Successfully parsed file <https://builds.apache.org/job/Atlas-master-IntegrationTests/ws/addons/falcon-bridge-shim/target/checkstyle-result.xml> with 29 unique warnings and 0 duplicates.
[CHECKSTYLE] Successfully parsed file <https://builds.apache.org/job/Atlas-master-IntegrationTests/ws/addons/hdfs-model/target/checkstyle-result.xml> with 29 unique warnings and 0 duplicates.
[CHECKSTYLE] Successfully parsed file <https://builds.apache.org/job/Atlas-master-IntegrationTests/ws/addons/hive-bridge-shim/target/checkstyle-result.xml> with 44 unique warnings and 0 duplicates.
[CHECKSTYLE] Successfully parsed file <https://builds.apache.org/job/Atlas-master-IntegrationTests/ws/addons/hive-bridge/target/checkstyle-result.xml> with 2223 unique warnings and 0 duplicates.
[CHECKSTYLE] Successfully parsed file <https://builds.apache.org/job/Atlas-master-IntegrationTests/ws/authorization/target/checkstyle-result.xml> with 2892 unique warnings and 0 duplicates.
[CHECKSTYLE] Successfully parsed file <https://builds.apache.org/job/Atlas-master-IntegrationTests/ws/client/client-v1/target/checkstyle-result.xml> with 3776 unique warnings and 0 duplicates.
[CHECKSTYLE] Successfully parsed file <https://builds.apache.org/job/Atlas-master-IntegrationTests/ws/client/client-v2/target/checkstyle-result.xml> with 4135 unique warnings and 0 duplicates.
[CHECKSTYLE] Successfully parsed file <https://builds.apache.org/job/Atlas-master-IntegrationTests/ws/client/common/target/checkstyle-result.xml> with 4623 unique warnings and 0 duplicates.
[CHECKSTYLE] Successfully parsed file <https://builds.apache.org/job/Atlas-master-IntegrationTests/ws/client/target/checkstyle-result.xml> with 4623 unique warnings and 0 duplicates.
[CHECKSTYLE] Successfully parsed file <https://builds.apache.org/job/Atlas-master-IntegrationTests/ws/common/target/checkstyle-result.xml> with 5654 unique warnings and 0 duplicates.
[CHECKSTYLE] Successfully parsed file <https://builds.apache.org/job/Atlas-master-IntegrationTests/ws/dashboardv2/target/checkstyle-result.xml> with 5654 unique warnings and 0 duplicates.
[CHECKSTYLE] Successfully parsed file <https://builds.apache.org/job/Atlas-master-IntegrationTests/ws/docs/target/checkstyle-result.xml> with 5654 unique warnings and 0 duplicates.
[CHECKSTYLE] Successfully parsed file <https://builds.apache.org/job/Atlas-master-IntegrationTests/ws/graphdb/api/target/checkstyle-result.xml> with 5946 unique warnings and 0 duplicates.
[CHECKSTYLE] Successfully parsed file <https://builds.apache.org/job/Atlas-master-IntegrationTests/ws/graphdb/common/target/checkstyle-result.xml> with 6155 unique warnings and 0 duplicates.
[CHECKSTYLE] Successfully parsed file <https://builds.apache.org/job/Atlas-master-IntegrationTests/ws/graphdb/graphdb-impls/target/checkstyle-result.xml> with 6155 unique warnings and 0 duplicates.
[CHECKSTYLE] Successfully parsed file <https://builds.apache.org/job/Atlas-master-IntegrationTests/ws/graphdb/janus/target/checkstyle-result.xml> with 7201 unique warnings and 0 duplicates.
[CHECKSTYLE] Successfully parsed file <https://builds.apache.org/job/Atlas-master-IntegrationTests/ws/graphdb/target/checkstyle-result.xml> with 7201 unique warnings and 0 duplicates.
[CHECKSTYLE] Successfully parsed file <https://builds.apache.org/job/Atlas-master-IntegrationTests/ws/graphdb/titan0/target/checkstyle-result.xml> with 9699 unique warnings and 0 duplicates.
[CHECKSTYLE] Successfully parsed file <https://builds.apache.org/job/Atlas-master-IntegrationTests/ws/intg/target/checkstyle-result.xml> with 20642 unique warnings and 0 duplicates.
[CHECKSTYLE] Successfully parsed file <https://builds.apache.org/job/Atlas-master-IntegrationTests/ws/notification/target/checkstyle-result.xml> with 21878 unique warnings and 0 duplicates.
[CHECKSTYLE] Successfully parsed file <https://builds.apache.org/job/Atlas-master-IntegrationTests/ws/om-fwk-ocf/target/checkstyle-result.xml> with 26608 unique warnings and 0 duplicates.
[CHECKSTYLE] Successfully parsed file <https://builds.apache.org/job/Atlas-master-IntegrationTests/ws/plugin-classloader/target/checkstyle-result.xml> with 26721 unique warnings and 0 duplicates.
[CHECKSTYLE] Successfully parsed file <https://builds.apache.org/job/Atlas-master-IntegrationTests/ws/repository/target/checkstyle-result.xml> with 46020 unique warnings and 0 duplicates.
[CHECKSTYLE] Successfully parsed file <https://builds.apache.org/job/Atlas-master-IntegrationTests/ws/server-api/target/checkstyle-result.xml> with 46171 unique warnings and 0 duplicates.
[CHECKSTYLE] Successfully parsed file <https://builds.apache.org/job/Atlas-master-IntegrationTests/ws/shaded/hbase-client-shaded/target/checkstyle-result.xml> with 46171 unique warnings and 0 duplicates.
[CHECKSTYLE] Successfully parsed file <https://builds.apache.org/job/Atlas-master-IntegrationTests/ws/shaded/hbase-server-shaded/target/checkstyle-result.xml> with 46171 unique warnings and 0 duplicates.
[CHECKSTYLE] Successfully parsed file <https://builds.apache.org/job/Atlas-master-IntegrationTests/ws/target/checkstyle-result.xml> with 46171 unique warnings and 0 duplicates.
[CHECKSTYLE] Successfully parsed file <https://builds.apache.org/job/Atlas-master-IntegrationTests/ws/test-tools/target/checkstyle-result.xml> with 46209 unique warnings and 0 duplicates.
[CHECKSTYLE] Successfully parsed file <https://builds.apache.org/job/Atlas-master-IntegrationTests/ws/webapp/target/checkstyle-result.xml> with 54169 unique warnings and 0 duplicates.
<Git Blamer> Using GitBlamer to create author and commit information for all warnings.
<Git Blamer> GIT_COMMIT=31eb3664ce8722f4323fa4a5369ebec26959aa1f, workspace=<https://builds.apache.org/job/Atlas-master-IntegrationTests/ws/>
 > git rev-parse 31eb3664ce8722f4323fa4a5369ebec26959aa1f^{commit} # timeout=10
<Git Blamer> Skipping file <https://builds.apache.org/job/Atlas-master-IntegrationTests/ws/repository/src/main/java/org/apache/atlas/discovery/SearchIndexer.java,> no result found.
[CHECKSTYLE] Computing warning deltas based on reference build #862
[FINDBUGS] Collecting findbugs analysis files...
[FINDBUGS] Searching for all files in <https://builds.apache.org/job/Atlas-master-IntegrationTests/ws/> that match the pattern **/target/findbugs.xml
[FINDBUGS] Parsing 20 files in <https://builds.apache.org/job/Atlas-master-IntegrationTests/ws/>
[FINDBUGS] Successfully parsed file <https://builds.apache.org/job/Atlas-master-IntegrationTests/ws/addons/falcon-bridge-shim/target/findbugs.xml> with 0 unique warnings and 0 duplicates.
[FINDBUGS] Successfully parsed file <https://builds.apache.org/job/Atlas-master-IntegrationTests/ws/addons/hive-bridge-shim/target/findbugs.xml> with 0 unique warnings and 0 duplicates.
[FINDBUGS] Successfully parsed file <https://builds.apache.org/job/Atlas-master-IntegrationTests/ws/addons/hive-bridge/target/findbugs.xml> with 0 unique warnings and 0 duplicates.
[FINDBUGS] Successfully parsed file <https://builds.apache.org/job/Atlas-master-IntegrationTests/ws/authorization/target/findbugs.xml> with 0 unique warnings and 0 duplicates.
[FINDBUGS] Successfully parsed file <https://builds.apache.org/job/Atlas-master-IntegrationTests/ws/client/client-v1/target/findbugs.xml> with 0 unique warnings and 0 duplicates.
[FINDBUGS] Successfully parsed file <https://builds.apache.org/job/Atlas-master-IntegrationTests/ws/client/client-v2/target/findbugs.xml> with 0 unique warnings and 0 duplicates.
[FINDBUGS] Successfully parsed file <https://builds.apache.org/job/Atlas-master-IntegrationTests/ws/client/common/target/findbugs.xml> with 0 unique warnings and 0 duplicates.
[FINDBUGS] Successfully parsed file <https://builds.apache.org/job/Atlas-master-IntegrationTests/ws/common/target/findbugs.xml> with 0 unique warnings and 0 duplicates.
[FINDBUGS] Successfully parsed file <https://builds.apache.org/job/Atlas-master-IntegrationTests/ws/graphdb/api/target/findbugs.xml> with 0 unique warnings and 0 duplicates.
[FINDBUGS] Successfully parsed file <https://builds.apache.org/job/Atlas-master-IntegrationTests/ws/graphdb/common/target/findbugs.xml> with 0 unique warnings and 0 duplicates.
[FINDBUGS] Successfully parsed file <https://builds.apache.org/job/Atlas-master-IntegrationTests/ws/graphdb/janus/target/findbugs.xml> with 0 unique warnings and 0 duplicates.
[FINDBUGS] Successfully parsed file <https://builds.apache.org/job/Atlas-master-IntegrationTests/ws/graphdb/titan0/target/findbugs.xml> with 0 unique warnings and 0 duplicates.
[FINDBUGS] Successfully parsed file <https://builds.apache.org/job/Atlas-master-IntegrationTests/ws/intg/target/findbugs.xml> with 0 unique warnings and 0 duplicates.
[FINDBUGS] Successfully parsed file <https://builds.apache.org/job/Atlas-master-IntegrationTests/ws/notification/target/findbugs.xml> with 0 unique warnings and 0 duplicates.
[FINDBUGS] Successfully parsed file <https://builds.apache.org/job/Atlas-master-IntegrationTests/ws/om-fwk-ocf/target/findbugs.xml> with 0 unique warnings and 0 duplicates.
[FINDBUGS] Successfully parsed file <https://builds.apache.org/job/Atlas-master-IntegrationTests/ws/plugin-classloader/target/findbugs.xml> with 0 unique warnings and 0 duplicates.
[FINDBUGS] Successfully parsed file <https://builds.apache.org/job/Atlas-master-IntegrationTests/ws/repository/target/findbugs.xml> with 0 unique warnings and 0 duplicates.
[FINDBUGS] Successfully parsed file <https://builds.apache.org/job/Atlas-master-IntegrationTests/ws/server-api/target/findbugs.xml> with 0 unique warnings and 0 duplicates.
[FINDBUGS] Successfully parsed file <https://builds.apache.org/job/Atlas-master-IntegrationTests/ws/test-tools/target/findbugs.xml> with 0 unique warnings and 0 duplicates.
[FINDBUGS] Successfully parsed file <https://builds.apache.org/job/Atlas-master-IntegrationTests/ws/webapp/target/findbugs.xml> with 0 unique warnings and 0 duplicates.
<Git Blamer> Using GitBlamer to create author and commit information for all warnings.
<Git Blamer> GIT_COMMIT=31eb3664ce8722f4323fa4a5369ebec26959aa1f, workspace=<https://builds.apache.org/job/Atlas-master-IntegrationTests/ws/>
[FINDBUGS] Computing warning deltas based on reference build #862
Archiving artifacts
[Fast Archiver] Compressed 138.04 MB of artifacts by 86.7% relative to #862
TestNG Reports Processing: START
Looking for TestNG results report in workspace using pattern: **/target/surefire-reports/testng-results.xml,**/target/failsafe-reports/testng-results.xml
Saving reports...
Processing '/x1/jenkins/jenkins-home/jobs/Atlas-master-IntegrationTests/builds/863/testng/testng-results-1.xml'
Processing '/x1/jenkins/jenkins-home/jobs/Atlas-master-IntegrationTests/builds/863/testng/testng-results-2.xml'
Processing '/x1/jenkins/jenkins-home/jobs/Atlas-master-IntegrationTests/builds/863/testng/testng-results.xml'
0.574713% of tests failed, which exceeded threshold of 0%. Marking build as UNSTABLE
TestNG Reports Processing: FINISH

Jenkins build is back to normal : Atlas-master-IntegrationTests #864

Posted by Apache Jenkins Server <je...@builds.apache.org>.
See <https://builds.apache.org/job/Atlas-master-IntegrationTests/864/display/redirect?page=changes>