You are viewing a plain text version of this content. The canonical link for it is here.
Posted to dev@thrift.apache.org by Apache Jenkins Server <je...@builds.apache.org> on 2011/06/18 18:42:20 UTC

Build failed in Jenkins: Thrift #167

See <https://builds.apache.org/job/Thrift/167/changes>

Changes:

[molinaro] THRIFT-1151 - catch some serialization errors

[molinaro] THRIFT-1213 - make membuffer in erlang more useful

------------------------------------------
[...truncated 752 lines...]
[WARNING:<https://builds.apache.org/job/Thrift/ws/thrift/test/DebugProtoTest.thrift>:179] 64-bit constant "72057594037927935" may not work in all languages.

[WARNING:<https://builds.apache.org/job/Thrift/ws/thrift/test/DebugProtoTest.thrift>:179] 64-bit constant "9223372036854775807" may not work in all languages.

[WARNING:<https://builds.apache.org/job/Thrift/ws/thrift/test/DebugProtoTest.thrift>:188] 64-bit constant "4294967295" may not work in all languages.

[WARNING:<https://builds.apache.org/job/Thrift/ws/thrift/test/DebugProtoTest.thrift>:188] 64-bit constant "1099511627775" may not work in all languages.

[WARNING:<https://builds.apache.org/job/Thrift/ws/thrift/test/DebugProtoTest.thrift>:188] 64-bit constant "281474976710655" may not work in all languages.

[WARNING:<https://builds.apache.org/job/Thrift/ws/thrift/test/DebugProtoTest.thrift>:188] 64-bit constant "72057594037927935" may not work in all languages.

[WARNING:<https://builds.apache.org/job/Thrift/ws/thrift/test/DebugProtoTest.thrift>:188] 64-bit constant "9223372036854775807" may not work in all languages.

[WARNING:<https://builds.apache.org/job/Thrift/ws/thrift/test/DebugProtoTest.thrift>:197] 64-bit constant "9223372036854775807" may not work in all languages.

[WARNING:<https://builds.apache.org/job/Thrift/ws/thrift/test/DebugProtoTest.thrift>:204] 64-bit constant "9223372036854775807" may not work in all languages.

/bin/bash ../../../libtool  --tag=CXX   --mode=compile g++ -DHAVE_CONFIG_H -I. -I../../.. -I../../../lib/cpp/src -I/usr/include  -Wall -g -O2 -MT DebugProtoTest_types.lo -MD -MP -MF .deps/DebugProtoTest_types.Tpo -c -o DebugProtoTest_types.lo `test -f 'gen-cpp/DebugProtoTest_types.cpp' || echo './'`gen-cpp/DebugProtoTest_types.cpp
libtool: compile:  g++ -DHAVE_CONFIG_H -I. -I../../.. -I../../../lib/cpp/src -I/usr/include -Wall -g -O2 -MT DebugProtoTest_types.lo -MD -MP -MF .deps/DebugProtoTest_types.Tpo -c gen-cpp/DebugProtoTest_types.cpp  -fPIC -DPIC -o .libs/DebugProtoTest_types.o
libtool: compile:  g++ -DHAVE_CONFIG_H -I. -I../../.. -I../../../lib/cpp/src -I/usr/include -Wall -g -O2 -MT DebugProtoTest_types.lo -MD -MP -MF .deps/DebugProtoTest_types.Tpo -c gen-cpp/DebugProtoTest_types.cpp -o DebugProtoTest_types.o >/dev/null 2>&1
mv -f .deps/DebugProtoTest_types.Tpo .deps/DebugProtoTest_types.Plo
../../../compiler/cpp/thrift --gen cpp:dense ../../../test/OptionalRequiredTest.thrift
/bin/bash ../../../libtool  --tag=CXX   --mode=compile g++ -DHAVE_CONFIG_H -I. -I../../.. -I../../../lib/cpp/src -I/usr/include  -Wall -g -O2 -MT OptionalRequiredTest_types.lo -MD -MP -MF .deps/OptionalRequiredTest_types.Tpo -c -o OptionalRequiredTest_types.lo `test -f 'gen-cpp/OptionalRequiredTest_types.cpp' || echo './'`gen-cpp/OptionalRequiredTest_types.cpp
libtool: compile:  g++ -DHAVE_CONFIG_H -I. -I../../.. -I../../../lib/cpp/src -I/usr/include -Wall -g -O2 -MT OptionalRequiredTest_types.lo -MD -MP -MF .deps/OptionalRequiredTest_types.Tpo -c gen-cpp/OptionalRequiredTest_types.cpp  -fPIC -DPIC -o .libs/OptionalRequiredTest_types.o
libtool: compile:  g++ -DHAVE_CONFIG_H -I. -I../../.. -I../../../lib/cpp/src -I/usr/include -Wall -g -O2 -MT OptionalRequiredTest_types.lo -MD -MP -MF .deps/OptionalRequiredTest_types.Tpo -c gen-cpp/OptionalRequiredTest_types.cpp -o OptionalRequiredTest_types.o >/dev/null 2>&1
mv -f .deps/OptionalRequiredTest_types.Tpo .deps/OptionalRequiredTest_types.Plo
../../../compiler/cpp/thrift --gen cpp:dense ../../../test/ThriftTest.thrift
/bin/bash ../../../libtool  --tag=CXX   --mode=compile g++ -DHAVE_CONFIG_H -I. -I../../.. -I../../../lib/cpp/src -I/usr/include  -Wall -g -O2 -MT ThriftTest_types.lo -MD -MP -MF .deps/ThriftTest_types.Tpo -c -o ThriftTest_types.lo `test -f 'gen-cpp/ThriftTest_types.cpp' || echo './'`gen-cpp/ThriftTest_types.cpp
libtool: compile:  g++ -DHAVE_CONFIG_H -I. -I../../.. -I../../../lib/cpp/src -I/usr/include -Wall -g -O2 -MT ThriftTest_types.lo -MD -MP -MF .deps/ThriftTest_types.Tpo -c gen-cpp/ThriftTest_types.cpp  -fPIC -DPIC -o .libs/ThriftTest_types.o
libtool: compile:  g++ -DHAVE_CONFIG_H -I. -I../../.. -I../../../lib/cpp/src -I/usr/include -Wall -g -O2 -MT ThriftTest_types.lo -MD -MP -MF .deps/ThriftTest_types.Tpo -c gen-cpp/ThriftTest_types.cpp -o ThriftTest_types.o >/dev/null 2>&1
mv -f .deps/ThriftTest_types.Tpo .deps/ThriftTest_types.Plo
/bin/bash ../../../libtool --tag=CXX   --mode=compile g++ -DHAVE_CONFIG_H -I. -I../../.. -I../../../lib/cpp/src -I/usr/include  -Wall -g -O2 -MT ThriftTest_extras.lo -MD -MP -MF .deps/ThriftTest_extras.Tpo -c -o ThriftTest_extras.lo ThriftTest_extras.cpp
libtool: compile:  g++ -DHAVE_CONFIG_H -I. -I../../.. -I../../../lib/cpp/src -I/usr/include -Wall -g -O2 -MT ThriftTest_extras.lo -MD -MP -MF .deps/ThriftTest_extras.Tpo -c ThriftTest_extras.cpp  -fPIC -DPIC -o .libs/ThriftTest_extras.o
libtool: compile:  g++ -DHAVE_CONFIG_H -I. -I../../.. -I../../../lib/cpp/src -I/usr/include -Wall -g -O2 -MT ThriftTest_extras.lo -MD -MP -MF .deps/ThriftTest_extras.Tpo -c ThriftTest_extras.cpp -o ThriftTest_extras.o >/dev/null 2>&1
mv -f .deps/ThriftTest_extras.Tpo .deps/ThriftTest_extras.Plo
/bin/bash ../../../libtool --tag=CXX   --mode=compile g++ -DHAVE_CONFIG_H -I. -I../../.. -I../../../lib/cpp/src -I/usr/include  -Wall -g -O2 -MT DebugProtoTest_extras.lo -MD -MP -MF .deps/DebugProtoTest_extras.Tpo -c -o DebugProtoTest_extras.lo DebugProtoTest_extras.cpp
libtool: compile:  g++ -DHAVE_CONFIG_H -I. -I../../.. -I../../../lib/cpp/src -I/usr/include -Wall -g -O2 -MT DebugProtoTest_extras.lo -MD -MP -MF .deps/DebugProtoTest_extras.Tpo -c DebugProtoTest_extras.cpp  -fPIC -DPIC -o .libs/DebugProtoTest_extras.o
libtool: compile:  g++ -DHAVE_CONFIG_H -I. -I../../.. -I../../../lib/cpp/src -I/usr/include -Wall -g -O2 -MT DebugProtoTest_extras.lo -MD -MP -MF .deps/DebugProtoTest_extras.Tpo -c DebugProtoTest_extras.cpp -o DebugProtoTest_extras.o >/dev/null 2>&1
mv -f .deps/DebugProtoTest_extras.Tpo .deps/DebugProtoTest_extras.Plo
/bin/bash ../../../libtool --tag=CXX   --mode=link g++ -Wall -g -O2   -o libtestgencpp.la  DebugProtoTest_types.lo OptionalRequiredTest_types.lo DebugProtoTest_types.lo ThriftTest_types.lo ThriftTest_extras.lo DebugProtoTest_extras.lo ../../../lib/cpp/libthrift.la -lssl -lrt -lpthread 
copying selected object files to avoid basename conflicts...
libtool: link: ln .libs/DebugProtoTest_types.o .libs/libtestgencpp.lax/lt1-DebugProtoTest_types.o || cp .libs/DebugProtoTest_types.o .libs/libtestgencpp.lax/lt1-DebugProtoTest_types.o
libtool: link: ar cru .libs/libtestgencpp.a .libs/DebugProtoTest_types.o .libs/OptionalRequiredTest_types.o .libs/libtestgencpp.lax/lt1-DebugProtoTest_types.o .libs/ThriftTest_types.o .libs/ThriftTest_extras.o .libs/DebugProtoTest_extras.o
libtool: link: ranlib .libs/libtestgencpp.a
libtool: link: rm -fr .libs/libtestgencpp.lax
libtool: link: ( cd ".libs" && rm -f "libtestgencpp.la" && ln -s "../libtestgencpp.la" "libtestgencpp.la" )
g++ -DHAVE_CONFIG_H -I. -I../../.. -I../../../lib/cpp/src -I/usr/include  -Wall -g -O2 -MT Benchmark.o -MD -MP -MF .deps/Benchmark.Tpo -c -o Benchmark.o Benchmark.cpp
mv -f .deps/Benchmark.Tpo .deps/Benchmark.Po
/bin/bash ../../../libtool --tag=CXX   --mode=link g++ -Wall -g -O2   -o Benchmark Benchmark.o libtestgencpp.la -lssl -lrt -lpthread 
libtool: link: g++ -Wall -g -O2 -o .libs/Benchmark Benchmark.o  ./.libs/libtestgencpp.a <https://builds.apache.org/job/Thrift/ws/thrift/lib/cpp/.libs/libthrift.so> -lssl -lrt -lpthread
make[4]: Leaving directory `<https://builds.apache.org/job/Thrift/ws/thrift/lib/cpp/test'>
make[3]: Leaving directory `<https://builds.apache.org/job/Thrift/ws/thrift/lib/cpp'>
Making all in c_glib
make[3]: Entering directory `<https://builds.apache.org/job/Thrift/ws/thrift/lib/c_glib'>
Making all in .
make[4]: Entering directory `<https://builds.apache.org/job/Thrift/ws/thrift/lib/c_glib'>
/bin/bash ../../libtool  --tag=CC   --mode=compile gcc -DHAVE_CONFIG_H -I. -I../..    -g -Wall -W -Werror -Isrc -I/usr/include/glib-2.0 -I/usr/lib/glib-2.0/include    -MT libthrift_c_glib_la-thrift.lo -MD -MP -MF .deps/libthrift_c_glib_la-thrift.Tpo -c -o libthrift_c_glib_la-thrift.lo `test -f 'src/thrift.c' || echo './'`src/thrift.c
libtool: compile:  gcc -DHAVE_CONFIG_H -I. -I../.. -g -Wall -W -Werror -Isrc -I/usr/include/glib-2.0 -I/usr/lib/glib-2.0/include -MT libthrift_c_glib_la-thrift.lo -MD -MP -MF .deps/libthrift_c_glib_la-thrift.Tpo -c src/thrift.c  -fPIC -DPIC -o .libs/libthrift_c_glib_la-thrift.o
libtool: compile:  gcc -DHAVE_CONFIG_H -I. -I../.. -g -Wall -W -Werror -Isrc -I/usr/include/glib-2.0 -I/usr/lib/glib-2.0/include -MT libthrift_c_glib_la-thrift.lo -MD -MP -MF .deps/libthrift_c_glib_la-thrift.Tpo -c src/thrift.c -o libthrift_c_glib_la-thrift.o >/dev/null 2>&1
mv -f .deps/libthrift_c_glib_la-thrift.Tpo .deps/libthrift_c_glib_la-thrift.Plo
/bin/bash ../../libtool  --tag=CC   --mode=compile gcc -DHAVE_CONFIG_H -I. -I../..    -g -Wall -W -Werror -Isrc -I/usr/include/glib-2.0 -I/usr/lib/glib-2.0/include    -MT libthrift_c_glib_la-thrift_struct.lo -MD -MP -MF .deps/libthrift_c_glib_la-thrift_struct.Tpo -c -o libthrift_c_glib_la-thrift_struct.lo `test -f 'src/thrift_struct.c' || echo './'`src/thrift_struct.c
libtool: compile:  gcc -DHAVE_CONFIG_H -I. -I../.. -g -Wall -W -Werror -Isrc -I/usr/include/glib-2.0 -I/usr/lib/glib-2.0/include -MT libthrift_c_glib_la-thrift_struct.lo -MD -MP -MF .deps/libthrift_c_glib_la-thrift_struct.Tpo -c src/thrift_struct.c  -fPIC -DPIC -o .libs/libthrift_c_glib_la-thrift_struct.o
libtool: compile:  gcc -DHAVE_CONFIG_H -I. -I../.. -g -Wall -W -Werror -Isrc -I/usr/include/glib-2.0 -I/usr/lib/glib-2.0/include -MT libthrift_c_glib_la-thrift_struct.lo -MD -MP -MF .deps/libthrift_c_glib_la-thrift_struct.Tpo -c src/thrift_struct.c -o libthrift_c_glib_la-thrift_struct.o >/dev/null 2>&1
mv -f .deps/libthrift_c_glib_la-thrift_struct.Tpo .deps/libthrift_c_glib_la-thrift_struct.Plo
/bin/bash ../../libtool  --tag=CC   --mode=compile gcc -DHAVE_CONFIG_H -I. -I../..    -g -Wall -W -Werror -Isrc -I/usr/include/glib-2.0 -I/usr/lib/glib-2.0/include    -MT libthrift_c_glib_la-thrift_application_exception.lo -MD -MP -MF .deps/libthrift_c_glib_la-thrift_application_exception.Tpo -c -o libthrift_c_glib_la-thrift_application_exception.lo `test -f 'src/thrift_application_exception.c' || echo './'`src/thrift_application_exception.c
libtool: compile:  gcc -DHAVE_CONFIG_H -I. -I../.. -g -Wall -W -Werror -Isrc -I/usr/include/glib-2.0 -I/usr/lib/glib-2.0/include -MT libthrift_c_glib_la-thrift_application_exception.lo -MD -MP -MF .deps/libthrift_c_glib_la-thrift_application_exception.Tpo -c src/thrift_application_exception.c  -fPIC -DPIC -o .libs/libthrift_c_glib_la-thrift_application_exception.o
libtool: compile:  gcc -DHAVE_CONFIG_H -I. -I../.. -g -Wall -W -Werror -Isrc -I/usr/include/glib-2.0 -I/usr/lib/glib-2.0/include -MT libthrift_c_glib_la-thrift_application_exception.lo -MD -MP -MF .deps/libthrift_c_glib_la-thrift_application_exception.Tpo -c src/thrift_application_exception.c -o libthrift_c_glib_la-thrift_application_exception.o >/dev/null 2>&1
mv -f .deps/libthrift_c_glib_la-thrift_application_exception.Tpo .deps/libthrift_c_glib_la-thrift_application_exception.Plo
/bin/bash ../../libtool  --tag=CC   --mode=compile gcc -DHAVE_CONFIG_H -I. -I../..    -g -Wall -W -Werror -Isrc -I/usr/include/glib-2.0 -I/usr/lib/glib-2.0/include    -MT libthrift_c_glib_la-thrift_processor.lo -MD -MP -MF .deps/libthrift_c_glib_la-thrift_processor.Tpo -c -o libthrift_c_glib_la-thrift_processor.lo `test -f 'src/processor/thrift_processor.c' || echo './'`src/processor/thrift_processor.c
libtool: compile:  gcc -DHAVE_CONFIG_H -I. -I../.. -g -Wall -W -Werror -Isrc -I/usr/include/glib-2.0 -I/usr/lib/glib-2.0/include -MT libthrift_c_glib_la-thrift_processor.lo -MD -MP -MF .deps/libthrift_c_glib_la-thrift_processor.Tpo -c src/processor/thrift_processor.c  -fPIC -DPIC -o .libs/libthrift_c_glib_la-thrift_processor.o
libtool: compile:  gcc -DHAVE_CONFIG_H -I. -I../.. -g -Wall -W -Werror -Isrc -I/usr/include/glib-2.0 -I/usr/lib/glib-2.0/include -MT libthrift_c_glib_la-thrift_processor.lo -MD -MP -MF .deps/libthrift_c_glib_la-thrift_processor.Tpo -c src/processor/thrift_processor.c -o libthrift_c_glib_la-thrift_processor.o >/dev/null 2>&1
mv -f .deps/libthrift_c_glib_la-thrift_processor.Tpo .deps/libthrift_c_glib_la-thrift_processor.Plo
/bin/bash ../../libtool  --tag=CC   --mode=compile gcc -DHAVE_CONFIG_H -I. -I../..    -g -Wall -W -Werror -Isrc -I/usr/include/glib-2.0 -I/usr/lib/glib-2.0/include    -MT libthrift_c_glib_la-thrift_protocol.lo -MD -MP -MF .deps/libthrift_c_glib_la-thrift_protocol.Tpo -c -o libthrift_c_glib_la-thrift_protocol.lo `test -f 'src/protocol/thrift_protocol.c' || echo './'`src/protocol/thrift_protocol.c
libtool: compile:  gcc -DHAVE_CONFIG_H -I. -I../.. -g -Wall -W -Werror -Isrc -I/usr/include/glib-2.0 -I/usr/lib/glib-2.0/include -MT libthrift_c_glib_la-thrift_protocol.lo -MD -MP -MF .deps/libthrift_c_glib_la-thrift_protocol.Tpo -c src/protocol/thrift_protocol.c  -fPIC -DPIC -o .libs/libthrift_c_glib_la-thrift_protocol.o
libtool: compile:  gcc -DHAVE_CONFIG_H -I. -I../.. -g -Wall -W -Werror -Isrc -I/usr/include/glib-2.0 -I/usr/lib/glib-2.0/include -MT libthrift_c_glib_la-thrift_protocol.lo -MD -MP -MF .deps/libthrift_c_glib_la-thrift_protocol.Tpo -c src/protocol/thrift_protocol.c -o libthrift_c_glib_la-thrift_protocol.o >/dev/null 2>&1
mv -f .deps/libthrift_c_glib_la-thrift_protocol.Tpo .deps/libthrift_c_glib_la-thrift_protocol.Plo
/bin/bash ../../libtool  --tag=CC   --mode=compile gcc -DHAVE_CONFIG_H -I. -I../..    -g -Wall -W -Werror -Isrc -I/usr/include/glib-2.0 -I/usr/lib/glib-2.0/include    -MT libthrift_c_glib_la-thrift_protocol_factory.lo -MD -MP -MF .deps/libthrift_c_glib_la-thrift_protocol_factory.Tpo -c -o libthrift_c_glib_la-thrift_protocol_factory.lo `test -f 'src/protocol/thrift_protocol_factory.c' || echo './'`src/protocol/thrift_protocol_factory.c
libtool: compile:  gcc -DHAVE_CONFIG_H -I. -I../.. -g -Wall -W -Werror -Isrc -I/usr/include/glib-2.0 -I/usr/lib/glib-2.0/include -MT libthrift_c_glib_la-thrift_protocol_factory.lo -MD -MP -MF .deps/libthrift_c_glib_la-thrift_protocol_factory.Tpo -c src/protocol/thrift_protocol_factory.c  -fPIC -DPIC -o .libs/libthrift_c_glib_la-thrift_protocol_factory.o
libtool: compile:  gcc -DHAVE_CONFIG_H -I. -I../.. -g -Wall -W -Werror -Isrc -I/usr/include/glib-2.0 -I/usr/lib/glib-2.0/include -MT libthrift_c_glib_la-thrift_protocol_factory.lo -MD -MP -MF .deps/libthrift_c_glib_la-thrift_protocol_factory.Tpo -c src/protocol/thrift_protocol_factory.c -o libthrift_c_glib_la-thrift_protocol_factory.o >/dev/null 2>&1
mv -f .deps/libthrift_c_glib_la-thrift_protocol_factory.Tpo .deps/libthrift_c_glib_la-thrift_protocol_factory.Plo
/bin/bash ../../libtool  --tag=CC   --mode=compile gcc -DHAVE_CONFIG_H -I. -I../..    -g -Wall -W -Werror -Isrc -I/usr/include/glib-2.0 -I/usr/lib/glib-2.0/include    -MT libthrift_c_glib_la-thrift_binary_protocol.lo -MD -MP -MF .deps/libthrift_c_glib_la-thrift_binary_protocol.Tpo -c -o libthrift_c_glib_la-thrift_binary_protocol.lo `test -f 'src/protocol/thrift_binary_protocol.c' || echo './'`src/protocol/thrift_binary_protocol.c
libtool: compile:  gcc -DHAVE_CONFIG_H -I. -I../.. -g -Wall -W -Werror -Isrc -I/usr/include/glib-2.0 -I/usr/lib/glib-2.0/include -MT libthrift_c_glib_la-thrift_binary_protocol.lo -MD -MP -MF .deps/libthrift_c_glib_la-thrift_binary_protocol.Tpo -c src/protocol/thrift_binary_protocol.c  -fPIC -DPIC -o .libs/libthrift_c_glib_la-thrift_binary_protocol.o
libtool: compile:  gcc -DHAVE_CONFIG_H -I. -I../.. -g -Wall -W -Werror -Isrc -I/usr/include/glib-2.0 -I/usr/lib/glib-2.0/include -MT libthrift_c_glib_la-thrift_binary_protocol.lo -MD -MP -MF .deps/libthrift_c_glib_la-thrift_binary_protocol.Tpo -c src/protocol/thrift_binary_protocol.c -o libthrift_c_glib_la-thrift_binary_protocol.o >/dev/null 2>&1
mv -f .deps/libthrift_c_glib_la-thrift_binary_protocol.Tpo .deps/libthrift_c_glib_la-thrift_binary_protocol.Plo
/bin/bash ../../libtool  --tag=CC   --mode=compile gcc -DHAVE_CONFIG_H -I. -I../..    -g -Wall -W -Werror -Isrc -I/usr/include/glib-2.0 -I/usr/lib/glib-2.0/include    -MT libthrift_c_glib_la-thrift_binary_protocol_factory.lo -MD -MP -MF .deps/libthrift_c_glib_la-thrift_binary_protocol_factory.Tpo -c -o libthrift_c_glib_la-thrift_binary_protocol_factory.lo `test -f 'src/protocol/thrift_binary_protocol_factory.c' || echo './'`src/protocol/thrift_binary_protocol_factory.c
libtool: compile:  gcc -DHAVE_CONFIG_H -I. -I../.. -g -Wall -W -Werror -Isrc -I/usr/include/glib-2.0 -I/usr/lib/glib-2.0/include -MT libthrift_c_glib_la-thrift_binary_protocol_factory.lo -MD -MP -MF .deps/libthrift_c_glib_la-thrift_binary_protocol_factory.Tpo -c src/protocol/thrift_binary_protocol_factory.c  -fPIC -DPIC -o .libs/libthrift_c_glib_la-thrift_binary_protocol_factory.o
libtool: compile:  gcc -DHAVE_CONFIG_H -I. -I../.. -g -Wall -W -Werror -Isrc -I/usr/include/glib-2.0 -I/usr/lib/glib-2.0/include -MT libthrift_c_glib_la-thrift_binary_protocol_factory.lo -MD -MP -MF .deps/libthrift_c_glib_la-thrift_binary_protocol_factory.Tpo -c src/protocol/thrift_binary_protocol_factory.c -o libthrift_c_glib_la-thrift_binary_protocol_factory.o >/dev/null 2>&1
mv -f .deps/libthrift_c_glib_la-thrift_binary_protocol_factory.Tpo .deps/libthrift_c_glib_la-thrift_binary_protocol_factory.Plo
/bin/bash ../../libtool  --tag=CC   --mode=compile gcc -DHAVE_CONFIG_H -I. -I../..    -g -Wall -W -Werror -Isrc -I/usr/include/glib-2.0 -I/usr/lib/glib-2.0/include    -MT libthrift_c_glib_la-thrift_transport.lo -MD -MP -MF .deps/libthrift_c_glib_la-thrift_transport.Tpo -c -o libthrift_c_glib_la-thrift_transport.lo `test -f 'src/transport/thrift_transport.c' || echo './'`src/transport/thrift_transport.c
libtool: compile:  gcc -DHAVE_CONFIG_H -I. -I../.. -g -Wall -W -Werror -Isrc -I/usr/include/glib-2.0 -I/usr/lib/glib-2.0/include -MT libthrift_c_glib_la-thrift_transport.lo -MD -MP -MF .deps/libthrift_c_glib_la-thrift_transport.Tpo -c src/transport/thrift_transport.c  -fPIC -DPIC -o .libs/libthrift_c_glib_la-thrift_transport.o
libtool: compile:  gcc -DHAVE_CONFIG_H -I. -I../.. -g -Wall -W -Werror -Isrc -I/usr/include/glib-2.0 -I/usr/lib/glib-2.0/include -MT libthrift_c_glib_la-thrift_transport.lo -MD -MP -MF .deps/libthrift_c_glib_la-thrift_transport.Tpo -c src/transport/thrift_transport.c -o libthrift_c_glib_la-thrift_transport.o >/dev/null 2>&1
mv -f .deps/libthrift_c_glib_la-thrift_transport.Tpo .deps/libthrift_c_glib_la-thrift_transport.Plo
/bin/bash ../../libtool  --tag=CC   --mode=compile gcc -DHAVE_CONFIG_H -I. -I../..    -g -Wall -W -Werror -Isrc -I/usr/include/glib-2.0 -I/usr/lib/glib-2.0/include    -MT libthrift_c_glib_la-thrift_transport_factory.lo -MD -MP -MF .deps/libthrift_c_glib_la-thrift_transport_factory.Tpo -c -o libthrift_c_glib_la-thrift_transport_factory.lo `test -f 'src/transport/thrift_transport_factory.c' || echo './'`src/transport/thrift_transport_factory.c
libtool: compile:  gcc -DHAVE_CONFIG_H -I. -I../.. -g -Wall -W -Werror -Isrc -I/usr/include/glib-2.0 -I/usr/lib/glib-2.0/include -MT libthrift_c_glib_la-thrift_transport_factory.lo -MD -MP -MF .deps/libthrift_c_glib_la-thrift_transport_factory.Tpo -c src/transport/thrift_transport_factory.c  -fPIC -DPIC -o .libs/libthrift_c_glib_la-thrift_transport_factory.o
libtool: compile:  gcc -DHAVE_CONFIG_H -I. -I../.. -g -Wall -W -Werror -Isrc -I/usr/include/glib-2.0 -I/usr/lib/glib-2.0/include -MT libthrift_c_glib_la-thrift_transport_factory.lo -MD -MP -MF .deps/libthrift_c_glib_la-thrift_transport_factory.Tpo -c src/transport/thrift_transport_factory.c -o libthrift_c_glib_la-thrift_transport_factory.o >/dev/null 2>&1
mv -f .deps/libthrift_c_glib_la-thrift_transport_factory.Tpo .deps/libthrift_c_glib_la-thrift_transport_factory.Plo
/bin/bash ../../libtool  --tag=CC   --mode=compile gcc -DHAVE_CONFIG_H -I. -I../..    -g -Wall -W -Werror -Isrc -I/usr/include/glib-2.0 -I/usr/lib/glib-2.0/include    -MT libthrift_c_glib_la-thrift_socket.lo -MD -MP -MF .deps/libthrift_c_glib_la-thrift_socket.Tpo -c -o libthrift_c_glib_la-thrift_socket.lo `test -f 'src/transport/thrift_socket.c' || echo './'`src/transport/thrift_socket.c
libtool: compile:  gcc -DHAVE_CONFIG_H -I. -I../.. -g -Wall -W -Werror -Isrc -I/usr/include/glib-2.0 -I/usr/lib/glib-2.0/include -MT libthrift_c_glib_la-thrift_socket.lo -MD -MP -MF .deps/libthrift_c_glib_la-thrift_socket.Tpo -c src/transport/thrift_socket.c  -fPIC -DPIC -o .libs/libthrift_c_glib_la-thrift_socket.o
libtool: compile:  gcc -DHAVE_CONFIG_H -I. -I../.. -g -Wall -W -Werror -Isrc -I/usr/include/glib-2.0 -I/usr/lib/glib-2.0/include -MT libthrift_c_glib_la-thrift_socket.lo -MD -MP -MF .deps/libthrift_c_glib_la-thrift_socket.Tpo -c src/transport/thrift_socket.c -o libthrift_c_glib_la-thrift_socket.o >/dev/null 2>&1
mv -f .deps/libthrift_c_glib_la-thrift_socket.Tpo .deps/libthrift_c_glib_la-thrift_socket.Plo
/bin/bash ../../libtool  --tag=CC   --mode=compile gcc -DHAVE_CONFIG_H -I. -I../..    -g -Wall -W -Werror -Isrc -I/usr/include/glib-2.0 -I/usr/lib/glib-2.0/include    -MT libthrift_c_glib_la-thrift_server_transport.lo -MD -MP -MF .deps/libthrift_c_glib_la-thrift_server_transport.Tpo -c -o libthrift_c_glib_la-thrift_server_transport.lo `test -f 'src/transport/thrift_server_transport.c' || echo './'`src/transport/thrift_server_transport.c
libtool: compile:  gcc -DHAVE_CONFIG_H -I. -I../.. -g -Wall -W -Werror -Isrc -I/usr/include/glib-2.0 -I/usr/lib/glib-2.0/include -MT libthrift_c_glib_la-thrift_server_transport.lo -MD -MP -MF .deps/libthrift_c_glib_la-thrift_server_transport.Tpo -c src/transport/thrift_server_transport.c  -fPIC -DPIC -o .libs/libthrift_c_glib_la-thrift_server_transport.o
libtool: compile:  gcc -DHAVE_CONFIG_H -I. -I../.. -g -Wall -W -Werror -Isrc -I/usr/include/glib-2.0 -I/usr/lib/glib-2.0/include -MT libthrift_c_glib_la-thrift_server_transport.lo -MD -MP -MF .deps/libthrift_c_glib_la-thrift_server_transport.Tpo -c src/transport/thrift_server_transport.c -o libthrift_c_glib_la-thrift_server_transport.o >/dev/null 2>&1
mv -f .deps/libthrift_c_glib_la-thrift_server_transport.Tpo .deps/libthrift_c_glib_la-thrift_server_transport.Plo
/bin/bash ../../libtool  --tag=CC   --mode=compile gcc -DHAVE_CONFIG_H -I. -I../..    -g -Wall -W -Werror -Isrc -I/usr/include/glib-2.0 -I/usr/lib/glib-2.0/include    -MT libthrift_c_glib_la-thrift_server_socket.lo -MD -MP -MF .deps/libthrift_c_glib_la-thrift_server_socket.Tpo -c -o libthrift_c_glib_la-thrift_server_socket.lo `test -f 'src/transport/thrift_server_socket.c' || echo './'`src/transport/thrift_server_socket.c
libtool: compile:  gcc -DHAVE_CONFIG_H -I. -I../.. -g -Wall -W -Werror -Isrc -I/usr/include/glib-2.0 -I/usr/lib/glib-2.0/include -MT libthrift_c_glib_la-thrift_server_socket.lo -MD -MP -MF .deps/libthrift_c_glib_la-thrift_server_socket.Tpo -c src/transport/thrift_server_socket.c  -fPIC -DPIC -o .libs/libthrift_c_glib_la-thrift_server_socket.o
libtool: compile:  gcc -DHAVE_CONFIG_H -I. -I../.. -g -Wall -W -Werror -Isrc -I/usr/include/glib-2.0 -I/usr/lib/glib-2.0/include -MT libthrift_c_glib_la-thrift_server_socket.lo -MD -MP -MF .deps/libthrift_c_glib_la-thrift_server_socket.Tpo -c src/transport/thrift_server_socket.c -o libthrift_c_glib_la-thrift_server_socket.o >/dev/null 2>&1
mv -f .deps/libthrift_c_glib_la-thrift_server_socket.Tpo .deps/libthrift_c_glib_la-thrift_server_socket.Plo
/bin/bash ../../libtool  --tag=CC   --mode=compile gcc -DHAVE_CONFIG_H -I. -I../..    -g -Wall -W -Werror -Isrc -I/usr/include/glib-2.0 -I/usr/lib/glib-2.0/include    -MT libthrift_c_glib_la-thrift_buffered_transport.lo -MD -MP -MF .deps/libthrift_c_glib_la-thrift_buffered_transport.Tpo -c -o libthrift_c_glib_la-thrift_buffered_transport.lo `test -f 'src/transport/thrift_buffered_transport.c' || echo './'`src/transport/thrift_buffered_transport.c
libtool: compile:  gcc -DHAVE_CONFIG_H -I. -I../.. -g -Wall -W -Werror -Isrc -I/usr/include/glib-2.0 -I/usr/lib/glib-2.0/include -MT libthrift_c_glib_la-thrift_buffered_transport.lo -MD -MP -MF .deps/libthrift_c_glib_la-thrift_buffered_transport.Tpo -c src/transport/thrift_buffered_transport.c  -fPIC -DPIC -o .libs/libthrift_c_glib_la-thrift_buffered_transport.o
libtool: compile:  gcc -DHAVE_CONFIG_H -I. -I../.. -g -Wall -W -Werror -Isrc -I/usr/include/glib-2.0 -I/usr/lib/glib-2.0/include -MT libthrift_c_glib_la-thrift_buffered_transport.lo -MD -MP -MF .deps/libthrift_c_glib_la-thrift_buffered_transport.Tpo -c src/transport/thrift_buffered_transport.c -o libthrift_c_glib_la-thrift_buffered_transport.o >/dev/null 2>&1
mv -f .deps/libthrift_c_glib_la-thrift_buffered_transport.Tpo .deps/libthrift_c_glib_la-thrift_buffered_transport.Plo
/bin/bash ../../libtool  --tag=CC   --mode=compile gcc -DHAVE_CONFIG_H -I. -I../..    -g -Wall -W -Werror -Isrc -I/usr/include/glib-2.0 -I/usr/lib/glib-2.0/include    -MT libthrift_c_glib_la-thrift_framed_transport.lo -MD -MP -MF .deps/libthrift_c_glib_la-thrift_framed_transport.Tpo -c -o libthrift_c_glib_la-thrift_framed_transport.lo `test -f 'src/transport/thrift_framed_transport.c' || echo './'`src/transport/thrift_framed_transport.c
libtool: compile:  gcc -DHAVE_CONFIG_H -I. -I../.. -g -Wall -W -Werror -Isrc -I/usr/include/glib-2.0 -I/usr/lib/glib-2.0/include -MT libthrift_c_glib_la-thrift_framed_transport.lo -MD -MP -MF .deps/libthrift_c_glib_la-thrift_framed_transport.Tpo -c src/transport/thrift_framed_transport.c  -fPIC -DPIC -o .libs/libthrift_c_glib_la-thrift_framed_transport.o
libtool: compile:  gcc -DHAVE_CONFIG_H -I. -I../.. -g -Wall -W -Werror -Isrc -I/usr/include/glib-2.0 -I/usr/lib/glib-2.0/include -MT libthrift_c_glib_la-thrift_framed_transport.lo -MD -MP -MF .deps/libthrift_c_glib_la-thrift_framed_transport.Tpo -c src/transport/thrift_framed_transport.c -o libthrift_c_glib_la-thrift_framed_transport.o >/dev/null 2>&1
mv -f .deps/libthrift_c_glib_la-thrift_framed_transport.Tpo .deps/libthrift_c_glib_la-thrift_framed_transport.Plo
/bin/bash ../../libtool  --tag=CC   --mode=compile gcc -DHAVE_CONFIG_H -I. -I../..    -g -Wall -W -Werror -Isrc -I/usr/include/glib-2.0 -I/usr/lib/glib-2.0/include    -MT libthrift_c_glib_la-thrift_memory_buffer.lo -MD -MP -MF .deps/libthrift_c_glib_la-thrift_memory_buffer.Tpo -c -o libthrift_c_glib_la-thrift_memory_buffer.lo `test -f 'src/transport/thrift_memory_buffer.c' || echo './'`src/transport/thrift_memory_buffer.c
libtool: compile:  gcc -DHAVE_CONFIG_H -I. -I../.. -g -Wall -W -Werror -Isrc -I/usr/include/glib-2.0 -I/usr/lib/glib-2.0/include -MT libthrift_c_glib_la-thrift_memory_buffer.lo -MD -MP -MF .deps/libthrift_c_glib_la-thrift_memory_buffer.Tpo -c src/transport/thrift_memory_buffer.c  -fPIC -DPIC -o .libs/libthrift_c_glib_la-thrift_memory_buffer.o
libtool: compile:  gcc -DHAVE_CONFIG_H -I. -I../.. -g -Wall -W -Werror -Isrc -I/usr/include/glib-2.0 -I/usr/lib/glib-2.0/include -MT libthrift_c_glib_la-thrift_memory_buffer.lo -MD -MP -MF .deps/libthrift_c_glib_la-thrift_memory_buffer.Tpo -c src/transport/thrift_memory_buffer.c -o libthrift_c_glib_la-thrift_memory_buffer.o >/dev/null 2>&1
mv -f .deps/libthrift_c_glib_la-thrift_memory_buffer.Tpo .deps/libthrift_c_glib_la-thrift_memory_buffer.Plo
/bin/bash ../../libtool  --tag=CC   --mode=compile gcc -DHAVE_CONFIG_H -I. -I../..    -g -Wall -W -Werror -Isrc -I/usr/include/glib-2.0 -I/usr/lib/glib-2.0/include    -MT libthrift_c_glib_la-thrift_server.lo -MD -MP -MF .deps/libthrift_c_glib_la-thrift_server.Tpo -c -o libthrift_c_glib_la-thrift_server.lo `test -f 'src/server/thrift_server.c' || echo './'`src/server/thrift_server.c
libtool: compile:  gcc -DHAVE_CONFIG_H -I. -I../.. -g -Wall -W -Werror -Isrc -I/usr/include/glib-2.0 -I/usr/lib/glib-2.0/include -MT libthrift_c_glib_la-thrift_server.lo -MD -MP -MF .deps/libthrift_c_glib_la-thrift_server.Tpo -c src/server/thrift_server.c  -fPIC -DPIC -o .libs/libthrift_c_glib_la-thrift_server.o
libtool: compile:  gcc -DHAVE_CONFIG_H -I. -I../.. -g -Wall -W -Werror -Isrc -I/usr/include/glib-2.0 -I/usr/lib/glib-2.0/include -MT libthrift_c_glib_la-thrift_server.lo -MD -MP -MF .deps/libthrift_c_glib_la-thrift_server.Tpo -c src/server/thrift_server.c -o libthrift_c_glib_la-thrift_server.o >/dev/null 2>&1
mv -f .deps/libthrift_c_glib_la-thrift_server.Tpo .deps/libthrift_c_glib_la-thrift_server.Plo
/bin/bash ../../libtool  --tag=CC   --mode=compile gcc -DHAVE_CONFIG_H -I. -I../..    -g -Wall -W -Werror -Isrc -I/usr/include/glib-2.0 -I/usr/lib/glib-2.0/include    -MT libthrift_c_glib_la-thrift_simple_server.lo -MD -MP -MF .deps/libthrift_c_glib_la-thrift_simple_server.Tpo -c -o libthrift_c_glib_la-thrift_simple_server.lo `test -f 'src/server/thrift_simple_server.c' || echo './'`src/server/thrift_simple_server.c
libtool: compile:  gcc -DHAVE_CONFIG_H -I. -I../.. -g -Wall -W -Werror -Isrc -I/usr/include/glib-2.0 -I/usr/lib/glib-2.0/include -MT libthrift_c_glib_la-thrift_simple_server.lo -MD -MP -MF .deps/libthrift_c_glib_la-thrift_simple_server.Tpo -c src/server/thrift_simple_server.c  -fPIC -DPIC -o .libs/libthrift_c_glib_la-thrift_simple_server.o
libtool: compile:  gcc -DHAVE_CONFIG_H -I. -I../.. -g -Wall -W -Werror -Isrc -I/usr/include/glib-2.0 -I/usr/lib/glib-2.0/include -MT libthrift_c_glib_la-thrift_simple_server.lo -MD -MP -MF .deps/libthrift_c_glib_la-thrift_simple_server.Tpo -c src/server/thrift_simple_server.c -o libthrift_c_glib_la-thrift_simple_server.o >/dev/null 2>&1
mv -f .deps/libthrift_c_glib_la-thrift_simple_server.Tpo .deps/libthrift_c_glib_la-thrift_simple_server.Plo
/bin/bash ../../libtool --tag=CC   --mode=link gcc -g -Wall -W -Werror -Isrc -I/usr/include/glib-2.0 -I/usr/lib/glib-2.0/include      -o libthrift_c_glib.la -rpath /usr/local/lib libthrift_c_glib_la-thrift.lo libthrift_c_glib_la-thrift_struct.lo libthrift_c_glib_la-thrift_application_exception.lo libthrift_c_glib_la-thrift_processor.lo libthrift_c_glib_la-thrift_protocol.lo libthrift_c_glib_la-thrift_protocol_factory.lo libthrift_c_glib_la-thrift_binary_protocol.lo libthrift_c_glib_la-thrift_binary_protocol_factory.lo libthrift_c_glib_la-thrift_transport.lo libthrift_c_glib_la-thrift_transport_factory.lo libthrift_c_glib_la-thrift_socket.lo libthrift_c_glib_la-thrift_server_transport.lo libthrift_c_glib_la-thrift_server_socket.lo libthrift_c_glib_la-thrift_buffered_transport.lo libthrift_c_glib_la-thrift_framed_transport.lo libthrift_c_glib_la-thrift_memory_buffer.lo libthrift_c_glib_la-thrift_server.lo libthrift_c_glib_la-thrift_simple_server.lo  -lssl -lrt -lpthread 
libtool: link: gcc -shared  .libs/libthrift_c_glib_la-thrift.o .libs/libthrift_c_glib_la-thrift_struct.o .libs/libthrift_c_glib_la-thrift_application_exception.o .libs/libthrift_c_glib_la-thrift_processor.o .libs/libthrift_c_glib_la-thrift_protocol.o .libs/libthrift_c_glib_la-thrift_protocol_factory.o .libs/libthrift_c_glib_la-thrift_binary_protocol.o .libs/libthrift_c_glib_la-thrift_binary_protocol_factory.o .libs/libthrift_c_glib_la-thrift_transport.o .libs/libthrift_c_glib_la-thrift_transport_factory.o .libs/libthrift_c_glib_la-thrift_socket.o .libs/libthrift_c_glib_la-thrift_server_transport.o .libs/libthrift_c_glib_la-thrift_server_socket.o .libs/libthrift_c_glib_la-thrift_buffered_transport.o .libs/libthrift_c_glib_la-thrift_framed_transport.o .libs/libthrift_c_glib_la-thrift_memory_buffer.o .libs/libthrift_c_glib_la-thrift_server.o .libs/libthrift_c_glib_la-thrift_simple_server.o   -lssl -lrt -lpthread    -Wl,-soname -Wl,libthrift_c_glib.so.0 -o .libs/libthrift_c_glib.so.0.0.0
libtool: link: (cd ".libs" && rm -f "libthrift_c_glib.so.0" && ln -s "libthrift_c_glib.so.0.0.0" "libthrift_c_glib.so.0")
libtool: link: (cd ".libs" && rm -f "libthrift_c_glib.so" && ln -s "libthrift_c_glib.so.0.0.0" "libthrift_c_glib.so")
libtool: link: ar cru .libs/libthrift_c_glib.a  libthrift_c_glib_la-thrift.o libthrift_c_glib_la-thrift_struct.o libthrift_c_glib_la-thrift_application_exception.o libthrift_c_glib_la-thrift_processor.o libthrift_c_glib_la-thrift_protocol.o libthrift_c_glib_la-thrift_protocol_factory.o libthrift_c_glib_la-thrift_binary_protocol.o libthrift_c_glib_la-thrift_binary_protocol_factory.o libthrift_c_glib_la-thrift_transport.o libthrift_c_glib_la-thrift_transport_factory.o libthrift_c_glib_la-thrift_socket.o libthrift_c_glib_la-thrift_server_transport.o libthrift_c_glib_la-thrift_server_socket.o libthrift_c_glib_la-thrift_buffered_transport.o libthrift_c_glib_la-thrift_framed_transport.o libthrift_c_glib_la-thrift_memory_buffer.o libthrift_c_glib_la-thrift_server.o libthrift_c_glib_la-thrift_simple_server.o
libtool: link: ranlib .libs/libthrift_c_glib.a
libtool: link: ( cd ".libs" && rm -f "libthrift_c_glib.la" && ln -s "../libthrift_c_glib.la" "libthrift_c_glib.la" )
make[4]: Leaving directory `<https://builds.apache.org/job/Thrift/ws/thrift/lib/c_glib'>
Making all in test
make[4]: Entering directory `<https://builds.apache.org/job/Thrift/ws/thrift/lib/c_glib/test'>
make[5]: Entering directory `<https://builds.apache.org/job/Thrift/ws/thrift/lib/c_glib/test'>
make[5]: Nothing to be done for `all-am'.
make[5]: Leaving directory `<https://builds.apache.org/job/Thrift/ws/thrift/lib/c_glib/test'>
make[4]: Leaving directory `<https://builds.apache.org/job/Thrift/ws/thrift/lib/c_glib/test'>
make[3]: Leaving directory `<https://builds.apache.org/job/Thrift/ws/thrift/lib/c_glib'>
Making all in csharp
make[3]: Entering directory `<https://builds.apache.org/job/Thrift/ws/thrift/lib/csharp'>
gmcs src/Collections/THashSet.cs src/Protocol/TBase.cs src/Protocol/TBase64Utils.cs src/Protocol/TJSONProtocol.cs src/Protocol/TProtocolException.cs src/Protocol/TProtocolFactory.cs src/Protocol/TList.cs src/Protocol/TSet.cs src/Protocol/TMap.cs src/Protocol/TProtocolUtil.cs src/Protocol/TMessageType.cs src/Protocol/TProtocol.cs src/Protocol/TType.cs src/Protocol/TField.cs src/Protocol/TMessage.cs src/Protocol/TStruct.cs src/Protocol/TBinaryProtocol.cs src/Server/TThreadedServer.cs src/Server/TThreadPoolServer.cs src/Server/TSimpleServer.cs src/Server/TServer.cs src/Transport/TBufferedTransport.cs src/Transport/TTransport.cs src/Transport/TSocket.cs src/Transport/TTransportException.cs src/Transport/TStreamTransport.cs src/Transport/TFramedTransport.cs src/Transport/TServerTransport.cs src/Transport/TServerSocket.cs src/Transport/TTransportFactory.cs src/Transport/THttpClient.cs src/Transport/THttpHandler.cs src/TProcessor.cs src/TApplicationException.cs /out:Thrift.dll /target:library /reference:System.Web 
src/Protocol/TBinaryProtocol.cs(345,46): warning CS0675: The operator `|' used on the sign-extended type `int'. Consider casting to a smaller unsigned type first
Compilation succeeded - 1 warning(s)
make[3]: Leaving directory `<https://builds.apache.org/job/Thrift/ws/thrift/lib/csharp'>
Making all in java
make[3]: Entering directory `<https://builds.apache.org/job/Thrift/ws/thrift/lib/java'>
/usr/bin/ant 
Buildfile: <https://builds.apache.org/job/Thrift/ws/thrift/lib/java/build.xml>

setup.init:
    [mkdir] Created dir: <https://builds.apache.org/job/Thrift/ws/thrift/lib/java/build>
    [mkdir] Created dir: <https://builds.apache.org/job/Thrift/ws/thrift/lib/java/build/lib>
    [mkdir] Created dir: <https://builds.apache.org/job/Thrift/ws/thrift/lib/java/build/tools>
    [mkdir] Created dir: <https://builds.apache.org/job/Thrift/ws/thrift/lib/java/build/test>

mvn.ant.tasks.check:

mvn.ant.tasks.download:
      [get] Getting: http://repo1.maven.org/maven2/org/apache/maven/maven-ant-tasks/2.1.3/maven-ant-tasks-2.1.3.jar
      [get] To: <https://builds.apache.org/job/Thrift/ws/thrift/lib/java/build/tools/maven-ant-tasks-2.1.3.jar>

mvn.init:
[artifact:dependencies] [WARNING] Overriding profile: 'maven-ant-tasks-repo-profile' (source: pom) with new instance from source: pom
     [copy] Copying 7 files to <https://builds.apache.org/job/Thrift/ws/thrift/lib/java/build/lib>
     [copy] Copying 3 files to <https://builds.apache.org/job/Thrift/ws/thrift/lib/java/build/lib>

init:

compile:
    [javac] Compiling 82 source files to <https://builds.apache.org/job/Thrift/ws/thrift/lib/java/build>
    [javac] Note: Some input files use unchecked or unsafe operations.
    [javac] Note: Recompile with -Xlint:unchecked for details.

dist:
    [mkdir] Created dir: <https://builds.apache.org/job/Thrift/ws/thrift/lib/java/build/META-INF>
     [copy] Copying 1 file to <https://builds.apache.org/job/Thrift/ws/thrift/lib/java/build/META-INF>
     [copy] Copying 1 file to <https://builds.apache.org/job/Thrift/ws/thrift/lib/java/build/META-INF>
      [jar] Building jar: <https://builds.apache.org/job/Thrift/167/artifact/thrift/lib/java/build/libthrift-0.7.0-snapshot.jar>

BUILD SUCCESSFUL
Total time: 4 seconds
make[3]: Leaving directory `<https://builds.apache.org/job/Thrift/ws/thrift/lib/java'>
Making all in js/test
make[3]: Entering directory `<https://builds.apache.org/job/Thrift/ws/thrift/lib/js/test'>
make[3]: Nothing to be done for `all'.
make[3]: Leaving directory `<https://builds.apache.org/job/Thrift/ws/thrift/lib/js/test'>
Making all in py
make[3]: Entering directory `<https://builds.apache.org/job/Thrift/ws/thrift/lib/py'>
/usr/bin/python setup.py build
running build
running build_py
creating build
creating build/lib.linux-x86_64-2.6
creating build/lib.linux-x86_64-2.6/thrift
copying src/__init__.py -> build/lib.linux-x86_64-2.6/thrift
copying src/TSCons.py -> build/lib.linux-x86_64-2.6/thrift
copying src/Thrift.py -> build/lib.linux-x86_64-2.6/thrift
copying src/TSerialization.py -> build/lib.linux-x86_64-2.6/thrift
creating build/lib.linux-x86_64-2.6/thrift/protocol
copying src/protocol/TProtocol.py -> build/lib.linux-x86_64-2.6/thrift/protocol
copying src/protocol/__init__.py -> build/lib.linux-x86_64-2.6/thrift/protocol
copying src/protocol/TBinaryProtocol.py -> build/lib.linux-x86_64-2.6/thrift/protocol
copying src/protocol/TCompactProtocol.py -> build/lib.linux-x86_64-2.6/thrift/protocol
creating build/lib.linux-x86_64-2.6/thrift/transport
copying src/transport/TSSLSocket.py -> build/lib.linux-x86_64-2.6/thrift/transport
copying src/transport/TTransport.py -> build/lib.linux-x86_64-2.6/thrift/transport
copying src/transport/__init__.py -> build/lib.linux-x86_64-2.6/thrift/transport
copying src/transport/TZlibTransport.py -> build/lib.linux-x86_64-2.6/thrift/transport
copying src/transport/TTwisted.py -> build/lib.linux-x86_64-2.6/thrift/transport
copying src/transport/TSocket.py -> build/lib.linux-x86_64-2.6/thrift/transport
copying src/transport/THttpClient.py -> build/lib.linux-x86_64-2.6/thrift/transport
creating build/lib.linux-x86_64-2.6/thrift/server
copying src/server/__init__.py -> build/lib.linux-x86_64-2.6/thrift/server
copying src/server/THttpServer.py -> build/lib.linux-x86_64-2.6/thrift/server
copying src/server/TServer.py -> build/lib.linux-x86_64-2.6/thrift/server
copying src/server/TProcessPoolServer.py -> build/lib.linux-x86_64-2.6/thrift/server
copying src/server/TNonblockingServer.py -> build/lib.linux-x86_64-2.6/thrift/server
running build_ext
building 'thrift.protocol.fastbinary' extension
creating build/temp.linux-x86_64-2.6
creating build/temp.linux-x86_64-2.6/src
creating build/temp.linux-x86_64-2.6/src/protocol
gcc -pthread -fno-strict-aliasing -DNDEBUG -g -fwrapv -O2 -Wall -Wstrict-prototypes -fPIC -I/usr/include/python2.6 -c src/protocol/fastbinary.c -o build/temp.linux-x86_64-2.6/src/protocol/fastbinary.o
gcc -pthread -shared -Wl,-O1 -Wl,-Bsymbolic-functions build/temp.linux-x86_64-2.6/src/protocol/fastbinary.o -o build/lib.linux-x86_64-2.6/thrift/protocol/fastbinary.so
make[3]: Leaving directory `<https://builds.apache.org/job/Thrift/ws/thrift/lib/py'>
Making all in erl
make[3]: Entering directory `<https://builds.apache.org/job/Thrift/ws/thrift/lib/erl'>
Making all in src
make[4]: Entering directory `<https://builds.apache.org/job/Thrift/ws/thrift/lib/erl/src'>
mkdir ../ebin
   ERLC  thrift_protocol.erl
./thrift_protocol.erl:335: function error/2 undefined
make[4]: *** [../ebin/thrift_protocol.beam] Error 1
make[4]: Leaving directory `<https://builds.apache.org/job/Thrift/ws/thrift/lib/erl/src'>
make[3]: *** [all-recursive] Error 1
make[3]: Leaving directory `<https://builds.apache.org/job/Thrift/ws/thrift/lib/erl'>
make[2]: *** [all-recursive] Error 1
make[2]: Leaving directory `<https://builds.apache.org/job/Thrift/ws/thrift/lib'>
make[1]: *** [all-recursive] Error 1
make[1]: Leaving directory `<https://builds.apache.org/job/Thrift/ws/thrift'>
make: *** [all] Error 2
Archiving artifacts
Publishing Javadoc


Re: Build failed in Jenkins: Thrift #170

Posted by Anthony Molinaro <an...@alumni.caltech.edu>.
Bah, my bad, better fix checked in now, and once we have eunit on the
build server, I'll re-enable it.  How frequently does this run, seems
like it took a while between when I checked it in and when it broke.

-Anthony

On Wed, Jun 22, 2011 at 07:48:15AM +0000, Apache Jenkins Server wrote:
> See <https://builds.apache.org/job/Thrift/170/changes>
> 
> Changes:
> 
> [molinaro] turn off eunit for now, so build works on apache jenkins server
> 
> [roger] THRIFT-1214 JavaScript constructor does not accept object properties
> Patch: Henrique Mendonca
> 
> ------------------------------------------
> Started by an SCM change
> Building remotely on ubuntu1
> Updating https://svn.apache.org/repos/asf/thrift/trunk
> U         lib/erl/Makefile.am
> U         lib/js/thrift.js
> U         compiler/cpp/src/generate/t_js_generator.cc
> At revision 1138327
> [Thrift] $ /bin/bash -xe /tmp/hudson6174129658849121281.sh
> + cd thrift
> + sh bootstrap.sh
> Configuring for:
> PHP Api Version:         20090626
> Zend Module Api No:      20090626
> Zend Extension Api No:   220090626
> configure.ac:96: installing `./config.guess'
> configure.ac:96: installing `./config.sub'
> configure.ac:26: installing `./install-sh'
> configure.ac:26: installing `./missing'
> compiler/cpp/Makefile.am: installing `./depcomp'
> configure.ac: installing `./ylwrap'
> lib/erl/Makefile.am:36: `#' comment at start of rule is unportable
> lib/erl/Makefile.am:37: `#' comment at start of rule is unportable
> Archiving artifacts
> Publishing Javadoc
> 

-- 
------------------------------------------------------------------------
Anthony Molinaro                           <an...@alumni.caltech.edu>

Build failed in Jenkins: Thrift #170

Posted by Apache Jenkins Server <je...@builds.apache.org>.
See <https://builds.apache.org/job/Thrift/170/changes>

Changes:

[molinaro] turn off eunit for now, so build works on apache jenkins server

[roger] THRIFT-1214 JavaScript constructor does not accept object properties
Patch: Henrique Mendonca

------------------------------------------
Started by an SCM change
Building remotely on ubuntu1
Updating https://svn.apache.org/repos/asf/thrift/trunk
U         lib/erl/Makefile.am
U         lib/js/thrift.js
U         compiler/cpp/src/generate/t_js_generator.cc
At revision 1138327
[Thrift] $ /bin/bash -xe /tmp/hudson6174129658849121281.sh
+ cd thrift
+ sh bootstrap.sh
Configuring for:
PHP Api Version:         20090626
Zend Module Api No:      20090626
Zend Extension Api No:   220090626
configure.ac:96: installing `./config.guess'
configure.ac:96: installing `./config.sub'
configure.ac:26: installing `./install-sh'
configure.ac:26: installing `./missing'
compiler/cpp/Makefile.am: installing `./depcomp'
configure.ac: installing `./ylwrap'
lib/erl/Makefile.am:36: `#' comment at start of rule is unportable
lib/erl/Makefile.am:37: `#' comment at start of rule is unportable
Archiving artifacts
Publishing Javadoc


WG: Build failed in Jenkins: Thrift #169

Posted by Roger Meier <ro...@bufferoverflow.ch>.
I just committed the activation of eunit test cases!
For https://issues.apache.org/jira/browse/THRIFT-892

A special thanks to Anthony & Niklas!

-Roger


-----Ursprüngliche Nachricht-----
Von: Niklas Gustavsson [mailto:niklas@protocol7.com] 
Gesendet: Dienstag, 21. Juni 2011 22:37
An: builds@apache.org
Betreff: Re: Build failed in Jenkins: Thrift #169

On Tue, Jun 21, 2011 at 8:03 PM, Roger Meier <ro...@bufferoverflow.ch>
wrote:
> Could you please install the package erlang-eunit on the Jenkins 
> Ubuntu build slaves?

Done.

/niklas




Re: Build failed in Jenkins: Thrift #169

Posted by Niklas Gustavsson <ni...@protocol7.com>.
On Tue, Jun 21, 2011 at 8:03 PM, Roger Meier <ro...@bufferoverflow.ch> wrote:
> Could you please install the package erlang-eunit on the Jenkins Ubuntu
> build slaves?

Done.

/niklas

AW: Build failed in Jenkins: Thrift #169

Posted by Roger Meier <ro...@bufferoverflow.ch>.
Dear build server admins

Could you please install the package erlang-eunit on the Jenkins Ubuntu
build slaves?

Thank you!

-Roger


> -----Ursprüngliche Nachricht-----
> Von: Anthony Molinaro [mailto:anthonym@alumni.caltech.edu]
> Gesendet: Dienstag, 21. Juni 2011 19:08
> An: dev@thrift.apache.org
> Cc: roger@apache.org
> Betreff: Re: Build failed in Jenkins: Thrift #169
> 
> 
> Sigh, well, unfortunately looks like the jenkins server doesn't include
eunit, it
> must be running a very old version of erlang.  Anyway, I commented out the
> call to rebar eunit in the lib/erl/Makefile.am.  If you want to run the
unit tests
> you can just run ./rebar eunit in lib/erl.
> 
> Any idea how hard it would be to update erlang on the box running these
> tests?
> 
> -Anthony
> 
> On Tue, Jun 21, 2011 at 10:45:13AM +0000, Apache Jenkins Server wrote:
> > See <https://builds.apache.org/job/Thrift/169/changes>
> >
> > Changes:
> >
> > [molinaro] THRIFT-892 - refactor erlang library to build using rebar,
> > move tests into lib/erl/test directory and run several via make check
> >
> > [roger] THRIFT-1202 Malformed JSON for map<string,type> services
> > parameters fix broken build (add testcase to haskell test suite)
> >
> > ------------------------------------------
> > [...truncated 1872 lines...]
> >
> > setup.init:
> >
> > mvn.ant.tasks.check:
> >
> > mvn.ant.tasks.download:
> >       [get] Getting:
> http://repo1.maven.org/maven2/org/apache/maven/maven-ant-
> tasks/2.1.3/maven-ant-tasks-2.1.3.jar
> >       [get] To:
>
<https://builds.apache.org/job/Thrift/ws/thrift/lib/java/build/tools/maven-
> ant-tasks-2.1.3.jar>
> >       [get] Not modified - so not downloaded
> >
> > mvn.init:
> > [artifact:dependencies] [WARNING] Overriding profile:
> > 'maven-ant-tasks-repo-profile' (source: pom) with new instance from
> > source: pom
> >
> > init:
> >
> > compile:
> >
> > dist:
> >
> > BUILD SUCCESSFUL
> > Total time: 3 seconds
> > /usr/bin/ant  test
> > Buildfile:
> > <https://builds.apache.org/job/Thrift/ws/thrift/lib/java/build.xml>
> >
> > generate:
> >      [exec]
> [WARNING:<https://builds.apache.org/job/Thrift/ws/thrift/test/DebugProt
> oTest.thrift>:41] 64-bit constant "10000000000" may not work in all
> languages.
> >      [exec]
> >      [exec]
> [WARNING:<https://builds.apache.org/job/Thrift/ws/thrift/test/DebugProt
> oTest.thrift>:169] 64-bit constant "1099511627775" may not work in all
> languages.
> >      [exec]
> >      [exec]
> [WARNING:<https://builds.apache.org/job/Thrift/ws/thrift/test/DebugProt
> oTest.thrift>:179] 64-bit constant "4294967295" may not work in all
> languages.
> >      [exec]
> >      [exec]
> [WARNING:<https://builds.apache.org/job/Thrift/ws/thrift/test/DebugProt
> oTest.thrift>:179] 64-bit constant "1099511627775" may not work in all
> languages.
> >      [exec]
> >      [exec]
> [WARNING:<https://builds.apache.org/job/Thrift/ws/thrift/test/DebugProt
> oTest.thrift>:179] 64-bit constant "281474976710655" may not work in all
> languages.
> >      [exec]
> >      [exec]
> [WARNING:<https://builds.apache.org/job/Thrift/ws/thrift/test/DebugProt
> oTest.thrift>:179] 64-bit constant "72057594037927935" may not work in all
> languages.
> >      [exec]
> >      [exec]
> [WARNING:<https://builds.apache.org/job/Thrift/ws/thrift/test/DebugProt
> oTest.thrift>:179] 64-bit constant "9223372036854775807" may not work in
all
> languages.
> >      [exec]
> >      [exec]
> [WARNING:<https://builds.apache.org/job/Thrift/ws/thrift/test/DebugProt
> oTest.thrift>:188] 64-bit constant "4294967295" may not work in all
> languages.
> >      [exec]
> >      [exec]
> [WARNING:<https://builds.apache.org/job/Thrift/ws/thrift/test/DebugProt
> oTest.thrift>:188] 64-bit constant "1099511627775" may not work in all
> languages.
> >      [exec]
> >      [exec]
> [WARNING:<https://builds.apache.org/job/Thrift/ws/thrift/test/DebugProt
> oTest.thrift>:188] 64-bit constant "281474976710655" may not work in all
> languages.
> >      [exec]
> >      [exec]
> [WARNING:<https://builds.apache.org/job/Thrift/ws/thrift/test/DebugProt
> oTest.thrift>:188] 64-bit constant "72057594037927935" may not work in all
> languages.
> >      [exec]
> >      [exec]
> [WARNING:<https://builds.apache.org/job/Thrift/ws/thrift/test/DebugProt
> oTest.thrift>:188] 64-bit constant "9223372036854775807" may not work in
all
> languages.
> >      [exec]
> >      [exec]
> [WARNING:<https://builds.apache.org/job/Thrift/ws/thrift/test/DebugProt
> oTest.thrift>:197] 64-bit constant "9223372036854775807" may not work in
all
> languages.
> >      [exec]
> >      [exec]
> [WARNING:<https://builds.apache.org/job/Thrift/ws/thrift/test/DebugProt
> oTest.thrift>:204] 64-bit constant "9223372036854775807" may not work in
all
> languages.
> >      [exec]
> >      [exec]
> [WARNING:<https://builds.apache.org/job/Thrift/ws/thrift/test/DebugProt
> oTest.thrift>:41] 64-bit constant "10000000000" may not work in all
> languages.
> >      [exec]
> >      [exec]
> [WARNING:<https://builds.apache.org/job/Thrift/ws/thrift/test/DebugProt
> oTest.thrift>:169] 64-bit constant "1099511627775" may not work in all
> languages.
> >      [exec]
> >      [exec]
> [WARNING:<https://builds.apache.org/job/Thrift/ws/thrift/test/DebugProt
> oTest.thrift>:179] 64-bit constant "4294967295" may not work in all
> languages.
> >      [exec]
> >      [exec]
> [WARNING:<https://builds.apache.org/job/Thrift/ws/thrift/test/DebugProt
> oTest.thrift>:179] 64-bit constant "1099511627775" may not work in all
> languages.
> >      [exec]
> >      [exec]
> [WARNING:<https://builds.apache.org/job/Thrift/ws/thrift/test/DebugProt
> oTest.thrift>:179] 64-bit constant "281474976710655" may not work in all
> languages.
> >      [exec]
> >      [exec]
> [WARNING:<https://builds.apache.org/job/Thrift/ws/thrift/test/DebugProt
> oTest.thrift>:179] 64-bit constant "72057594037927935" may not work in all
> languages.
> >      [exec]
> >      [exec]
> [WARNING:<https://builds.apache.org/job/Thrift/ws/thrift/test/DebugProt
> oTest.thrift>:179] 64-bit constant "9223372036854775807" may not work in
all
> languages.
> >      [exec]
> >      [exec]
> [WARNING:<https://builds.apache.org/job/Thrift/ws/thrift/test/DebugProt
> oTest.thrift>:188] 64-bit constant "4294967295" may not work in all
> languages.
> >      [exec]
> >      [exec]
> [WARNING:<https://builds.apache.org/job/Thrift/ws/thrift/test/DebugProt
> oTest.thrift>:188] 64-bit constant "1099511627775" may not work in all
> languages.
> >      [exec]
> >      [exec]
> [WARNING:<https://builds.apache.org/job/Thrift/ws/thrift/test/DebugProt
> oTest.thrift>:188] 64-bit constant "281474976710655" may not work in all
> languages.
> >      [exec]
> >      [exec]
> [WARNING:<https://builds.apache.org/job/Thrift/ws/thrift/test/DebugProt
> oTest.thrift>:188] 64-bit constant "72057594037927935" may not work in all
> languages.
> >      [exec]
> >      [exec]
> [WARNING:<https://builds.apache.org/job/Thrift/ws/thrift/test/DebugProt
> oTest.thrift>:188] 64-bit constant "9223372036854775807" may not work in
all
> languages.
> >      [exec]
> >      [exec]
> [WARNING:<https://builds.apache.org/job/Thrift/ws/thrift/test/DebugProt
> oTest.thrift>:197] 64-bit constant "9223372036854775807" may not work in
all
> languages.
> >      [exec]
> >      [exec]
> [WARNING:<https://builds.apache.org/job/Thrift/ws/thrift/test/DebugProt
> oTest.thrift>:204] 64-bit constant "9223372036854775807" may not work in
all
> languages.
> >      [exec]
> >      [exec]
> [WARNING:<https://builds.apache.org/job/Thrift/ws/thrift/test/JavaBeansT
> est.thrift>:38] No field key specified for blah, resulting protocol may
have
> conflicts or not be backwards compatible!
> >      [exec]
> >      [exec]
> [WARNING:<https://builds.apache.org/job/Thrift/ws/thrift/test/JavaBeansT
> est.thrift>:38] No field key specified for blah, resulting protocol may
have
> conflicts or not be backwards compatible!
> >      [exec]
> >
> > setup.init:
> >
> > mvn.ant.tasks.check:
> >
> > mvn.ant.tasks.download:
> >       [get] Getting:
> http://repo1.maven.org/maven2/org/apache/maven/maven-ant-
> tasks/2.1.3/maven-ant-tasks-2.1.3.jar
> >       [get] To:
>
<https://builds.apache.org/job/Thrift/ws/thrift/lib/java/build/tools/maven-
> ant-tasks-2.1.3.jar>
> >       [get] Not modified - so not downloaded
> >
> > mvn.init:
> > [artifact:dependencies] [WARNING] Overriding profile:
> > 'maven-ant-tasks-repo-profile' (source: pom) with new instance from
> > source: pom
> >
> > init:
> >
> > compile:
> >
> > dist:
> >
> > compile-test:
> >     [javac] Compiling 57 source files to
> <https://builds.apache.org/job/Thrift/ws/thrift/lib/java/build/test>
> >     [javac] Note: Some input files use unchecked or unsafe operations.
> >     [javac] Note: Recompile with -Xlint:unchecked for details.
> >     [javac] Compiling 2 source files to
> <https://builds.apache.org/job/Thrift/ws/thrift/lib/java/build/test>
> >     [javac] Note: Some input files use unchecked or unsafe operations.
> >     [javac] Note: Recompile with -Xlint:unchecked for details.
> >     [javac] Compiling 36 source files to
> <https://builds.apache.org/job/Thrift/ws/thrift/lib/java/build/test>
> >     [javac] Note: Some input files use unchecked or unsafe operations.
> >     [javac] Note: Recompile with -Xlint:unchecked for details.
> >      [copy] Copying 1 file to
> <https://builds.apache.org/job/Thrift/ws/thrift/lib/java/build/test>
> >       [jar] Building jar:
> > <https://builds.apache.org/job/Thrift/169/artifact/thrift/lib/java/bui
> > ld/libthrift-0.7.0-snapshot-test.jar>
> >
> > junit-test:
> >     [mkdir] Created dir:
> <https://builds.apache.org/job/Thrift/ws/thrift/lib/java/build/test/log>
> >     [junit] Running org.apache.thrift.TestShortStack
> >     [junit] Tests run: 2, Failures: 0, Errors: 0, Time elapsed: 0.012
sec
> >     [junit] Running org.apache.thrift.TestStruct
> >     [junit] Tests run: 8, Failures: 0, Errors: 0, Time elapsed: 0.14 sec
> >     [junit] Running org.apache.thrift.TestTBaseHelper
> >     [junit] Tests run: 13, Failures: 0, Errors: 0, Time elapsed: 0.022
sec
> >     [junit] Running org.apache.thrift.TestTDeserializer
> >     [junit] Tests run: 1, Failures: 0, Errors: 0, Time elapsed: 0.13 sec
> >     [junit] Running org.apache.thrift.TestTEnumHelper
> >     [junit] Tests run: 3, Failures: 0, Errors: 0, Time elapsed: 0.014
sec
> >     [junit] Running org.apache.thrift.TestTUnion
> >     [junit] Tests run: 8, Failures: 0, Errors: 0, Time elapsed: 0.11 sec
> >     [junit] Running org.apache.thrift.async.TestTAsyncClient
> >     [junit] Tests run: 1, Failures: 0, Errors: 0, Time elapsed: 0.072
sec
> >     [junit] Running org.apache.thrift.async.TestTAsyncClientManager
> >     [junit] Tests run: 6, Failures: 0, Errors: 0, Time elapsed: 4.878
sec
> >     [junit] Running org.apache.thrift.protocol.TestTBinaryProtocol
> >     [junit] Tests run: 11, Failures: 0, Errors: 0, Time elapsed: 0.123
sec
> >     [junit] Running org.apache.thrift.protocol.TestTCompactProtocol
> >     [junit] Tests run: 11, Failures: 0, Errors: 0, Time elapsed: 0.123
sec
> >     [junit] Running org.apache.thrift.protocol.TestTJSONProtocol
> >     [junit] Tests run: 11, Failures: 0, Errors: 0, Time elapsed: 0.17
sec
> >     [junit] Running org.apache.thrift.protocol.TestTProtocolUtil
> >     [junit] Tests run: 4, Failures: 0, Errors: 0, Time elapsed: 0.074
sec
> >     [junit] Running org.apache.thrift.server.TestHsHaServer
> >     [junit] Tests run: 1, Failures: 0, Errors: 0, Time elapsed: 8.148
sec
> >     [junit] Running org.apache.thrift.transport.TestAutoExpandingBuffer
> >     [junit] Tests run: 1, Failures: 0, Errors: 0, Time elapsed: 0.013
sec
> >     [junit] Running
> org.apache.thrift.transport.TestAutoExpandingBufferReadTransport
> >     [junit] Tests run: 1, Failures: 0, Errors: 0, Time elapsed: 0.015
sec
> >     [junit] Running
> org.apache.thrift.transport.TestAutoExpandingBufferWriteTransport
> >     [junit] Tests run: 1, Failures: 0, Errors: 0, Time elapsed: 0.015
sec
> >     [junit] Running org.apache.thrift.transport.TestTFastFramedTransport
> >     [junit] Tests run: 3, Failures: 0, Errors: 0, Time elapsed: 0.063
sec
> >     [junit] Running org.apache.thrift.transport.TestTFramedTransport
> >     [junit] Tests run: 3, Failures: 0, Errors: 0, Time elapsed: 0.06 sec
> >     [junit] Running
org.apache.thrift.transport.TestTMemoryInputTransport
> >     [junit] Tests run: 3, Failures: 0, Errors: 0, Time elapsed: 0.014
sec
> >     [junit] Running org.apache.thrift.transport.TestTSSLTransportFactory
> >     [junit] Tests run: 1, Failures: 0, Errors: 0, Time elapsed: 4.203
sec
> >     [junit] Running org.apache.thrift.transport.TestTSaslTransports
> >     [junit] Tests run: 5, Failures: 0, Errors: 0, Time elapsed: 12.609
> > sec
> >
> > deprecated-test:
> >
> > test:
> >
> > BUILD SUCCESSFUL
> > Total time: 51 seconds
> > make[3]: Leaving directory
> > `<https://builds.apache.org/job/Thrift/ws/thrift/lib/java'>
> > make[2]: Leaving directory
> > `<https://builds.apache.org/job/Thrift/ws/thrift/lib/java'>
> > Making check in js/test
> > make[2]: Entering directory
> > `<https://builds.apache.org/job/Thrift/ws/thrift/lib/js/test'>
> > make  check-local
> > make[3]: Entering directory
> > `<https://builds.apache.org/job/Thrift/ws/thrift/lib/js/test'>
> > /usr/bin/ant  test
> > Buildfile:
> > <https://builds.apache.org/job/Thrift/ws/thrift/lib/js/test/build.xml>
> >
> > dependencies:
> >
> > init:
> >     [mkdir] Created dir:
> <https://builds.apache.org/job/Thrift/ws/thrift/lib/js/test/build>
> >     [mkdir] Created dir:
> > <https://builds.apache.org/job/Thrift/ws/thrift/lib/js/test/build/lib>
> >
> > generate:
> >
> > resolve:
> >      [copy] Copying 8 files to
> > <https://builds.apache.org/job/Thrift/ws/thrift/lib/js/test/build/lib>
> >
> > check-gjslint:
> >      [echo] check if gjslint is available:
> >      [exec] Execute failed: java.io.IOException: Cannot run program
> > "gjslint": java.io.IOException: error=2, No such file or directory
> >
> > gjslint:
> >
> > jslint:
> >
> > lint:
> >
> > test:
> >
> > BUILD SUCCESSFUL
> > Total time: 5 seconds
> > make[3]: Leaving directory
> > `<https://builds.apache.org/job/Thrift/ws/thrift/lib/js/test'>
> > make[2]: Leaving directory
> > `<https://builds.apache.org/job/Thrift/ws/thrift/lib/js/test'>
> > Making check in py
> > make[2]: Entering directory
> > `<https://builds.apache.org/job/Thrift/ws/thrift/lib/py'>
> > /usr/bin/python setup.py build
> > running build
> > running build_py
> > running build_ext
> > make  check-local
> > make[3]: Entering directory
> > `<https://builds.apache.org/job/Thrift/ws/thrift/lib/py'>
> > /usr/bin/python setup.py build
> > running build
> > running build_py
> > running build_ext
> > make[3]: Leaving directory
> > `<https://builds.apache.org/job/Thrift/ws/thrift/lib/py'>
> > make[2]: Leaving directory
> > `<https://builds.apache.org/job/Thrift/ws/thrift/lib/py'>
> > Making check in erl
> > make[2]: Entering directory
> > `<https://builds.apache.org/job/Thrift/ws/thrift/lib/erl'>
> > ./rebar eunit
> > ==> erl (eunit)
> > Compiled src/thrift_service.erl
> > Compiled src/thrift_transport.erl
> > Compiled src/thrift_protocol.erl
> > Compiled test/smallTest_types.erl
> > Compiled test/denseLinkingTest_types.erl Compiled
> > test/emptyService_thrift.erl Compiled test/service_thrift.erl Compiled
> > test/optionalRequiredTest_types.erl
> > Compiled test/javaBeansTest_types.erl
> > Compiled test/secondService_thrift.erl Compiled
> > test/manyTypedefs_types.erl Compiled test/annotationTest_types.erl
> > Compiled test/stress_server.erl Compiled test/test_server.erl Compiled
> > test/inherited_thrift.erl Compiled test/thriftTest_thrift.erl Compiled
> > test/srv_thrift.erl
> > test/test_thrift_1151.erl:6: can't find include lib
"eunit/include/eunit.hrl"
> > test/test_thrift_1151.erl:12: undefined macro 'assertException'
> > test/test_thrift_1151.erl:20: undefined macro 'assertException'
> > make[2]: *** [check] Error 1
> > make[2]: Leaving directory
> > `<https://builds.apache.org/job/Thrift/ws/thrift/lib/erl'>
> > make[1]: *** [check-recursive] Error 1
> > make[1]: Leaving directory
> > `<https://builds.apache.org/job/Thrift/ws/thrift/lib'>
> > make: *** [check-recursive] Error 1
> > Archiving artifacts
> > Publishing Javadoc
> >
> 
> --
> ------------------------------------------------------------------------
> Anthony Molinaro                           <an...@alumni.caltech.edu>
> 



AW: Build failed in Jenkins: Thrift #169

Posted by Roger Meier <ro...@bufferoverflow.ch>.
Dear build server admins

Could you please install the package erlang-eunit on the Jenkins Ubuntu
build slaves?

Thank you!

-Roger


> -----Ursprüngliche Nachricht-----
> Von: Anthony Molinaro [mailto:anthonym@alumni.caltech.edu]
> Gesendet: Dienstag, 21. Juni 2011 19:08
> An: dev@thrift.apache.org
> Cc: roger@apache.org
> Betreff: Re: Build failed in Jenkins: Thrift #169
> 
> 
> Sigh, well, unfortunately looks like the jenkins server doesn't include
eunit, it
> must be running a very old version of erlang.  Anyway, I commented out the
> call to rebar eunit in the lib/erl/Makefile.am.  If you want to run the
unit tests
> you can just run ./rebar eunit in lib/erl.
> 
> Any idea how hard it would be to update erlang on the box running these
> tests?
> 
> -Anthony
> 
> On Tue, Jun 21, 2011 at 10:45:13AM +0000, Apache Jenkins Server wrote:
> > See <https://builds.apache.org/job/Thrift/169/changes>
> >
> > Changes:
> >
> > [molinaro] THRIFT-892 - refactor erlang library to build using rebar,
> > move tests into lib/erl/test directory and run several via make check
> >
> > [roger] THRIFT-1202 Malformed JSON for map<string,type> services
> > parameters fix broken build (add testcase to haskell test suite)
> >
> > ------------------------------------------
> > [...truncated 1872 lines...]
> >
> > setup.init:
> >
> > mvn.ant.tasks.check:
> >
> > mvn.ant.tasks.download:
> >       [get] Getting:
> http://repo1.maven.org/maven2/org/apache/maven/maven-ant-
> tasks/2.1.3/maven-ant-tasks-2.1.3.jar
> >       [get] To:
>
<https://builds.apache.org/job/Thrift/ws/thrift/lib/java/build/tools/maven-
> ant-tasks-2.1.3.jar>
> >       [get] Not modified - so not downloaded
> >
> > mvn.init:
> > [artifact:dependencies] [WARNING] Overriding profile:
> > 'maven-ant-tasks-repo-profile' (source: pom) with new instance from
> > source: pom
> >
> > init:
> >
> > compile:
> >
> > dist:
> >
> > BUILD SUCCESSFUL
> > Total time: 3 seconds
> > /usr/bin/ant  test
> > Buildfile:
> > <https://builds.apache.org/job/Thrift/ws/thrift/lib/java/build.xml>
> >
> > generate:
> >      [exec]
> [WARNING:<https://builds.apache.org/job/Thrift/ws/thrift/test/DebugProt
> oTest.thrift>:41] 64-bit constant "10000000000" may not work in all
> languages.
> >      [exec]
> >      [exec]
> [WARNING:<https://builds.apache.org/job/Thrift/ws/thrift/test/DebugProt
> oTest.thrift>:169] 64-bit constant "1099511627775" may not work in all
> languages.
> >      [exec]
> >      [exec]
> [WARNING:<https://builds.apache.org/job/Thrift/ws/thrift/test/DebugProt
> oTest.thrift>:179] 64-bit constant "4294967295" may not work in all
> languages.
> >      [exec]
> >      [exec]
> [WARNING:<https://builds.apache.org/job/Thrift/ws/thrift/test/DebugProt
> oTest.thrift>:179] 64-bit constant "1099511627775" may not work in all
> languages.
> >      [exec]
> >      [exec]
> [WARNING:<https://builds.apache.org/job/Thrift/ws/thrift/test/DebugProt
> oTest.thrift>:179] 64-bit constant "281474976710655" may not work in all
> languages.
> >      [exec]
> >      [exec]
> [WARNING:<https://builds.apache.org/job/Thrift/ws/thrift/test/DebugProt
> oTest.thrift>:179] 64-bit constant "72057594037927935" may not work in all
> languages.
> >      [exec]
> >      [exec]
> [WARNING:<https://builds.apache.org/job/Thrift/ws/thrift/test/DebugProt
> oTest.thrift>:179] 64-bit constant "9223372036854775807" may not work in
all
> languages.
> >      [exec]
> >      [exec]
> [WARNING:<https://builds.apache.org/job/Thrift/ws/thrift/test/DebugProt
> oTest.thrift>:188] 64-bit constant "4294967295" may not work in all
> languages.
> >      [exec]
> >      [exec]
> [WARNING:<https://builds.apache.org/job/Thrift/ws/thrift/test/DebugProt
> oTest.thrift>:188] 64-bit constant "1099511627775" may not work in all
> languages.
> >      [exec]
> >      [exec]
> [WARNING:<https://builds.apache.org/job/Thrift/ws/thrift/test/DebugProt
> oTest.thrift>:188] 64-bit constant "281474976710655" may not work in all
> languages.
> >      [exec]
> >      [exec]
> [WARNING:<https://builds.apache.org/job/Thrift/ws/thrift/test/DebugProt
> oTest.thrift>:188] 64-bit constant "72057594037927935" may not work in all
> languages.
> >      [exec]
> >      [exec]
> [WARNING:<https://builds.apache.org/job/Thrift/ws/thrift/test/DebugProt
> oTest.thrift>:188] 64-bit constant "9223372036854775807" may not work in
all
> languages.
> >      [exec]
> >      [exec]
> [WARNING:<https://builds.apache.org/job/Thrift/ws/thrift/test/DebugProt
> oTest.thrift>:197] 64-bit constant "9223372036854775807" may not work in
all
> languages.
> >      [exec]
> >      [exec]
> [WARNING:<https://builds.apache.org/job/Thrift/ws/thrift/test/DebugProt
> oTest.thrift>:204] 64-bit constant "9223372036854775807" may not work in
all
> languages.
> >      [exec]
> >      [exec]
> [WARNING:<https://builds.apache.org/job/Thrift/ws/thrift/test/DebugProt
> oTest.thrift>:41] 64-bit constant "10000000000" may not work in all
> languages.
> >      [exec]
> >      [exec]
> [WARNING:<https://builds.apache.org/job/Thrift/ws/thrift/test/DebugProt
> oTest.thrift>:169] 64-bit constant "1099511627775" may not work in all
> languages.
> >      [exec]
> >      [exec]
> [WARNING:<https://builds.apache.org/job/Thrift/ws/thrift/test/DebugProt
> oTest.thrift>:179] 64-bit constant "4294967295" may not work in all
> languages.
> >      [exec]
> >      [exec]
> [WARNING:<https://builds.apache.org/job/Thrift/ws/thrift/test/DebugProt
> oTest.thrift>:179] 64-bit constant "1099511627775" may not work in all
> languages.
> >      [exec]
> >      [exec]
> [WARNING:<https://builds.apache.org/job/Thrift/ws/thrift/test/DebugProt
> oTest.thrift>:179] 64-bit constant "281474976710655" may not work in all
> languages.
> >      [exec]
> >      [exec]
> [WARNING:<https://builds.apache.org/job/Thrift/ws/thrift/test/DebugProt
> oTest.thrift>:179] 64-bit constant "72057594037927935" may not work in all
> languages.
> >      [exec]
> >      [exec]
> [WARNING:<https://builds.apache.org/job/Thrift/ws/thrift/test/DebugProt
> oTest.thrift>:179] 64-bit constant "9223372036854775807" may not work in
all
> languages.
> >      [exec]
> >      [exec]
> [WARNING:<https://builds.apache.org/job/Thrift/ws/thrift/test/DebugProt
> oTest.thrift>:188] 64-bit constant "4294967295" may not work in all
> languages.
> >      [exec]
> >      [exec]
> [WARNING:<https://builds.apache.org/job/Thrift/ws/thrift/test/DebugProt
> oTest.thrift>:188] 64-bit constant "1099511627775" may not work in all
> languages.
> >      [exec]
> >      [exec]
> [WARNING:<https://builds.apache.org/job/Thrift/ws/thrift/test/DebugProt
> oTest.thrift>:188] 64-bit constant "281474976710655" may not work in all
> languages.
> >      [exec]
> >      [exec]
> [WARNING:<https://builds.apache.org/job/Thrift/ws/thrift/test/DebugProt
> oTest.thrift>:188] 64-bit constant "72057594037927935" may not work in all
> languages.
> >      [exec]
> >      [exec]
> [WARNING:<https://builds.apache.org/job/Thrift/ws/thrift/test/DebugProt
> oTest.thrift>:188] 64-bit constant "9223372036854775807" may not work in
all
> languages.
> >      [exec]
> >      [exec]
> [WARNING:<https://builds.apache.org/job/Thrift/ws/thrift/test/DebugProt
> oTest.thrift>:197] 64-bit constant "9223372036854775807" may not work in
all
> languages.
> >      [exec]
> >      [exec]
> [WARNING:<https://builds.apache.org/job/Thrift/ws/thrift/test/DebugProt
> oTest.thrift>:204] 64-bit constant "9223372036854775807" may not work in
all
> languages.
> >      [exec]
> >      [exec]
> [WARNING:<https://builds.apache.org/job/Thrift/ws/thrift/test/JavaBeansT
> est.thrift>:38] No field key specified for blah, resulting protocol may
have
> conflicts or not be backwards compatible!
> >      [exec]
> >      [exec]
> [WARNING:<https://builds.apache.org/job/Thrift/ws/thrift/test/JavaBeansT
> est.thrift>:38] No field key specified for blah, resulting protocol may
have
> conflicts or not be backwards compatible!
> >      [exec]
> >
> > setup.init:
> >
> > mvn.ant.tasks.check:
> >
> > mvn.ant.tasks.download:
> >       [get] Getting:
> http://repo1.maven.org/maven2/org/apache/maven/maven-ant-
> tasks/2.1.3/maven-ant-tasks-2.1.3.jar
> >       [get] To:
>
<https://builds.apache.org/job/Thrift/ws/thrift/lib/java/build/tools/maven-
> ant-tasks-2.1.3.jar>
> >       [get] Not modified - so not downloaded
> >
> > mvn.init:
> > [artifact:dependencies] [WARNING] Overriding profile:
> > 'maven-ant-tasks-repo-profile' (source: pom) with new instance from
> > source: pom
> >
> > init:
> >
> > compile:
> >
> > dist:
> >
> > compile-test:
> >     [javac] Compiling 57 source files to
> <https://builds.apache.org/job/Thrift/ws/thrift/lib/java/build/test>
> >     [javac] Note: Some input files use unchecked or unsafe operations.
> >     [javac] Note: Recompile with -Xlint:unchecked for details.
> >     [javac] Compiling 2 source files to
> <https://builds.apache.org/job/Thrift/ws/thrift/lib/java/build/test>
> >     [javac] Note: Some input files use unchecked or unsafe operations.
> >     [javac] Note: Recompile with -Xlint:unchecked for details.
> >     [javac] Compiling 36 source files to
> <https://builds.apache.org/job/Thrift/ws/thrift/lib/java/build/test>
> >     [javac] Note: Some input files use unchecked or unsafe operations.
> >     [javac] Note: Recompile with -Xlint:unchecked for details.
> >      [copy] Copying 1 file to
> <https://builds.apache.org/job/Thrift/ws/thrift/lib/java/build/test>
> >       [jar] Building jar:
> > <https://builds.apache.org/job/Thrift/169/artifact/thrift/lib/java/bui
> > ld/libthrift-0.7.0-snapshot-test.jar>
> >
> > junit-test:
> >     [mkdir] Created dir:
> <https://builds.apache.org/job/Thrift/ws/thrift/lib/java/build/test/log>
> >     [junit] Running org.apache.thrift.TestShortStack
> >     [junit] Tests run: 2, Failures: 0, Errors: 0, Time elapsed: 0.012
sec
> >     [junit] Running org.apache.thrift.TestStruct
> >     [junit] Tests run: 8, Failures: 0, Errors: 0, Time elapsed: 0.14 sec
> >     [junit] Running org.apache.thrift.TestTBaseHelper
> >     [junit] Tests run: 13, Failures: 0, Errors: 0, Time elapsed: 0.022
sec
> >     [junit] Running org.apache.thrift.TestTDeserializer
> >     [junit] Tests run: 1, Failures: 0, Errors: 0, Time elapsed: 0.13 sec
> >     [junit] Running org.apache.thrift.TestTEnumHelper
> >     [junit] Tests run: 3, Failures: 0, Errors: 0, Time elapsed: 0.014
sec
> >     [junit] Running org.apache.thrift.TestTUnion
> >     [junit] Tests run: 8, Failures: 0, Errors: 0, Time elapsed: 0.11 sec
> >     [junit] Running org.apache.thrift.async.TestTAsyncClient
> >     [junit] Tests run: 1, Failures: 0, Errors: 0, Time elapsed: 0.072
sec
> >     [junit] Running org.apache.thrift.async.TestTAsyncClientManager
> >     [junit] Tests run: 6, Failures: 0, Errors: 0, Time elapsed: 4.878
sec
> >     [junit] Running org.apache.thrift.protocol.TestTBinaryProtocol
> >     [junit] Tests run: 11, Failures: 0, Errors: 0, Time elapsed: 0.123
sec
> >     [junit] Running org.apache.thrift.protocol.TestTCompactProtocol
> >     [junit] Tests run: 11, Failures: 0, Errors: 0, Time elapsed: 0.123
sec
> >     [junit] Running org.apache.thrift.protocol.TestTJSONProtocol
> >     [junit] Tests run: 11, Failures: 0, Errors: 0, Time elapsed: 0.17
sec
> >     [junit] Running org.apache.thrift.protocol.TestTProtocolUtil
> >     [junit] Tests run: 4, Failures: 0, Errors: 0, Time elapsed: 0.074
sec
> >     [junit] Running org.apache.thrift.server.TestHsHaServer
> >     [junit] Tests run: 1, Failures: 0, Errors: 0, Time elapsed: 8.148
sec
> >     [junit] Running org.apache.thrift.transport.TestAutoExpandingBuffer
> >     [junit] Tests run: 1, Failures: 0, Errors: 0, Time elapsed: 0.013
sec
> >     [junit] Running
> org.apache.thrift.transport.TestAutoExpandingBufferReadTransport
> >     [junit] Tests run: 1, Failures: 0, Errors: 0, Time elapsed: 0.015
sec
> >     [junit] Running
> org.apache.thrift.transport.TestAutoExpandingBufferWriteTransport
> >     [junit] Tests run: 1, Failures: 0, Errors: 0, Time elapsed: 0.015
sec
> >     [junit] Running org.apache.thrift.transport.TestTFastFramedTransport
> >     [junit] Tests run: 3, Failures: 0, Errors: 0, Time elapsed: 0.063
sec
> >     [junit] Running org.apache.thrift.transport.TestTFramedTransport
> >     [junit] Tests run: 3, Failures: 0, Errors: 0, Time elapsed: 0.06 sec
> >     [junit] Running
org.apache.thrift.transport.TestTMemoryInputTransport
> >     [junit] Tests run: 3, Failures: 0, Errors: 0, Time elapsed: 0.014
sec
> >     [junit] Running org.apache.thrift.transport.TestTSSLTransportFactory
> >     [junit] Tests run: 1, Failures: 0, Errors: 0, Time elapsed: 4.203
sec
> >     [junit] Running org.apache.thrift.transport.TestTSaslTransports
> >     [junit] Tests run: 5, Failures: 0, Errors: 0, Time elapsed: 12.609
> > sec
> >
> > deprecated-test:
> >
> > test:
> >
> > BUILD SUCCESSFUL
> > Total time: 51 seconds
> > make[3]: Leaving directory
> > `<https://builds.apache.org/job/Thrift/ws/thrift/lib/java'>
> > make[2]: Leaving directory
> > `<https://builds.apache.org/job/Thrift/ws/thrift/lib/java'>
> > Making check in js/test
> > make[2]: Entering directory
> > `<https://builds.apache.org/job/Thrift/ws/thrift/lib/js/test'>
> > make  check-local
> > make[3]: Entering directory
> > `<https://builds.apache.org/job/Thrift/ws/thrift/lib/js/test'>
> > /usr/bin/ant  test
> > Buildfile:
> > <https://builds.apache.org/job/Thrift/ws/thrift/lib/js/test/build.xml>
> >
> > dependencies:
> >
> > init:
> >     [mkdir] Created dir:
> <https://builds.apache.org/job/Thrift/ws/thrift/lib/js/test/build>
> >     [mkdir] Created dir:
> > <https://builds.apache.org/job/Thrift/ws/thrift/lib/js/test/build/lib>
> >
> > generate:
> >
> > resolve:
> >      [copy] Copying 8 files to
> > <https://builds.apache.org/job/Thrift/ws/thrift/lib/js/test/build/lib>
> >
> > check-gjslint:
> >      [echo] check if gjslint is available:
> >      [exec] Execute failed: java.io.IOException: Cannot run program
> > "gjslint": java.io.IOException: error=2, No such file or directory
> >
> > gjslint:
> >
> > jslint:
> >
> > lint:
> >
> > test:
> >
> > BUILD SUCCESSFUL
> > Total time: 5 seconds
> > make[3]: Leaving directory
> > `<https://builds.apache.org/job/Thrift/ws/thrift/lib/js/test'>
> > make[2]: Leaving directory
> > `<https://builds.apache.org/job/Thrift/ws/thrift/lib/js/test'>
> > Making check in py
> > make[2]: Entering directory
> > `<https://builds.apache.org/job/Thrift/ws/thrift/lib/py'>
> > /usr/bin/python setup.py build
> > running build
> > running build_py
> > running build_ext
> > make  check-local
> > make[3]: Entering directory
> > `<https://builds.apache.org/job/Thrift/ws/thrift/lib/py'>
> > /usr/bin/python setup.py build
> > running build
> > running build_py
> > running build_ext
> > make[3]: Leaving directory
> > `<https://builds.apache.org/job/Thrift/ws/thrift/lib/py'>
> > make[2]: Leaving directory
> > `<https://builds.apache.org/job/Thrift/ws/thrift/lib/py'>
> > Making check in erl
> > make[2]: Entering directory
> > `<https://builds.apache.org/job/Thrift/ws/thrift/lib/erl'>
> > ./rebar eunit
> > ==> erl (eunit)
> > Compiled src/thrift_service.erl
> > Compiled src/thrift_transport.erl
> > Compiled src/thrift_protocol.erl
> > Compiled test/smallTest_types.erl
> > Compiled test/denseLinkingTest_types.erl Compiled
> > test/emptyService_thrift.erl Compiled test/service_thrift.erl Compiled
> > test/optionalRequiredTest_types.erl
> > Compiled test/javaBeansTest_types.erl
> > Compiled test/secondService_thrift.erl Compiled
> > test/manyTypedefs_types.erl Compiled test/annotationTest_types.erl
> > Compiled test/stress_server.erl Compiled test/test_server.erl Compiled
> > test/inherited_thrift.erl Compiled test/thriftTest_thrift.erl Compiled
> > test/srv_thrift.erl
> > test/test_thrift_1151.erl:6: can't find include lib
"eunit/include/eunit.hrl"
> > test/test_thrift_1151.erl:12: undefined macro 'assertException'
> > test/test_thrift_1151.erl:20: undefined macro 'assertException'
> > make[2]: *** [check] Error 1
> > make[2]: Leaving directory
> > `<https://builds.apache.org/job/Thrift/ws/thrift/lib/erl'>
> > make[1]: *** [check-recursive] Error 1
> > make[1]: Leaving directory
> > `<https://builds.apache.org/job/Thrift/ws/thrift/lib'>
> > make: *** [check-recursive] Error 1
> > Archiving artifacts
> > Publishing Javadoc
> >
> 
> --
> ------------------------------------------------------------------------
> Anthony Molinaro                           <an...@alumni.caltech.edu>
> 



Re: Build failed in Jenkins: Thrift #169

Posted by Anthony Molinaro <an...@alumni.caltech.edu>.
Sigh, well, unfortunately looks like the jenkins server doesn't include
eunit, it must be running a very old version of erlang.  Anyway, I commented
out the call to rebar eunit in the lib/erl/Makefile.am.  If you want to run
the unit tests you can just run ./rebar eunit in lib/erl.

Any idea how hard it would be to update erlang on the box running these tests?

-Anthony

On Tue, Jun 21, 2011 at 10:45:13AM +0000, Apache Jenkins Server wrote:
> See <https://builds.apache.org/job/Thrift/169/changes>
> 
> Changes:
> 
> [molinaro] THRIFT-892 - refactor erlang library to build using rebar, move tests into lib/erl/test directory and run several via make check
> 
> [roger] THRIFT-1202 Malformed JSON for map<string,type> services parameters
> fix broken build (add testcase to haskell test suite)
> 
> ------------------------------------------
> [...truncated 1872 lines...]
> 
> setup.init:
> 
> mvn.ant.tasks.check:
> 
> mvn.ant.tasks.download:
>       [get] Getting: http://repo1.maven.org/maven2/org/apache/maven/maven-ant-tasks/2.1.3/maven-ant-tasks-2.1.3.jar
>       [get] To: <https://builds.apache.org/job/Thrift/ws/thrift/lib/java/build/tools/maven-ant-tasks-2.1.3.jar>
>       [get] Not modified - so not downloaded
> 
> mvn.init:
> [artifact:dependencies] [WARNING] Overriding profile: 'maven-ant-tasks-repo-profile' (source: pom) with new instance from source: pom
> 
> init:
> 
> compile:
> 
> dist:
> 
> BUILD SUCCESSFUL
> Total time: 3 seconds
> /usr/bin/ant  test
> Buildfile: <https://builds.apache.org/job/Thrift/ws/thrift/lib/java/build.xml>
> 
> generate:
>      [exec] [WARNING:<https://builds.apache.org/job/Thrift/ws/thrift/test/DebugProtoTest.thrift>:41] 64-bit constant "10000000000" may not work in all languages.
>      [exec] 
>      [exec] [WARNING:<https://builds.apache.org/job/Thrift/ws/thrift/test/DebugProtoTest.thrift>:169] 64-bit constant "1099511627775" may not work in all languages.
>      [exec] 
>      [exec] [WARNING:<https://builds.apache.org/job/Thrift/ws/thrift/test/DebugProtoTest.thrift>:179] 64-bit constant "4294967295" may not work in all languages.
>      [exec] 
>      [exec] [WARNING:<https://builds.apache.org/job/Thrift/ws/thrift/test/DebugProtoTest.thrift>:179] 64-bit constant "1099511627775" may not work in all languages.
>      [exec] 
>      [exec] [WARNING:<https://builds.apache.org/job/Thrift/ws/thrift/test/DebugProtoTest.thrift>:179] 64-bit constant "281474976710655" may not work in all languages.
>      [exec] 
>      [exec] [WARNING:<https://builds.apache.org/job/Thrift/ws/thrift/test/DebugProtoTest.thrift>:179] 64-bit constant "72057594037927935" may not work in all languages.
>      [exec] 
>      [exec] [WARNING:<https://builds.apache.org/job/Thrift/ws/thrift/test/DebugProtoTest.thrift>:179] 64-bit constant "9223372036854775807" may not work in all languages.
>      [exec] 
>      [exec] [WARNING:<https://builds.apache.org/job/Thrift/ws/thrift/test/DebugProtoTest.thrift>:188] 64-bit constant "4294967295" may not work in all languages.
>      [exec] 
>      [exec] [WARNING:<https://builds.apache.org/job/Thrift/ws/thrift/test/DebugProtoTest.thrift>:188] 64-bit constant "1099511627775" may not work in all languages.
>      [exec] 
>      [exec] [WARNING:<https://builds.apache.org/job/Thrift/ws/thrift/test/DebugProtoTest.thrift>:188] 64-bit constant "281474976710655" may not work in all languages.
>      [exec] 
>      [exec] [WARNING:<https://builds.apache.org/job/Thrift/ws/thrift/test/DebugProtoTest.thrift>:188] 64-bit constant "72057594037927935" may not work in all languages.
>      [exec] 
>      [exec] [WARNING:<https://builds.apache.org/job/Thrift/ws/thrift/test/DebugProtoTest.thrift>:188] 64-bit constant "9223372036854775807" may not work in all languages.
>      [exec] 
>      [exec] [WARNING:<https://builds.apache.org/job/Thrift/ws/thrift/test/DebugProtoTest.thrift>:197] 64-bit constant "9223372036854775807" may not work in all languages.
>      [exec] 
>      [exec] [WARNING:<https://builds.apache.org/job/Thrift/ws/thrift/test/DebugProtoTest.thrift>:204] 64-bit constant "9223372036854775807" may not work in all languages.
>      [exec] 
>      [exec] [WARNING:<https://builds.apache.org/job/Thrift/ws/thrift/test/DebugProtoTest.thrift>:41] 64-bit constant "10000000000" may not work in all languages.
>      [exec] 
>      [exec] [WARNING:<https://builds.apache.org/job/Thrift/ws/thrift/test/DebugProtoTest.thrift>:169] 64-bit constant "1099511627775" may not work in all languages.
>      [exec] 
>      [exec] [WARNING:<https://builds.apache.org/job/Thrift/ws/thrift/test/DebugProtoTest.thrift>:179] 64-bit constant "4294967295" may not work in all languages.
>      [exec] 
>      [exec] [WARNING:<https://builds.apache.org/job/Thrift/ws/thrift/test/DebugProtoTest.thrift>:179] 64-bit constant "1099511627775" may not work in all languages.
>      [exec] 
>      [exec] [WARNING:<https://builds.apache.org/job/Thrift/ws/thrift/test/DebugProtoTest.thrift>:179] 64-bit constant "281474976710655" may not work in all languages.
>      [exec] 
>      [exec] [WARNING:<https://builds.apache.org/job/Thrift/ws/thrift/test/DebugProtoTest.thrift>:179] 64-bit constant "72057594037927935" may not work in all languages.
>      [exec] 
>      [exec] [WARNING:<https://builds.apache.org/job/Thrift/ws/thrift/test/DebugProtoTest.thrift>:179] 64-bit constant "9223372036854775807" may not work in all languages.
>      [exec] 
>      [exec] [WARNING:<https://builds.apache.org/job/Thrift/ws/thrift/test/DebugProtoTest.thrift>:188] 64-bit constant "4294967295" may not work in all languages.
>      [exec] 
>      [exec] [WARNING:<https://builds.apache.org/job/Thrift/ws/thrift/test/DebugProtoTest.thrift>:188] 64-bit constant "1099511627775" may not work in all languages.
>      [exec] 
>      [exec] [WARNING:<https://builds.apache.org/job/Thrift/ws/thrift/test/DebugProtoTest.thrift>:188] 64-bit constant "281474976710655" may not work in all languages.
>      [exec] 
>      [exec] [WARNING:<https://builds.apache.org/job/Thrift/ws/thrift/test/DebugProtoTest.thrift>:188] 64-bit constant "72057594037927935" may not work in all languages.
>      [exec] 
>      [exec] [WARNING:<https://builds.apache.org/job/Thrift/ws/thrift/test/DebugProtoTest.thrift>:188] 64-bit constant "9223372036854775807" may not work in all languages.
>      [exec] 
>      [exec] [WARNING:<https://builds.apache.org/job/Thrift/ws/thrift/test/DebugProtoTest.thrift>:197] 64-bit constant "9223372036854775807" may not work in all languages.
>      [exec] 
>      [exec] [WARNING:<https://builds.apache.org/job/Thrift/ws/thrift/test/DebugProtoTest.thrift>:204] 64-bit constant "9223372036854775807" may not work in all languages.
>      [exec] 
>      [exec] [WARNING:<https://builds.apache.org/job/Thrift/ws/thrift/test/JavaBeansTest.thrift>:38] No field key specified for blah, resulting protocol may have conflicts or not be backwards compatible!
>      [exec] 
>      [exec] [WARNING:<https://builds.apache.org/job/Thrift/ws/thrift/test/JavaBeansTest.thrift>:38] No field key specified for blah, resulting protocol may have conflicts or not be backwards compatible!
>      [exec] 
> 
> setup.init:
> 
> mvn.ant.tasks.check:
> 
> mvn.ant.tasks.download:
>       [get] Getting: http://repo1.maven.org/maven2/org/apache/maven/maven-ant-tasks/2.1.3/maven-ant-tasks-2.1.3.jar
>       [get] To: <https://builds.apache.org/job/Thrift/ws/thrift/lib/java/build/tools/maven-ant-tasks-2.1.3.jar>
>       [get] Not modified - so not downloaded
> 
> mvn.init:
> [artifact:dependencies] [WARNING] Overriding profile: 'maven-ant-tasks-repo-profile' (source: pom) with new instance from source: pom
> 
> init:
> 
> compile:
> 
> dist:
> 
> compile-test:
>     [javac] Compiling 57 source files to <https://builds.apache.org/job/Thrift/ws/thrift/lib/java/build/test>
>     [javac] Note: Some input files use unchecked or unsafe operations.
>     [javac] Note: Recompile with -Xlint:unchecked for details.
>     [javac] Compiling 2 source files to <https://builds.apache.org/job/Thrift/ws/thrift/lib/java/build/test>
>     [javac] Note: Some input files use unchecked or unsafe operations.
>     [javac] Note: Recompile with -Xlint:unchecked for details.
>     [javac] Compiling 36 source files to <https://builds.apache.org/job/Thrift/ws/thrift/lib/java/build/test>
>     [javac] Note: Some input files use unchecked or unsafe operations.
>     [javac] Note: Recompile with -Xlint:unchecked for details.
>      [copy] Copying 1 file to <https://builds.apache.org/job/Thrift/ws/thrift/lib/java/build/test>
>       [jar] Building jar: <https://builds.apache.org/job/Thrift/169/artifact/thrift/lib/java/build/libthrift-0.7.0-snapshot-test.jar>
> 
> junit-test:
>     [mkdir] Created dir: <https://builds.apache.org/job/Thrift/ws/thrift/lib/java/build/test/log>
>     [junit] Running org.apache.thrift.TestShortStack
>     [junit] Tests run: 2, Failures: 0, Errors: 0, Time elapsed: 0.012 sec
>     [junit] Running org.apache.thrift.TestStruct
>     [junit] Tests run: 8, Failures: 0, Errors: 0, Time elapsed: 0.14 sec
>     [junit] Running org.apache.thrift.TestTBaseHelper
>     [junit] Tests run: 13, Failures: 0, Errors: 0, Time elapsed: 0.022 sec
>     [junit] Running org.apache.thrift.TestTDeserializer
>     [junit] Tests run: 1, Failures: 0, Errors: 0, Time elapsed: 0.13 sec
>     [junit] Running org.apache.thrift.TestTEnumHelper
>     [junit] Tests run: 3, Failures: 0, Errors: 0, Time elapsed: 0.014 sec
>     [junit] Running org.apache.thrift.TestTUnion
>     [junit] Tests run: 8, Failures: 0, Errors: 0, Time elapsed: 0.11 sec
>     [junit] Running org.apache.thrift.async.TestTAsyncClient
>     [junit] Tests run: 1, Failures: 0, Errors: 0, Time elapsed: 0.072 sec
>     [junit] Running org.apache.thrift.async.TestTAsyncClientManager
>     [junit] Tests run: 6, Failures: 0, Errors: 0, Time elapsed: 4.878 sec
>     [junit] Running org.apache.thrift.protocol.TestTBinaryProtocol
>     [junit] Tests run: 11, Failures: 0, Errors: 0, Time elapsed: 0.123 sec
>     [junit] Running org.apache.thrift.protocol.TestTCompactProtocol
>     [junit] Tests run: 11, Failures: 0, Errors: 0, Time elapsed: 0.123 sec
>     [junit] Running org.apache.thrift.protocol.TestTJSONProtocol
>     [junit] Tests run: 11, Failures: 0, Errors: 0, Time elapsed: 0.17 sec
>     [junit] Running org.apache.thrift.protocol.TestTProtocolUtil
>     [junit] Tests run: 4, Failures: 0, Errors: 0, Time elapsed: 0.074 sec
>     [junit] Running org.apache.thrift.server.TestHsHaServer
>     [junit] Tests run: 1, Failures: 0, Errors: 0, Time elapsed: 8.148 sec
>     [junit] Running org.apache.thrift.transport.TestAutoExpandingBuffer
>     [junit] Tests run: 1, Failures: 0, Errors: 0, Time elapsed: 0.013 sec
>     [junit] Running org.apache.thrift.transport.TestAutoExpandingBufferReadTransport
>     [junit] Tests run: 1, Failures: 0, Errors: 0, Time elapsed: 0.015 sec
>     [junit] Running org.apache.thrift.transport.TestAutoExpandingBufferWriteTransport
>     [junit] Tests run: 1, Failures: 0, Errors: 0, Time elapsed: 0.015 sec
>     [junit] Running org.apache.thrift.transport.TestTFastFramedTransport
>     [junit] Tests run: 3, Failures: 0, Errors: 0, Time elapsed: 0.063 sec
>     [junit] Running org.apache.thrift.transport.TestTFramedTransport
>     [junit] Tests run: 3, Failures: 0, Errors: 0, Time elapsed: 0.06 sec
>     [junit] Running org.apache.thrift.transport.TestTMemoryInputTransport
>     [junit] Tests run: 3, Failures: 0, Errors: 0, Time elapsed: 0.014 sec
>     [junit] Running org.apache.thrift.transport.TestTSSLTransportFactory
>     [junit] Tests run: 1, Failures: 0, Errors: 0, Time elapsed: 4.203 sec
>     [junit] Running org.apache.thrift.transport.TestTSaslTransports
>     [junit] Tests run: 5, Failures: 0, Errors: 0, Time elapsed: 12.609 sec
> 
> deprecated-test:
> 
> test:
> 
> BUILD SUCCESSFUL
> Total time: 51 seconds
> make[3]: Leaving directory `<https://builds.apache.org/job/Thrift/ws/thrift/lib/java'>
> make[2]: Leaving directory `<https://builds.apache.org/job/Thrift/ws/thrift/lib/java'>
> Making check in js/test
> make[2]: Entering directory `<https://builds.apache.org/job/Thrift/ws/thrift/lib/js/test'>
> make  check-local
> make[3]: Entering directory `<https://builds.apache.org/job/Thrift/ws/thrift/lib/js/test'>
> /usr/bin/ant  test
> Buildfile: <https://builds.apache.org/job/Thrift/ws/thrift/lib/js/test/build.xml>
> 
> dependencies:
> 
> init:
>     [mkdir] Created dir: <https://builds.apache.org/job/Thrift/ws/thrift/lib/js/test/build>
>     [mkdir] Created dir: <https://builds.apache.org/job/Thrift/ws/thrift/lib/js/test/build/lib>
> 
> generate:
> 
> resolve:
>      [copy] Copying 8 files to <https://builds.apache.org/job/Thrift/ws/thrift/lib/js/test/build/lib>
> 
> check-gjslint:
>      [echo] check if gjslint is available:
>      [exec] Execute failed: java.io.IOException: Cannot run program "gjslint": java.io.IOException: error=2, No such file or directory
> 
> gjslint:
> 
> jslint:
> 
> lint:
> 
> test:
> 
> BUILD SUCCESSFUL
> Total time: 5 seconds
> make[3]: Leaving directory `<https://builds.apache.org/job/Thrift/ws/thrift/lib/js/test'>
> make[2]: Leaving directory `<https://builds.apache.org/job/Thrift/ws/thrift/lib/js/test'>
> Making check in py
> make[2]: Entering directory `<https://builds.apache.org/job/Thrift/ws/thrift/lib/py'>
> /usr/bin/python setup.py build
> running build
> running build_py
> running build_ext
> make  check-local
> make[3]: Entering directory `<https://builds.apache.org/job/Thrift/ws/thrift/lib/py'>
> /usr/bin/python setup.py build
> running build
> running build_py
> running build_ext
> make[3]: Leaving directory `<https://builds.apache.org/job/Thrift/ws/thrift/lib/py'>
> make[2]: Leaving directory `<https://builds.apache.org/job/Thrift/ws/thrift/lib/py'>
> Making check in erl
> make[2]: Entering directory `<https://builds.apache.org/job/Thrift/ws/thrift/lib/erl'>
> ./rebar eunit
> ==> erl (eunit)
> Compiled src/thrift_service.erl
> Compiled src/thrift_transport.erl
> Compiled src/thrift_protocol.erl
> Compiled test/smallTest_types.erl
> Compiled test/denseLinkingTest_types.erl
> Compiled test/emptyService_thrift.erl
> Compiled test/service_thrift.erl
> Compiled test/optionalRequiredTest_types.erl
> Compiled test/javaBeansTest_types.erl
> Compiled test/secondService_thrift.erl
> Compiled test/manyTypedefs_types.erl
> Compiled test/annotationTest_types.erl
> Compiled test/stress_server.erl
> Compiled test/test_server.erl
> Compiled test/inherited_thrift.erl
> Compiled test/thriftTest_thrift.erl
> Compiled test/srv_thrift.erl
> test/test_thrift_1151.erl:6: can't find include lib "eunit/include/eunit.hrl"
> test/test_thrift_1151.erl:12: undefined macro 'assertException'
> test/test_thrift_1151.erl:20: undefined macro 'assertException'
> make[2]: *** [check] Error 1
> make[2]: Leaving directory `<https://builds.apache.org/job/Thrift/ws/thrift/lib/erl'>
> make[1]: *** [check-recursive] Error 1
> make[1]: Leaving directory `<https://builds.apache.org/job/Thrift/ws/thrift/lib'>
> make: *** [check-recursive] Error 1
> Archiving artifacts
> Publishing Javadoc
> 

-- 
------------------------------------------------------------------------
Anthony Molinaro                           <an...@alumni.caltech.edu>

Build failed in Jenkins: Thrift #169

Posted by Apache Jenkins Server <je...@builds.apache.org>.
See <https://builds.apache.org/job/Thrift/169/changes>

Changes:

[molinaro] THRIFT-892 - refactor erlang library to build using rebar, move tests into lib/erl/test directory and run several via make check

[roger] THRIFT-1202 Malformed JSON for map<string,type> services parameters
fix broken build (add testcase to haskell test suite)

------------------------------------------
[...truncated 1872 lines...]

setup.init:

mvn.ant.tasks.check:

mvn.ant.tasks.download:
      [get] Getting: http://repo1.maven.org/maven2/org/apache/maven/maven-ant-tasks/2.1.3/maven-ant-tasks-2.1.3.jar
      [get] To: <https://builds.apache.org/job/Thrift/ws/thrift/lib/java/build/tools/maven-ant-tasks-2.1.3.jar>
      [get] Not modified - so not downloaded

mvn.init:
[artifact:dependencies] [WARNING] Overriding profile: 'maven-ant-tasks-repo-profile' (source: pom) with new instance from source: pom

init:

compile:

dist:

BUILD SUCCESSFUL
Total time: 3 seconds
/usr/bin/ant  test
Buildfile: <https://builds.apache.org/job/Thrift/ws/thrift/lib/java/build.xml>

generate:
     [exec] [WARNING:<https://builds.apache.org/job/Thrift/ws/thrift/test/DebugProtoTest.thrift>:41] 64-bit constant "10000000000" may not work in all languages.
     [exec] 
     [exec] [WARNING:<https://builds.apache.org/job/Thrift/ws/thrift/test/DebugProtoTest.thrift>:169] 64-bit constant "1099511627775" may not work in all languages.
     [exec] 
     [exec] [WARNING:<https://builds.apache.org/job/Thrift/ws/thrift/test/DebugProtoTest.thrift>:179] 64-bit constant "4294967295" may not work in all languages.
     [exec] 
     [exec] [WARNING:<https://builds.apache.org/job/Thrift/ws/thrift/test/DebugProtoTest.thrift>:179] 64-bit constant "1099511627775" may not work in all languages.
     [exec] 
     [exec] [WARNING:<https://builds.apache.org/job/Thrift/ws/thrift/test/DebugProtoTest.thrift>:179] 64-bit constant "281474976710655" may not work in all languages.
     [exec] 
     [exec] [WARNING:<https://builds.apache.org/job/Thrift/ws/thrift/test/DebugProtoTest.thrift>:179] 64-bit constant "72057594037927935" may not work in all languages.
     [exec] 
     [exec] [WARNING:<https://builds.apache.org/job/Thrift/ws/thrift/test/DebugProtoTest.thrift>:179] 64-bit constant "9223372036854775807" may not work in all languages.
     [exec] 
     [exec] [WARNING:<https://builds.apache.org/job/Thrift/ws/thrift/test/DebugProtoTest.thrift>:188] 64-bit constant "4294967295" may not work in all languages.
     [exec] 
     [exec] [WARNING:<https://builds.apache.org/job/Thrift/ws/thrift/test/DebugProtoTest.thrift>:188] 64-bit constant "1099511627775" may not work in all languages.
     [exec] 
     [exec] [WARNING:<https://builds.apache.org/job/Thrift/ws/thrift/test/DebugProtoTest.thrift>:188] 64-bit constant "281474976710655" may not work in all languages.
     [exec] 
     [exec] [WARNING:<https://builds.apache.org/job/Thrift/ws/thrift/test/DebugProtoTest.thrift>:188] 64-bit constant "72057594037927935" may not work in all languages.
     [exec] 
     [exec] [WARNING:<https://builds.apache.org/job/Thrift/ws/thrift/test/DebugProtoTest.thrift>:188] 64-bit constant "9223372036854775807" may not work in all languages.
     [exec] 
     [exec] [WARNING:<https://builds.apache.org/job/Thrift/ws/thrift/test/DebugProtoTest.thrift>:197] 64-bit constant "9223372036854775807" may not work in all languages.
     [exec] 
     [exec] [WARNING:<https://builds.apache.org/job/Thrift/ws/thrift/test/DebugProtoTest.thrift>:204] 64-bit constant "9223372036854775807" may not work in all languages.
     [exec] 
     [exec] [WARNING:<https://builds.apache.org/job/Thrift/ws/thrift/test/DebugProtoTest.thrift>:41] 64-bit constant "10000000000" may not work in all languages.
     [exec] 
     [exec] [WARNING:<https://builds.apache.org/job/Thrift/ws/thrift/test/DebugProtoTest.thrift>:169] 64-bit constant "1099511627775" may not work in all languages.
     [exec] 
     [exec] [WARNING:<https://builds.apache.org/job/Thrift/ws/thrift/test/DebugProtoTest.thrift>:179] 64-bit constant "4294967295" may not work in all languages.
     [exec] 
     [exec] [WARNING:<https://builds.apache.org/job/Thrift/ws/thrift/test/DebugProtoTest.thrift>:179] 64-bit constant "1099511627775" may not work in all languages.
     [exec] 
     [exec] [WARNING:<https://builds.apache.org/job/Thrift/ws/thrift/test/DebugProtoTest.thrift>:179] 64-bit constant "281474976710655" may not work in all languages.
     [exec] 
     [exec] [WARNING:<https://builds.apache.org/job/Thrift/ws/thrift/test/DebugProtoTest.thrift>:179] 64-bit constant "72057594037927935" may not work in all languages.
     [exec] 
     [exec] [WARNING:<https://builds.apache.org/job/Thrift/ws/thrift/test/DebugProtoTest.thrift>:179] 64-bit constant "9223372036854775807" may not work in all languages.
     [exec] 
     [exec] [WARNING:<https://builds.apache.org/job/Thrift/ws/thrift/test/DebugProtoTest.thrift>:188] 64-bit constant "4294967295" may not work in all languages.
     [exec] 
     [exec] [WARNING:<https://builds.apache.org/job/Thrift/ws/thrift/test/DebugProtoTest.thrift>:188] 64-bit constant "1099511627775" may not work in all languages.
     [exec] 
     [exec] [WARNING:<https://builds.apache.org/job/Thrift/ws/thrift/test/DebugProtoTest.thrift>:188] 64-bit constant "281474976710655" may not work in all languages.
     [exec] 
     [exec] [WARNING:<https://builds.apache.org/job/Thrift/ws/thrift/test/DebugProtoTest.thrift>:188] 64-bit constant "72057594037927935" may not work in all languages.
     [exec] 
     [exec] [WARNING:<https://builds.apache.org/job/Thrift/ws/thrift/test/DebugProtoTest.thrift>:188] 64-bit constant "9223372036854775807" may not work in all languages.
     [exec] 
     [exec] [WARNING:<https://builds.apache.org/job/Thrift/ws/thrift/test/DebugProtoTest.thrift>:197] 64-bit constant "9223372036854775807" may not work in all languages.
     [exec] 
     [exec] [WARNING:<https://builds.apache.org/job/Thrift/ws/thrift/test/DebugProtoTest.thrift>:204] 64-bit constant "9223372036854775807" may not work in all languages.
     [exec] 
     [exec] [WARNING:<https://builds.apache.org/job/Thrift/ws/thrift/test/JavaBeansTest.thrift>:38] No field key specified for blah, resulting protocol may have conflicts or not be backwards compatible!
     [exec] 
     [exec] [WARNING:<https://builds.apache.org/job/Thrift/ws/thrift/test/JavaBeansTest.thrift>:38] No field key specified for blah, resulting protocol may have conflicts or not be backwards compatible!
     [exec] 

setup.init:

mvn.ant.tasks.check:

mvn.ant.tasks.download:
      [get] Getting: http://repo1.maven.org/maven2/org/apache/maven/maven-ant-tasks/2.1.3/maven-ant-tasks-2.1.3.jar
      [get] To: <https://builds.apache.org/job/Thrift/ws/thrift/lib/java/build/tools/maven-ant-tasks-2.1.3.jar>
      [get] Not modified - so not downloaded

mvn.init:
[artifact:dependencies] [WARNING] Overriding profile: 'maven-ant-tasks-repo-profile' (source: pom) with new instance from source: pom

init:

compile:

dist:

compile-test:
    [javac] Compiling 57 source files to <https://builds.apache.org/job/Thrift/ws/thrift/lib/java/build/test>
    [javac] Note: Some input files use unchecked or unsafe operations.
    [javac] Note: Recompile with -Xlint:unchecked for details.
    [javac] Compiling 2 source files to <https://builds.apache.org/job/Thrift/ws/thrift/lib/java/build/test>
    [javac] Note: Some input files use unchecked or unsafe operations.
    [javac] Note: Recompile with -Xlint:unchecked for details.
    [javac] Compiling 36 source files to <https://builds.apache.org/job/Thrift/ws/thrift/lib/java/build/test>
    [javac] Note: Some input files use unchecked or unsafe operations.
    [javac] Note: Recompile with -Xlint:unchecked for details.
     [copy] Copying 1 file to <https://builds.apache.org/job/Thrift/ws/thrift/lib/java/build/test>
      [jar] Building jar: <https://builds.apache.org/job/Thrift/169/artifact/thrift/lib/java/build/libthrift-0.7.0-snapshot-test.jar>

junit-test:
    [mkdir] Created dir: <https://builds.apache.org/job/Thrift/ws/thrift/lib/java/build/test/log>
    [junit] Running org.apache.thrift.TestShortStack
    [junit] Tests run: 2, Failures: 0, Errors: 0, Time elapsed: 0.012 sec
    [junit] Running org.apache.thrift.TestStruct
    [junit] Tests run: 8, Failures: 0, Errors: 0, Time elapsed: 0.14 sec
    [junit] Running org.apache.thrift.TestTBaseHelper
    [junit] Tests run: 13, Failures: 0, Errors: 0, Time elapsed: 0.022 sec
    [junit] Running org.apache.thrift.TestTDeserializer
    [junit] Tests run: 1, Failures: 0, Errors: 0, Time elapsed: 0.13 sec
    [junit] Running org.apache.thrift.TestTEnumHelper
    [junit] Tests run: 3, Failures: 0, Errors: 0, Time elapsed: 0.014 sec
    [junit] Running org.apache.thrift.TestTUnion
    [junit] Tests run: 8, Failures: 0, Errors: 0, Time elapsed: 0.11 sec
    [junit] Running org.apache.thrift.async.TestTAsyncClient
    [junit] Tests run: 1, Failures: 0, Errors: 0, Time elapsed: 0.072 sec
    [junit] Running org.apache.thrift.async.TestTAsyncClientManager
    [junit] Tests run: 6, Failures: 0, Errors: 0, Time elapsed: 4.878 sec
    [junit] Running org.apache.thrift.protocol.TestTBinaryProtocol
    [junit] Tests run: 11, Failures: 0, Errors: 0, Time elapsed: 0.123 sec
    [junit] Running org.apache.thrift.protocol.TestTCompactProtocol
    [junit] Tests run: 11, Failures: 0, Errors: 0, Time elapsed: 0.123 sec
    [junit] Running org.apache.thrift.protocol.TestTJSONProtocol
    [junit] Tests run: 11, Failures: 0, Errors: 0, Time elapsed: 0.17 sec
    [junit] Running org.apache.thrift.protocol.TestTProtocolUtil
    [junit] Tests run: 4, Failures: 0, Errors: 0, Time elapsed: 0.074 sec
    [junit] Running org.apache.thrift.server.TestHsHaServer
    [junit] Tests run: 1, Failures: 0, Errors: 0, Time elapsed: 8.148 sec
    [junit] Running org.apache.thrift.transport.TestAutoExpandingBuffer
    [junit] Tests run: 1, Failures: 0, Errors: 0, Time elapsed: 0.013 sec
    [junit] Running org.apache.thrift.transport.TestAutoExpandingBufferReadTransport
    [junit] Tests run: 1, Failures: 0, Errors: 0, Time elapsed: 0.015 sec
    [junit] Running org.apache.thrift.transport.TestAutoExpandingBufferWriteTransport
    [junit] Tests run: 1, Failures: 0, Errors: 0, Time elapsed: 0.015 sec
    [junit] Running org.apache.thrift.transport.TestTFastFramedTransport
    [junit] Tests run: 3, Failures: 0, Errors: 0, Time elapsed: 0.063 sec
    [junit] Running org.apache.thrift.transport.TestTFramedTransport
    [junit] Tests run: 3, Failures: 0, Errors: 0, Time elapsed: 0.06 sec
    [junit] Running org.apache.thrift.transport.TestTMemoryInputTransport
    [junit] Tests run: 3, Failures: 0, Errors: 0, Time elapsed: 0.014 sec
    [junit] Running org.apache.thrift.transport.TestTSSLTransportFactory
    [junit] Tests run: 1, Failures: 0, Errors: 0, Time elapsed: 4.203 sec
    [junit] Running org.apache.thrift.transport.TestTSaslTransports
    [junit] Tests run: 5, Failures: 0, Errors: 0, Time elapsed: 12.609 sec

deprecated-test:

test:

BUILD SUCCESSFUL
Total time: 51 seconds
make[3]: Leaving directory `<https://builds.apache.org/job/Thrift/ws/thrift/lib/java'>
make[2]: Leaving directory `<https://builds.apache.org/job/Thrift/ws/thrift/lib/java'>
Making check in js/test
make[2]: Entering directory `<https://builds.apache.org/job/Thrift/ws/thrift/lib/js/test'>
make  check-local
make[3]: Entering directory `<https://builds.apache.org/job/Thrift/ws/thrift/lib/js/test'>
/usr/bin/ant  test
Buildfile: <https://builds.apache.org/job/Thrift/ws/thrift/lib/js/test/build.xml>

dependencies:

init:
    [mkdir] Created dir: <https://builds.apache.org/job/Thrift/ws/thrift/lib/js/test/build>
    [mkdir] Created dir: <https://builds.apache.org/job/Thrift/ws/thrift/lib/js/test/build/lib>

generate:

resolve:
     [copy] Copying 8 files to <https://builds.apache.org/job/Thrift/ws/thrift/lib/js/test/build/lib>

check-gjslint:
     [echo] check if gjslint is available:
     [exec] Execute failed: java.io.IOException: Cannot run program "gjslint": java.io.IOException: error=2, No such file or directory

gjslint:

jslint:

lint:

test:

BUILD SUCCESSFUL
Total time: 5 seconds
make[3]: Leaving directory `<https://builds.apache.org/job/Thrift/ws/thrift/lib/js/test'>
make[2]: Leaving directory `<https://builds.apache.org/job/Thrift/ws/thrift/lib/js/test'>
Making check in py
make[2]: Entering directory `<https://builds.apache.org/job/Thrift/ws/thrift/lib/py'>
/usr/bin/python setup.py build
running build
running build_py
running build_ext
make  check-local
make[3]: Entering directory `<https://builds.apache.org/job/Thrift/ws/thrift/lib/py'>
/usr/bin/python setup.py build
running build
running build_py
running build_ext
make[3]: Leaving directory `<https://builds.apache.org/job/Thrift/ws/thrift/lib/py'>
make[2]: Leaving directory `<https://builds.apache.org/job/Thrift/ws/thrift/lib/py'>
Making check in erl
make[2]: Entering directory `<https://builds.apache.org/job/Thrift/ws/thrift/lib/erl'>
./rebar eunit
==> erl (eunit)
Compiled src/thrift_service.erl
Compiled src/thrift_transport.erl
Compiled src/thrift_protocol.erl
Compiled test/smallTest_types.erl
Compiled test/denseLinkingTest_types.erl
Compiled test/emptyService_thrift.erl
Compiled test/service_thrift.erl
Compiled test/optionalRequiredTest_types.erl
Compiled test/javaBeansTest_types.erl
Compiled test/secondService_thrift.erl
Compiled test/manyTypedefs_types.erl
Compiled test/annotationTest_types.erl
Compiled test/stress_server.erl
Compiled test/test_server.erl
Compiled test/inherited_thrift.erl
Compiled test/thriftTest_thrift.erl
Compiled test/srv_thrift.erl
test/test_thrift_1151.erl:6: can't find include lib "eunit/include/eunit.hrl"
test/test_thrift_1151.erl:12: undefined macro 'assertException'
test/test_thrift_1151.erl:20: undefined macro 'assertException'
make[2]: *** [check] Error 1
make[2]: Leaving directory `<https://builds.apache.org/job/Thrift/ws/thrift/lib/erl'>
make[1]: *** [check-recursive] Error 1
make[1]: Leaving directory `<https://builds.apache.org/job/Thrift/ws/thrift/lib'>
make: *** [check-recursive] Error 1
Archiving artifacts
Publishing Javadoc


Build failed in Jenkins: Thrift #168

Posted by Apache Jenkins Server <je...@builds.apache.org>.
See <https://builds.apache.org/job/Thrift/168/changes>

Changes:

[molinaro] THRIFT-1151 - support R13 as well as R14

[bryanduxbury] THRIFT-1211. java: When using THttpClient, non 200 responses leave the connection open

This patch reorders the code so that we can close the connection in the case of an error.

Patch: Mathias Herberts

------------------------------------------
[...truncated 5018 lines...]
ok
testList (__main__.CompactTest) ... localhost - - [20/Jun/2011 15:30:17] "POST / HTTP/1.0" 200 -
ok
testMap (__main__.CompactTest) ... localhost - - [20/Jun/2011 15:30:17] "POST / HTTP/1.0" 200 -
ok
testMapMap (__main__.CompactTest) ... ok
testMulti (__main__.CompactTest) ... localhost - - [20/Jun/2011 15:30:17] "POST / HTTP/1.0" 200 -
ok
testNest (__main__.CompactTest) ... localhost - - [20/Jun/2011 15:30:17] "POST / HTTP/1.0" 200 -
ok
testOneway (__main__.CompactTest) ... localhost - - [20/Jun/2011 15:30:18] "POST / HTTP/1.0" 200 -
ok
testOnewayThenNormal (__main__.CompactTest) ... localhost - - [20/Jun/2011 15:30:18] "POST / HTTP/1.0" 200 -
localhost - - [20/Jun/2011 15:30:18] "POST / HTTP/1.0" 200 -
ok
testSet (__main__.CompactTest) ... localhost - - [20/Jun/2011 15:30:18] "POST / HTTP/1.0" 200 -
ok
testString (__main__.CompactTest) ... localhost - - [20/Jun/2011 15:30:18] "POST / HTTP/1.0" 200 -
localhost - - [20/Jun/2011 15:30:18] "POST / HTTP/1.0" 200 -
ok
testStruct (__main__.CompactTest) ... localhost - - [20/Jun/2011 15:30:18] "POST / HTTP/1.0" 200 -
ok
testTypedef (__main__.CompactTest) ... localhost - - [20/Jun/2011 15:30:18] "POST / HTTP/1.0" 200 -
ok
testVoid (__main__.CompactTest) ... localhost - - [20/Jun/2011 15:30:18] "POST / HTTP/1.0" 200 -
ok

----------------------------------------------------------------------
Ran 18 tests in 0.695s

OK
ython ./TestServer.py --proto=compact --port=9090 TNonblockingServer
Testing client: /usr/bin/python ./TestClient.py --proto=compact --port=9090 --framed
OK: Finished  TNonblockingServer / compact proto / zlib=False / SSL=False.   63 combinations tested.

Test run #64:  Server=THttpServer,  Proto=accel,  zlib=False,  SSL=False
Testing server THttpServer: /usr/bin/python ./TestServer.py --proto=accel --port=9090 THttpServer
Testing client: /usr/bin/python ./TestClient.py --proto=accel --port=9090 --http=/
OK: Finished  THttpServer / accel proto / zlib=False / SSL=False.   64 combinations tested.

Test run #65:  Server=THttpServer,  Proto=binary,  zlib=False,  SSL=False
Testing server THttpServer: /usr/bin/python ./TestServer.py --proto=binary --port=9090 THttpServer
Testing client: /usr/bin/python ./TestClient.py --proto=binary --port=9090 --http=/
OK: Finished  THttpServer / binary proto / zlib=False / SSL=False.   65 combinations tested.

Test run #66:  Server=THttpServer,  Proto=compact,  zlib=False,  SSL=False
Testing server THttpServer: /usr/bin/python ./TestServer.py --proto=compact --port=9090 THttpServer
Testing client: /usr/bin/python ./TestClient.py --proto=compact --port=9090 --http=/
OK: Finished  THttpServer / compact proto / zlib=False / SSL=False.   66 combinations tested.
PASS: RunClientServer.py
==================
All 4 tests passed
==================
make[3]: Leaving directory `<https://builds.apache.org/job/Thrift/ws/thrift/test/py'>
make[2]: Leaving directory `<https://builds.apache.org/job/Thrift/ws/thrift/test/py'>
Making check in py.twisted
make[2]: Entering directory `<https://builds.apache.org/job/Thrift/ws/thrift/test/py.twisted'>
../../compiler/cpp/thrift --gen py:twisted ../ThriftTest.thrift
../../compiler/cpp/thrift --gen py:twisted ../SmallTest.thrift
/usr/bin/trial test_suite.py
test_suite
  ThriftTestCase
    testByte ...                                                           [OK]
    testDouble ...                                                         [OK]
    testException ...                                                      [OK]
    testI32 ...                                                            [OK]
    testI64 ...                                                            [OK]
    testOneway ...                                                         [OK]
    testString ...                                                         [OK]
    testStruct ...                                                         [OK]
    testVoid ...                                                           [OK]

-------------------------------------------------------------------------------
Ran 9 tests in 2.037s

PASSED (successes=9)
make[2]: Leaving directory `<https://builds.apache.org/job/Thrift/ws/thrift/test/py.twisted'>
Making check in rb
make[2]: Entering directory `<https://builds.apache.org/job/Thrift/ws/thrift/test/rb'>
../../compiler/cpp/thrift --gen rb ../ThriftTest.thrift
../../compiler/cpp/thrift --gen rb ../SmallTest.thrift
/usr/bin/ruby test_suite.rb
Loaded suite test_suite
Started
............
Finished in 0.001731 seconds.

12 tests, 25 assertions, 0 failures, 0 errors
make[2]: Leaving directory `<https://builds.apache.org/job/Thrift/ws/thrift/test/rb'>
Making check in hs
make[2]: Entering directory `<https://builds.apache.org/job/Thrift/ws/thrift/test/hs'>
../../compiler/cpp/thrift --gen hs ../ConstantsDemo.thrift
../../compiler/cpp/thrift --gen hs ../DebugProtoTest.thrift
[WARNING:<https://builds.apache.org/job/Thrift/ws/thrift/test/DebugProtoTest.thrift>:41] 64-bit constant "10000000000" may not work in all languages.

[WARNING:<https://builds.apache.org/job/Thrift/ws/thrift/test/DebugProtoTest.thrift>:169] 64-bit constant "1099511627775" may not work in all languages.

[WARNING:<https://builds.apache.org/job/Thrift/ws/thrift/test/DebugProtoTest.thrift>:179] 64-bit constant "4294967295" may not work in all languages.

[WARNING:<https://builds.apache.org/job/Thrift/ws/thrift/test/DebugProtoTest.thrift>:179] 64-bit constant "1099511627775" may not work in all languages.

[WARNING:<https://builds.apache.org/job/Thrift/ws/thrift/test/DebugProtoTest.thrift>:179] 64-bit constant "281474976710655" may not work in all languages.

[WARNING:<https://builds.apache.org/job/Thrift/ws/thrift/test/DebugProtoTest.thrift>:179] 64-bit constant "72057594037927935" may not work in all languages.

[WARNING:<https://builds.apache.org/job/Thrift/ws/thrift/test/DebugProtoTest.thrift>:179] 64-bit constant "9223372036854775807" may not work in all languages.

[WARNING:<https://builds.apache.org/job/Thrift/ws/thrift/test/DebugProtoTest.thrift>:188] 64-bit constant "4294967295" may not work in all languages.

[WARNING:<https://builds.apache.org/job/Thrift/ws/thrift/test/DebugProtoTest.thrift>:188] 64-bit constant "1099511627775" may not work in all languages.

[WARNING:<https://builds.apache.org/job/Thrift/ws/thrift/test/DebugProtoTest.thrift>:188] 64-bit constant "281474976710655" may not work in all languages.

[WARNING:<https://builds.apache.org/job/Thrift/ws/thrift/test/DebugProtoTest.thrift>:188] 64-bit constant "72057594037927935" may not work in all languages.

[WARNING:<https://builds.apache.org/job/Thrift/ws/thrift/test/DebugProtoTest.thrift>:188] 64-bit constant "9223372036854775807" may not work in all languages.

[WARNING:<https://builds.apache.org/job/Thrift/ws/thrift/test/DebugProtoTest.thrift>:197] 64-bit constant "9223372036854775807" may not work in all languages.

[WARNING:<https://builds.apache.org/job/Thrift/ws/thrift/test/DebugProtoTest.thrift>:204] 64-bit constant "9223372036854775807" may not work in all languages.

[WARNING:<https://builds.apache.org/job/Thrift/ws/thrift/test/DebugProtoTest.thrift>:41] 64-bit constant "10000000000" may not work in all languages.

[WARNING:<https://builds.apache.org/job/Thrift/ws/thrift/test/DebugProtoTest.thrift>:169] 64-bit constant "1099511627775" may not work in all languages.

[WARNING:<https://builds.apache.org/job/Thrift/ws/thrift/test/DebugProtoTest.thrift>:179] 64-bit constant "4294967295" may not work in all languages.

[WARNING:<https://builds.apache.org/job/Thrift/ws/thrift/test/DebugProtoTest.thrift>:179] 64-bit constant "1099511627775" may not work in all languages.

[WARNING:<https://builds.apache.org/job/Thrift/ws/thrift/test/DebugProtoTest.thrift>:179] 64-bit constant "281474976710655" may not work in all languages.

[WARNING:<https://builds.apache.org/job/Thrift/ws/thrift/test/DebugProtoTest.thrift>:179] 64-bit constant "72057594037927935" may not work in all languages.

[WARNING:<https://builds.apache.org/job/Thrift/ws/thrift/test/DebugProtoTest.thrift>:179] 64-bit constant "9223372036854775807" may not work in all languages.

[WARNING:<https://builds.apache.org/job/Thrift/ws/thrift/test/DebugProtoTest.thrift>:188] 64-bit constant "4294967295" may not work in all languages.

[WARNING:<https://builds.apache.org/job/Thrift/ws/thrift/test/DebugProtoTest.thrift>:188] 64-bit constant "1099511627775" may not work in all languages.

[WARNING:<https://builds.apache.org/job/Thrift/ws/thrift/test/DebugProtoTest.thrift>:188] 64-bit constant "281474976710655" may not work in all languages.

[WARNING:<https://builds.apache.org/job/Thrift/ws/thrift/test/DebugProtoTest.thrift>:188] 64-bit constant "72057594037927935" may not work in all languages.

[WARNING:<https://builds.apache.org/job/Thrift/ws/thrift/test/DebugProtoTest.thrift>:188] 64-bit constant "9223372036854775807" may not work in all languages.

[WARNING:<https://builds.apache.org/job/Thrift/ws/thrift/test/DebugProtoTest.thrift>:197] 64-bit constant "9223372036854775807" may not work in all languages.

[WARNING:<https://builds.apache.org/job/Thrift/ws/thrift/test/DebugProtoTest.thrift>:204] 64-bit constant "9223372036854775807" may not work in all languages.

../../compiler/cpp/thrift --gen hs ../ThriftTest.thrift
sh run-test.sh ConstantsDemo
Generating bindings... 
Running test... 
SERVER: Ready...
SERVER: SERVER: Got blingity
SERVER: SERVER: Got blangity
CLIENT: 31
SUCCESS
sh run-test.sh DebugProtoTest
Generating bindings... 
[WARNING:<https://builds.apache.org/job/Thrift/ws/thrift/test/DebugProtoTest.thrift>:41] 64-bit constant "10000000000" may not work in all languages.

[WARNING:<https://builds.apache.org/job/Thrift/ws/thrift/test/DebugProtoTest.thrift>:169] 64-bit constant "1099511627775" may not work in all languages.

[WARNING:<https://builds.apache.org/job/Thrift/ws/thrift/test/DebugProtoTest.thrift>:179] 64-bit constant "4294967295" may not work in all languages.

[WARNING:<https://builds.apache.org/job/Thrift/ws/thrift/test/DebugProtoTest.thrift>:179] 64-bit constant "1099511627775" may not work in all languages.

[WARNING:<https://builds.apache.org/job/Thrift/ws/thrift/test/DebugProtoTest.thrift>:179] 64-bit constant "281474976710655" may not work in all languages.

[WARNING:<https://builds.apache.org/job/Thrift/ws/thrift/test/DebugProtoTest.thrift>:179] 64-bit constant "72057594037927935" may not work in all languages.

[WARNING:<https://builds.apache.org/job/Thrift/ws/thrift/test/DebugProtoTest.thrift>:179] 64-bit constant "9223372036854775807" may not work in all languages.

[WARNING:<https://builds.apache.org/job/Thrift/ws/thrift/test/DebugProtoTest.thrift>:188] 64-bit constant "4294967295" may not work in all languages.

[WARNING:<https://builds.apache.org/job/Thrift/ws/thrift/test/DebugProtoTest.thrift>:188] 64-bit constant "1099511627775" may not work in all languages.

[WARNING:<https://builds.apache.org/job/Thrift/ws/thrift/test/DebugProtoTest.thrift>:188] 64-bit constant "281474976710655" may not work in all languages.

[WARNING:<https://builds.apache.org/job/Thrift/ws/thrift/test/DebugProtoTest.thrift>:188] 64-bit constant "72057594037927935" may not work in all languages.

[WARNING:<https://builds.apache.org/job/Thrift/ws/thrift/test/DebugProtoTest.thrift>:188] 64-bit constant "9223372036854775807" may not work in all languages.

[WARNING:<https://builds.apache.org/job/Thrift/ws/thrift/test/DebugProtoTest.thrift>:197] 64-bit constant "9223372036854775807" may not work in all languages.

[WARNING:<https://builds.apache.org/job/Thrift/ws/thrift/test/DebugProtoTest.thrift>:204] 64-bit constant "9223372036854775807" may not work in all languages.

[WARNING:<https://builds.apache.org/job/Thrift/ws/thrift/test/DebugProtoTest.thrift>:41] 64-bit constant "10000000000" may not work in all languages.

[WARNING:<https://builds.apache.org/job/Thrift/ws/thrift/test/DebugProtoTest.thrift>:169] 64-bit constant "1099511627775" may not work in all languages.

[WARNING:<https://builds.apache.org/job/Thrift/ws/thrift/test/DebugProtoTest.thrift>:179] 64-bit constant "4294967295" may not work in all languages.

[WARNING:<https://builds.apache.org/job/Thrift/ws/thrift/test/DebugProtoTest.thrift>:179] 64-bit constant "1099511627775" may not work in all languages.

[WARNING:<https://builds.apache.org/job/Thrift/ws/thrift/test/DebugProtoTest.thrift>:179] 64-bit constant "281474976710655" may not work in all languages.

[WARNING:<https://builds.apache.org/job/Thrift/ws/thrift/test/DebugProtoTest.thrift>:179] 64-bit constant "72057594037927935" may not work in all languages.

[WARNING:<https://builds.apache.org/job/Thrift/ws/thrift/test/DebugProtoTest.thrift>:179] 64-bit constant "9223372036854775807" may not work in all languages.

[WARNING:<https://builds.apache.org/job/Thrift/ws/thrift/test/DebugProtoTest.thrift>:188] 64-bit constant "4294967295" may not work in all languages.

[WARNING:<https://builds.apache.org/job/Thrift/ws/thrift/test/DebugProtoTest.thrift>:188] 64-bit constant "1099511627775" may not work in all languages.

[WARNING:<https://builds.apache.org/job/Thrift/ws/thrift/test/DebugProtoTest.thrift>:188] 64-bit constant "281474976710655" may not work in all languages.

[WARNING:<https://builds.apache.org/job/Thrift/ws/thrift/test/DebugProtoTest.thrift>:188] 64-bit constant "72057594037927935" may not work in all languages.

[WARNING:<https://builds.apache.org/job/Thrift/ws/thrift/test/DebugProtoTest.thrift>:188] 64-bit constant "9223372036854775807" may not work in all languages.

[WARNING:<https://builds.apache.org/job/Thrift/ws/thrift/test/DebugProtoTest.thrift>:197] 64-bit constant "9223372036854775807" may not work in all languages.

[WARNING:<https://builds.apache.org/job/Thrift/ws/thrift/test/DebugProtoTest.thrift>:204] 64-bit constant "9223372036854775807" may not work in all languages.

Running test... 
SERVER: Ready...
SERVER: Got janky method call: Just 42
CLIENT: 31
SERVER: Got voidMethod method call
SERVER: Got primitiveMethod call
CLIENT: 42
SERVER: Got structMethod call
CLIENT: CompactProtoTestStruct {f_CompactProtoTestStruct_a_byte = Just 1, f_CompactProtoTestStruct_a_i16 = Just 2, f_CompactProtoTestStruct_a_i32 = Just 3, f_CompactProtoTestStruct_a_i64 = Just 4, f_CompactProtoTestStruct_a_double = Just 0.1, f_CompactProtoTestStruct_a_string = Just "abcdef", f_CompactProtoTestStruct_a_binary = Just Empty, f_CompactProtoTestStruct_true_field = Just True, f_CompactProtoTestStruct_false_field = Just False, f_CompactProtoTestStruct_empty_struct_field = Just Empty, f_CompactProtoTestStruct_byte_list = Nothing, f_CompactProtoTestStruct_i16_list = Nothing, f_CompactProtoTestStruct_i32_list = Nothing, f_CompactProtoTestStruct_i64_list = Nothing, f_CompactProtoTestStruct_double_list = Nothing, f_CompactProtoTestStruct_string_list = Nothing, f_CompactProtoTestStruct_binary_list = Nothing, f_CompactProtoTestStruct_boolean_list = Nothing, f_CompactProtoTestStruct_struct_list = Just [Empty], f_CompactProtoTestStruct_byte_set = Nothing, f_CompactProtoTestStruct_i16_set = Nothing, f_CompactProtoTestStruct_i32_set = Nothing, f_CompactProtoTestStruct_i64_set = Nothing, f_CompactProtoTestStruct_double_set = Nothing, f_CompactProtoTestStruct_string_set = Nothing, f_CompactProtoTestStruct_binary_set = Nothing, f_CompactProtoTestStruct_boolean_set = Nothing, f_CompactProtoTestStruct_struct_set = Nothing, f_CompactProtoTestStruct_byte_byte_map = Nothing, f_CompactProtoTestStruct_i16_byte_map = Nothing, f_CompactProtoTestStruct_i32_byte_map = Nothing, f_CompactProtoTestStruct_i64_byte_map = Nothing, f_CompactProtoTestStruct_double_byte_map = Nothing, f_CompactProtoTestStruct_string_byte_map = Nothing, f_CompactProtoTestStruct_binary_byte_map = Nothing, f_CompactProtoTestStruct_boolean_byte_map = Nothing, f_CompactProtoTestStruct_byte_i16_map = Nothing, f_CompactProtoTestStruct_byte_i32_map = Nothing, f_CompactProtoTestStruct_byte_i64_map = Nothing, f_CompactProtoTestStruct_byte_double_map = Nothing, f_CompactProtoTestStruct_byte_string_map = Nothing, f_CompactProtoTestStruct_byte_binary_map = Nothing, f_CompactProtoTestStruct_byte_boolean_map = Nothing, f_CompactProtoTestStruct_list_byte_map = Nothing, f_CompactProtoTestStruct_set_byte_map = Nothing, f_CompactProtoTestStruct_map_byte_map = Nothing, f_CompactProtoTestStruct_byte_map_map = Nothing, f_CompactProtoTestStruct_byte_set_map = Nothing, f_CompactProtoTestStruct_byte_list_map = Nothing}
SERVER: Got methodWithDefaultArgs: Just 42
SERVER: Got onewayMethod
SERVER: Got identity method: Just 42
CLIENT: 42
SUCCESS
sh run-test.sh ThriftTest
Generating bindings... 
Running test... 

../../test/hs/ThriftTest_Main.hs:43:9:
    Warning: No explicit method nor default method for `Iface.testStringMap'
    In the instance declaration for `Iface.ThriftTest_Iface
                                       TestHandler'

<no location info>: 
Failing due to -Werror.

make[2]: *** [check] Error 1
make[2]: Leaving directory `<https://builds.apache.org/job/Thrift/ws/thrift/test/hs'>
make[1]: *** [check-recursive] Error 1
make[1]: Leaving directory `<https://builds.apache.org/job/Thrift/ws/thrift/test'>
make: *** [check-recursive] Error 1
Archiving artifacts
Publishing Javadoc