You are viewing a plain text version of this content. The canonical link for it is here.
Posted to builds@mesos.apache.org by Apache Jenkins Server <je...@builds.apache.org> on 2017/09/29 22:01:55 UTC

Build failed in Jenkins: Mesos-Reviewbot #19630

See <https://builds.apache.org/job/Mesos-Reviewbot/19630/display/redirect?page=changes>

Changes:

[anand] Added `MARK_AGENT_GONE` call to the v1 Master API.

[anand] Added the `REASON_AGENT_REMOVED_BY_OPERATOR` to the mesos protos.

[anand] Added the gone agents to the master registry.

[anand] Added `__removeSlave` function and made `_markUnreachable` use it.

[anand] Added the mark agent gone handler on the master.

[anand] Removed the logic for removing the latest symlink on the agent.

[anand] Added tests for the agent gone operation.

[anand] Fixed tests impacted by no longer removing the agent symlink.

[anand] Added documentation about 'MARK_AGENT_GONE' call.

[anand] Added authorization for 'MARK_AGENT_GONE' call.

[anand] Added the ability to prune the gone agent list from the registry.

------------------------------------------
[...truncated 31.85 MB...]
I0929 22:01:49.943583  5802 http.cpp:1045] Creating default 'basic' HTTP authenticator for realm 'mesos-agent-readonly'
I0929 22:01:49.943729  5802 http.cpp:1045] Creating default 'basic' HTTP authenticator for realm 'mesos-agent-readwrite'
I0929 22:01:49.945036  5802 slave.cpp:585] Agent resources: [{"name":"cpus","scalar":{"value":2.0},"type":"SCALAR"},{"name":"mem","scalar":{"value":1024.0},"type":"SCALAR"},{"name":"disk","scalar":{"value":1024.0},"type":"SCALAR"},{"name":"ports","ranges":{"range":[{"begin":31000,"end":32000}]},"type":"RANGES"}]
I0929 22:01:49.945263  5802 slave.cpp:593] Agent attributes: [  ]
I0929 22:01:49.945278  5802 slave.cpp:602] Agent hostname: a083840eb5fa
I0929 22:01:49.945433  5811 status_update_manager.cpp:177] Pausing sending status updates
I0929 22:01:49.946779  5792 state.cpp:64] Recovering state from '/tmp/Endpoint_SlaveEndpointTest_AuthorizedRequest_2_vnu2j9/meta'
I0929 22:01:49.947072  5792 status_update_manager.cpp:203] Recovering status update manager
I0929 22:01:49.947471  5797 containerizer.cpp:648] Recovering containerizer
I0929 22:01:49.949327  5803 provisioner.cpp:416] Provisioner recovery complete
I0929 22:01:49.949934  5794 slave.cpp:6313] Finished recovery
I0929 22:01:49.960650  5794 slave.cpp:6495] Querying resource estimator for oversubscribable resources
I0929 22:01:49.960937  5792 slave.cpp:6509] Received oversubscribable resources {} from the resource estimator
I0929 22:01:49.963567  5805 process.cpp:3929] Handling HTTP event for process 'slave(820)' with path: '/slave(820)/containers'
I0929 22:01:49.965112  5798 http.cpp:1185] HTTP GET for /slave(820)/containers from 172.17.0.2:49488
I0929 22:01:49.965189  5798 http.cpp:976] Authorizing principal 'test-principal' to GET the '/containers' endpoint
I0929 22:01:49.969383  5772 slave.cpp:869] Agent terminating
[       OK ] Endpoint/SlaveEndpointTest.AuthorizedRequest/2 (42 ms)
[ RUN      ] Endpoint/SlaveEndpointTest.UnauthorizedRequest/0
I0929 22:01:49.980988  5772 containerizer.cpp:292] Using isolation { environment_secret, posix/cpu, posix/mem, filesystem/posix, network/cni }
W0929 22:01:49.981499  5772 backend.cpp:76] Failed to create 'aufs' backend: AufsBackend requires root privileges
W0929 22:01:49.981608  5772 backend.cpp:76] Failed to create 'bind' backend: BindBackend requires root privileges
I0929 22:01:49.981650  5772 provisioner.cpp:255] Using default backend 'copy'
I0929 22:01:49.985216  5796 slave.cpp:254] Mesos agent started on (821)@172.17.0.2:38107
I0929 22:01:49.985242  5796 slave.cpp:255] Flags at startup: --acls="" --appc_simple_discovery_uri_prefix="http://" --appc_store_dir="/tmp/Endpoint_SlaveEndpointTest_UnauthorizedRequest_0_BrS7FB/store/appc" --authenticate_http_readonly="true" --authenticate_http_readwrite="true" --authenticatee="crammd5" --authentication_backoff_factor="1secs" --authorizer="local" --cgroups_cpu_enable_pids_and_tids_count="false" --cgroups_enable_cfs="false" --cgroups_hierarchy="/sys/fs/cgroup" --cgroups_limit_swap="false" --cgroups_root="mesos" --container_disk_watch_interval="15secs" --containerizers="mesos" --credential="/tmp/Endpoint_SlaveEndpointTest_UnauthorizedRequest_0_BrS7FB/credential" --default_role="*" --disallow_sharing_agent_pid_namespace="false" --disk_watch_interval="1mins" --docker="docker" --docker_kill_orphans="true" --docker_registry="https://registry-1.docker.io" --docker_remove_delay="6hrs" --docker_socket="/var/run/docker.sock" --docker_stop_timeout="0ns" --docker_store_dir="/tmp/Endpoint_SlaveEndpointTest_UnauthorizedRequest_0_BrS7FB/store/docker" --docker_volume_checkpoint_dir="/var/run/mesos/isolators/docker/volume" --enforce_container_disk_quota="false" --executor_registration_timeout="1mins" --executor_reregistration_timeout="2secs" --executor_shutdown_grace_period="5secs" --fetcher_cache_dir="/tmp/Endpoint_SlaveEndpointTest_UnauthorizedRequest_0_BrS7FB/fetch" --fetcher_cache_size="2GB" --frameworks_home="" --gc_delay="1weeks" --gc_disk_headroom="0.1" --hadoop_home="" --help="false" --hostname_lookup="true" --http_command_executor="false" --http_credentials="/tmp/Endpoint_SlaveEndpointTest_UnauthorizedRequest_0_BrS7FB/http_credentials" --http_heartbeat_interval="30secs" --initialize_driver_logging="true" --isolation="posix/cpu,posix/mem" --launcher="posix" --launcher_dir="/mesos/mesos-1.5.0/_build/src" --logbufsecs="0" --logging_level="INFO" --max_completed_executors_per_framework="150" --oversubscribed_resources_interval="15secs" --perf_duration="10secs" --perf_interval="1mins" --port="5051" --qos_correction_interval_min="0ns" --quiet="false" --recover="reconnect" --recovery_timeout="15mins" --registration_backoff_factor="10ms" --resources="cpus:2;gpus:0;mem:1024;disk:1024;ports:[31000-32000]" --revocable_cpu_low_priority="true" --runtime_dir="/tmp/Endpoint_SlaveEndpointTest_UnauthorizedRequest_0_BrS7FB" --sandbox_directory="/mnt/mesos/sandbox" --strict="true" --switch_user="true" --systemd_enable_support="true" --systemd_runtime_directory="/run/systemd/system" --version="false" --work_dir="/tmp/Endpoint_SlaveEndpointTest_UnauthorizedRequest_0_nvwfMU" --zk_session_timeout="10secs"
I0929 22:01:49.985615  5796 credentials.hpp:86] Loading credential for authentication from '/tmp/Endpoint_SlaveEndpointTest_UnauthorizedRequest_0_BrS7FB/credential'
I0929 22:01:49.985759  5796 slave.cpp:287] Agent using credential for: test-principal
I0929 22:01:49.985782  5796 credentials.hpp:37] Loading credentials for authentication from '/tmp/Endpoint_SlaveEndpointTest_UnauthorizedRequest_0_BrS7FB/http_credentials'
I0929 22:01:49.986011  5796 http.cpp:1045] Creating default 'basic' HTTP authenticator for realm 'mesos-agent-readonly'
I0929 22:01:49.986160  5796 http.cpp:1045] Creating default 'basic' HTTP authenticator for realm 'mesos-agent-readwrite'
I0929 22:01:49.987517  5796 slave.cpp:585] Agent resources: [{"name":"cpus","scalar":{"value":2.0},"type":"SCALAR"},{"name":"mem","scalar":{"value":1024.0},"type":"SCALAR"},{"name":"disk","scalar":{"value":1024.0},"type":"SCALAR"},{"name":"ports","ranges":{"range":[{"begin":31000,"end":32000}]},"type":"RANGES"}]
I0929 22:01:49.987746  5796 slave.cpp:593] Agent attributes: [  ]
I0929 22:01:49.987761  5796 slave.cpp:602] Agent hostname: a083840eb5fa
I0929 22:01:49.987900  5814 status_update_manager.cpp:177] Pausing sending status updates
I0929 22:01:49.989217  5801 state.cpp:64] Recovering state from '/tmp/Endpoint_SlaveEndpointTest_UnauthorizedRequest_0_nvwfMU/meta'
I0929 22:01:49.989521  5801 status_update_manager.cpp:203] Recovering status update manager
I0929 22:01:49.989828  5812 containerizer.cpp:648] Recovering containerizer
I0929 22:01:49.991618  5800 provisioner.cpp:416] Provisioner recovery complete
I0929 22:01:49.991951  5811 slave.cpp:6313] Finished recovery
I0929 22:01:49.992446  5811 slave.cpp:6495] Querying resource estimator for oversubscribable resources
I0929 22:01:49.992709  5807 slave.cpp:6509] Received oversubscribable resources {} from the resource estimator
I0929 22:01:49.995443  5806 process.cpp:3929] Handling HTTP event for process 'slave(821)' with path: '/slave(821)/monitor/statistics'
I0929 22:01:49.997200  5813 http.cpp:1185] HTTP GET for /slave(821)/monitor/statistics from 172.17.0.2:49490
I0929 22:01:49.997356  5813 http.cpp:976] Authorizing principal 'test-principal' to GET the '/monitor/statistics' endpoint
I0929 22:01:50.000294  5772 slave.cpp:869] Agent terminating
[       OK ] Endpoint/SlaveEndpointTest.UnauthorizedRequest/0 (32 ms)
[ RUN      ] Endpoint/SlaveEndpointTest.UnauthorizedRequest/1
I0929 22:01:50.013523  5772 containerizer.cpp:292] Using isolation { environment_secret, posix/cpu, posix/mem, filesystem/posix, network/cni }
W0929 22:01:50.014055  5772 backend.cpp:76] Failed to create 'aufs' backend: AufsBackend requires root privileges
W0929 22:01:50.014168  5772 backend.cpp:76] Failed to create 'bind' backend: BindBackend requires root privileges
I0929 22:01:50.014197  5772 provisioner.cpp:255] Using default backend 'copy'
I0929 22:01:50.017771  5801 slave.cpp:254] Mesos agent started on (822)@172.17.0.2:38107
I0929 22:01:50.017794  5801 slave.cpp:255] Flags at startup: --acls="" --appc_simple_discovery_uri_prefix="http://" --appc_store_dir="/tmp/Endpoint_SlaveEndpointTest_UnauthorizedRequest_1_tHAVxn/store/appc" --authenticate_http_readonly="true" --authenticate_http_readwrite="true" --authenticatee="crammd5" --authentication_backoff_factor="1secs" --authorizer="local" --cgroups_cpu_enable_pids_and_tids_count="false" --cgroups_enable_cfs="false" --cgroups_hierarchy="/sys/fs/cgroup" --cgroups_limit_swap="false" --cgroups_root="mesos" --container_disk_watch_interval="15secs" --containerizers="mesos" --credential="/tmp/Endpoint_SlaveEndpointTest_UnauthorizedRequest_1_tHAVxn/credential" --default_role="*" --disallow_sharing_agent_pid_namespace="false" --disk_watch_interval="1mins" --docker="docker" --docker_kill_orphans="true" --docker_registry="https://registry-1.docker.io" --docker_remove_delay="6hrs" --docker_socket="/var/run/docker.sock" --docker_stop_timeout="0ns" --docker_store_dir="/tmp/Endpoint_SlaveEndpointTest_UnauthorizedRequest_1_tHAVxn/store/docker" --docker_volume_checkpoint_dir="/var/run/mesos/isolators/docker/volume" --enforce_container_disk_quota="false" --executor_registration_timeout="1mins" --executor_reregistration_timeout="2secs" --executor_shutdown_grace_period="5secs" --fetcher_cache_dir="/tmp/Endpoint_SlaveEndpointTest_UnauthorizedRequest_1_tHAVxn/fetch" --fetcher_cache_size="2GB" --frameworks_home="" --gc_delay="1weeks" --gc_disk_headroom="0.1" --hadoop_home="" --help="false" --hostname_lookup="true" --http_command_executor="false" --http_credentials="/tmp/Endpoint_SlaveEndpointTest_UnauthorizedRequest_1_tHAVxn/http_credentials" --http_heartbeat_interval="30secs" --initialize_driver_logging="true" --isolation="posix/cpu,posix/mem" --launcher="posix" --launcher_dir="/mesos/mesos-1.5.0/_build/src" --logbufsecs="0" --logging_level="INFO" --max_completed_executors_per_framework="150" --oversubscribed_resources_interval="15secs" --perf_duration="10secs" --perf_interval="1mins" --port="5051" --qos_correction_interval_min="0ns" --quiet="false" --recover="reconnect" --recovery_timeout="15mins" --registration_backoff_factor="10ms" --resources="cpus:2;gpus:0;mem:1024;disk:1024;ports:[31000-32000]" --revocable_cpu_low_priority="true" --runtime_dir="/tmp/Endpoint_SlaveEndpointTest_UnauthorizedRequest_1_tHAVxn" --sandbox_directory="/mnt/mesos/sandbox" --strict="true" --switch_user="true" --systemd_enable_support="true" --systemd_runtime_directory="/run/systemd/system" --version="false" --work_dir="/tmp/Endpoint_SlaveEndpointTest_UnauthorizedRequest_1_t2EczG" --zk_session_timeout="10secs"
I0929 22:01:50.018167  5801 credentials.hpp:86] Loading credential for authentication from '/tmp/Endpoint_SlaveEndpointTest_UnauthorizedRequest_1_tHAVxn/credential'
I0929 22:01:50.018304  5801 slave.cpp:287] Agent using credential for: test-principal
I0929 22:01:50.018326  5801 credentials.hpp:37] Loading credentials for authentication from '/tmp/Endpoint_SlaveEndpointTest_UnauthorizedRequest_1_tHAVxn/http_credentials'
I0929 22:01:50.018586  5801 http.cpp:1045] Creating default 'basic' HTTP authenticator for realm 'mesos-agent-readonly'
I0929 22:01:50.018741  5801 http.cpp:1045] Creating default 'basic' HTTP authenticator for realm 'mesos-agent-readwrite'
I0929 22:01:50.020128  5801 slave.cpp:585] Agent resources: [{"name":"cpus","scalar":{"value":2.0},"type":"SCALAR"},{"name":"mem","scalar":{"value":1024.0},"type":"SCALAR"},{"name":"disk","scalar":{"value":1024.0},"type":"SCALAR"},{"name":"ports","ranges":{"range":[{"begin":31000,"end":32000}]},"type":"RANGES"}]
I0929 22:01:50.020390  5801 slave.cpp:593] Agent attributes: [  ]
I0929 22:01:50.020417  5801 slave.cpp:602] Agent hostname: a083840eb5fa
I0929 22:01:50.020577  5811 status_update_manager.cpp:177] Pausing sending status updates
I0929 22:01:50.022001  5805 state.cpp:64] Recovering state from '/tmp/Endpoint_SlaveEndpointTest_UnauthorizedRequest_1_t2EczG/meta'
I0929 22:01:50.022326  5814 status_update_manager.cpp:203] Recovering status update manager
I0929 22:01:50.022562  5795 containerizer.cpp:648] Recovering containerizer
I0929 22:01:50.024226  5812 provisioner.cpp:416] Provisioner recovery complete
I0929 22:01:50.024724  5792 slave.cpp:6313] Finished recovery
I0929 22:01:50.025307  5792 slave.cpp:6495] Querying resource estimator for oversubscribable resources
I0929 22:01:50.025588  5798 slave.cpp:6509] Received oversubscribable resources {} from the resource estimator
I0929 22:01:50.027833  5807 process.cpp:3929] Handling HTTP event for process 'slave(822)' with path: '/slave(822)/monitor/statistics.json'
I0929 22:01:50.029399  5806 http.cpp:1185] HTTP GET for /slave(822)/monitor/statistics.json from 172.17.0.2:49492
I0929 22:01:50.029486  5806 http.cpp:976] Authorizing principal 'test-principal' to GET the '/monitor/statistics.json' endpoint
I0929 22:01:50.032299  5772 slave.cpp:869] Agent terminating
[       OK ] Endpoint/SlaveEndpointTest.UnauthorizedRequest/1 (32 ms)
[ RUN      ] Endpoint/SlaveEndpointTest.UnauthorizedRequest/2
I0929 22:01:50.048713  5772 containerizer.cpp:292] Using isolation { environment_secret, posix/cpu, posix/mem, filesystem/posix, network/cni }
W0929 22:01:50.049517  5772 backend.cpp:76] Failed to create 'aufs' backend: AufsBackend requires root privileges
W0929 22:01:50.049705  5772 backend.cpp:76] Failed to create 'bind' backend: BindBackend requires root privileges
I0929 22:01:50.049763  5772 provisioner.cpp:255] Using default backend 'copy'
I0929 22:01:50.055050  5792 slave.cpp:254] Mesos agent started on (823)@172.17.0.2:38107
I0929 22:01:50.055083  5792 slave.cpp:255] Flags at startup: --acls="" --appc_simple_discovery_uri_prefix="http://" --appc_store_dir="/tmp/Endpoint_SlaveEndpointTest_UnauthorizedRequest_2_JZwpJ9/store/appc" --authenticate_http_readonly="true" --authenticate_http_readwrite="true" --authenticatee="crammd5" --authentication_backoff_factor="1secs" --authorizer="local" --cgroups_cpu_enable_pids_and_tids_count="false" --cgroups_enable_cfs="false" --cgroups_hierarchy="/sys/fs/cgroup" --cgroups_limit_swap="false" --cgroups_root="mesos" --container_disk_watch_interval="15secs" --containerizers="mesos" --credential="/tmp/Endpoint_SlaveEndpointTest_UnauthorizedRequest_2_JZwpJ9/credential" --default_role="*" --disallow_sharing_agent_pid_namespace="false" --disk_watch_interval="1mins" --docker="docker" --docker_kill_orphans="true" --docker_registry="https://registry-1.docker.io" --docker_remove_delay="6hrs" --docker_socket="/var/run/docker.sock" --docker_stop_timeout="0ns" --docker_store_dir="/tmp/Endpoint_SlaveEndpointTest_UnauthorizedRequest_2_JZwpJ9/store/docker" --docker_volume_checkpoint_dir="/var/run/mesos/isolators/docker/volume" --enforce_container_disk_quota="false" --executor_registration_timeout="1mins" --executor_reregistration_timeout="2secs" --executor_shutdown_grace_period="5secs" --fetcher_cache_dir="/tmp/Endpoint_SlaveEndpointTest_UnauthorizedRequest_2_JZwpJ9/fetch" --fetcher_cache_size="2GB" --frameworks_home="" --gc_delay="1weeks" --gc_disk_headroom="0.1" --hadoop_home="" --help="false" --hostname_lookup="true" --http_command_executor="false" --http_credentials="/tmp/Endpoint_SlaveEndpointTest_UnauthorizedRequest_2_JZwpJ9/http_credentials" --http_heartbeat_interval="30secs" --initialize_driver_logging="true" --isolation="posix/cpu,posix/mem" --launcher="posix" --launcher_dir="/mesos/mesos-1.5.0/_build/src" --logbufsecs="0" --logging_level="INFO" --max_completed_executors_per_framework="150" --oversubscribed_resources_interval="15secs" --perf_duration="10secs" --perf_interval="1mins" --port="5051" --qos_correction_interval_min="0ns" --quiet="false" --recover="reconnect" --recovery_timeout="15mins" --registration_backoff_factor="10ms" --resources="cpus:2;gpus:0;mem:1024;disk:1024;ports:[31000-32000]" --revocable_cpu_low_priority="true" --runtime_dir="/tmp/Endpoint_SlaveEndpointTest_UnauthorizedRequest_2_JZwpJ9" --sandbox_directory="/mnt/mesos/sandbox" --strict="true" --switch_user="true" --systemd_enable_support="true" --systemd_runtime_directory="/run/systemd/system" --version="false" --work_dir="/tmp/Endpoint_SlaveEndpointTest_UnauthorizedRequest_2_DJNGFs" --zk_session_timeout="10secs"
I0929 22:01:50.055595  5792 credentials.hpp:86] Loading credential for authentication from '/tmp/Endpoint_SlaveEndpointTest_UnauthorizedRequest_2_JZwpJ9/credential'
I0929 22:01:50.055789  5792 slave.cpp:287] Agent using credential for: test-principal
I0929 22:01:50.055819  5792 credentials.hpp:37] Loading credentials for authentication from '/tmp/Endpoint_SlaveEndpointTest_UnauthorizedRequest_2_JZwpJ9/http_credentials'
I0929 22:01:50.056191  5792 http.cpp:1045] Creating default 'basic' HTTP authenticator for realm 'mesos-agent-readonly'
I0929 22:01:50.056429  5792 http.cpp:1045] Creating default 'basic' HTTP authenticator for realm 'mesos-agent-readwrite'
I0929 22:01:50.058334  5792 slave.cpp:585] Agent resources: [{"name":"cpus","scalar":{"value":2.0},"type":"SCALAR"},{"name":"mem","scalar":{"value":1024.0},"type":"SCALAR"},{"name":"disk","scalar":{"value":1024.0},"type":"SCALAR"},{"name":"ports","ranges":{"range":[{"begin":31000,"end":32000}]},"type":"RANGES"}]
I0929 22:01:50.058712  5792 slave.cpp:593] Agent attributes: [  ]
I0929 22:01:50.058729  5792 slave.cpp:602] Agent hostname: a083840eb5fa
I0929 22:01:50.058950  5794 status_update_manager.cpp:177] Pausing sending status updates
I0929 22:01:50.060781  5812 state.cpp:64] Recovering state from '/tmp/Endpoint_SlaveEndpointTest_UnauthorizedRequest_2_DJNGFs/meta'
I0929 22:01:50.061265  5812 status_update_manager.cpp:203] Recovering status update manager
I0929 22:01:50.061573  5809 containerizer.cpp:648] Recovering containerizer
I0929 22:01:50.063251  5807 provisioner.cpp:416] Provisioner recovery complete
I0929 22:01:50.063735  5808 slave.cpp:6313] Finished recovery
I0929 22:01:50.064301  5808 slave.cpp:6495] Querying resource estimator for oversubscribable resources
I0929 22:01:50.064579  5799 slave.cpp:6509] Received oversubscribable resources {} from the resource estimator
I0929 22:01:50.067308  5811 process.cpp:3929] Handling HTTP event for process 'slave(823)' with path: '/slave(823)/containers'
I0929 22:01:50.068856  5796 http.cpp:1185] HTTP GET for /slave(823)/containers from 172.17.0.2:49494
I0929 22:01:50.068944  5796 http.cpp:976] Authorizing principal 'test-principal' to GET the '/containers' endpoint
I0929 22:01:50.071593  5772 slave.cpp:869] Agent terminating
[       OK ] Endpoint/SlaveEndpointTest.UnauthorizedRequest/2 (37 ms)
[ RUN      ] Endpoint/SlaveEndpointTest.NoAuthorizer/0
I0929 22:01:50.086153  5772 containerizer.cpp:292] Using isolation { environment_secret, posix/cpu, posix/mem, filesystem/posix, network/cni }
W0929 22:01:50.086997  5772 backend.cpp:76] Failed to create 'aufs' backend: AufsBackend requires root privileges
W0929 22:01:50.087183  5772 backend.cpp:76] Failed to create 'bind' backend: BindBackend requires root privileges
I0929 22:01:50.087240  5772 provisioner.cpp:255] Using default backend 'copy'
I0929 22:01:50.090242  5772 cluster.cpp:448] Creating default 'local' authorizer
I0929 22:01:50.094019  5798 slave.cpp:254] Mesos agent started on (824)@172.17.0.2:38107
I0929 22:01:50.094050  5798 slave.cpp:255] Flags at startup: --acls="" --appc_simple_discovery_uri_prefix="http://" --appc_store_dir="/tmp/Endpoint_SlaveEndpointTest_NoAuthorizer_0_NC3ihW/store/appc" --authenticate_http_readonly="true" --authenticate_http_readwrite="true" --authenticatee="crammd5" --authentication_backoff_factor="1secs" --authorizer="local" --cgroups_cpu_enable_pids_and_tids_count="false" --cgroups_enable_cfs="false" --cgroups_hierarchy="/sys/fs/cgroup" --cgroups_limit_swap="false" --cgroups_root="mesos" --container_disk_watch_interval="15secs" --containerizers="mesos" --credential="/tmp/Endpoint_SlaveEndpointTest_NoAuthorizer_0_NC3ihW/credential" --default_role="*" --disallow_sharing_agent_pid_namespace="false" --disk_watch_interval="1mins" --docker="docker" --docker_kill_orphans="true" --docker_registry="https://registry-1.docker.io" --docker_remove_delay="6hrs" --docker_socket="/var/run/docker.sock" --docker_stop_timeout="0ns" --docker_store_dir="/tmp/Endpoint_SlaveEndpointTest_NoAuthorizer_0_NC3ihW/store/docker" --docker_volume_checkpoint_dir="/var/run/mesos/isolators/docker/volume" --enforce_container_disk_quota="false" --executor_registration_timeout="1mins" --executor_reregistration_timeout="2secs" --executor_shutdown_grace_period="5secs" --fetcher_cache_dir="/tmp/Endpoint_SlaveEndpointTest_NoAuthorizer_0_NC3ihW/fetch" --fetcher_cache_size="2GB" --frameworks_home="" --gc_delay="1weeks" --gc_disk_headroom="0.1" --hadoop_home="" --help="false" --hostname_lookup="true" --http_command_executor="false" --http_credentials="/tmp/Endpoint_SlaveEndpointTest_NoAuthorizer_0_NC3ihW/http_credentials" --http_heartbeat_interval="30secs" --initialize_driver_logging="true" --isolation="posix/cpu,posix/mem" --launcher="posix" --launcher_dir="/mesos/mesos-1.5.0/_build/src" --logbufsecs="0" --logging_level="INFO" --max_completed_executors_per_framework="150" --oversubscribed_resources_interval="15secs" --perf_duration="10secs" --perf_interval="1mins" --port="5051" --qos_correction_interval_min="0ns" --quiet="false" --recover="reconnect" --recovery_timeout="15mins" --registration_backoff_factor="10ms" --resources="cpus:2;gpus:0;mem:1024;disk:1024;ports:[31000-32000]" --revocable_cpu_low_priority="true" --runtime_dir="/tmp/Endpoint_SlaveEndpointTest_NoAuthorizer_0_NC3ihW" --sandbox_directory="/mnt/mesos/sandbox" --strict="true" --switch_user="true" --systemd_enable_support="true" --systemd_runtime_directory="/run/systemd/system" --version="false" --work_dir="/tmp/Endpoint_SlaveEndpointTest_NoAuthorizer_0_ZyL67e" --zk_session_timeout="10secs"
I0929 22:01:50.094584  5798 credentials.hpp:86] Loading credential for authentication from '/tmp/Endpoint_SlaveEndpointTest_NoAuthorizer_0_NC3ihW/credential'
I0929 22:01:50.094763  5798 slave.cpp:287] Agent using credential for: test-principal
I0929 22:01:50.094790  5798 credentials.hpp:37] Loading credentials for authentication from '/tmp/Endpoint_SlaveEndpointTest_NoAuthorizer_0_NC3ihW/http_credentials'
I0929 22:01:50.095072  5798 http.cpp:1045] Creating default 'basic' HTTP authenticator for realm 'mesos-agent-readonly'
I0929 22:01:50.095257  5798 http.cpp:1045] Creating default 'basic' HTTP authenticator for realm 'mesos-agent-readwrite'
I0929 22:01:50.096789  5798 slave.cpp:585] Agent resources: [{"name":"cpus","scalar":{"value":2.0},"type":"SCALAR"},{"name":"mem","scalar":{"value":1024.0},"type":"SCALAR"},{"name":"disk","scalar":{"value":1024.0},"type":"SCALAR"},{"name":"ports","ranges":{"range":[{"begin":31000,"end":32000}]},"type":"RANGES"}]
I0929 22:01:50.097060  5798 slave.cpp:593] Agent attributes: [  ]
I0929 22:01:50.097074  5798 slave.cpp:602] Agent hostname: a083840eb5fa
I0929 22:01:50.097213  5795 status_update_manager.cpp:177] Pausing sending status updates
I0929 22:01:50.098747  5804 state.cpp:64] Recovering state from '/tmp/Endpoint_SlaveEndpointTest_NoAuthorizer_0_ZyL67e/meta'
I0929 22:01:50.099181  5796 status_update_manager.cpp:203] Recovering status update manager
I0929 22:01:50.099401  5801 containerizer.cpp:648] Recovering containerizer
I0929 22:01:50.100935  5813 provisioner.cpp:416] Provisioner recovery complete
I0929 22:01:50.101410  5814 slave.cpp:6313] Finished recovery
I0929 22:01:50.101902  5814 slave.cpp:6495] Querying resource estimator for oversubscribable resources
I0929 22:01:50.102231  5807 slave.cpp:6509] Received oversubscribable resources {} from the resource estimator
I0929 22:01:50.105908  5808 process.cpp:3929] Handling HTTP event for process 'slave(824)' with path: '/slave(824)/monitor/statistics'
I0929 22:01:50.107769  5797 http.cpp:1185] HTTP GET for /slave(824)/monitor/statistics from 172.17.0.2:49496
I0929 22:01:50.107887  5797 http.cpp:976] Authorizing principal 'test-principal' to GET the '/monitor/statistics' endpoint
I0929 22:01:50.112560  5772 slave.cpp:869] Agent terminating
[       OK ] Endpoint/SlaveEndpointTest.NoAuthorizer/0 (42 ms)
[ RUN      ] Endpoint/SlaveEndpointTest.NoAuthorizer/1
I0929 22:01:50.127794  5772 containerizer.cpp:292] Using isolation { environment_secret, posix/cpu, posix/mem, filesystem/posix, network/cni }
W0929 22:01:50.128401  5772 backend.cpp:76] Failed to create 'aufs' backend: AufsBackend requires root privileges
W0929 22:01:50.128537  5772 backend.cpp:76] Failed to create 'bind' backend: BindBackend requires root privileges
I0929 22:01:50.128567  5772 provisioner.cpp:255] Using default backend 'copy'
I0929 22:01:50.130992  5772 cluster.cpp:448] Creating default 'local' authorizer
I0929 22:01:50.133496  5805 slave.cpp:254] Mesos agent started on (825)@172.17.0.2:38107
I0929 22:01:50.133536  5805 slave.cpp:255] Flags at startup: --acls="" --appc_simple_discovery_uri_prefix="http://" --appc_store_dir="/tmp/Endpoint_SlaveEndpointTest_NoAuthorizer_1_nIFQdJ/store/appc" --authenticate_http_readonly="true" --authenticate_http_readwrite="true" --authenticatee="crammd5" --authentication_backoff_factor="1secs" --authorizer="local" --cgroups_cpu_enable_pids_and_tids_count="false" --cgroups_enable_cfs="false" --cgroups_hierarchy="/sys/fs/cgroup" --cgroups_limit_swap="false" --cgroups_root="mesos" --container_disk_watch_interval="15secs" --containerizers="mesos" --credential="/tmp/Endpoint_SlaveEndpointTest_NoAuthorizer_1_nIFQdJ/credential" --default_role="*" --disallow_sharing_agent_pid_namespace="false" --disk_watch_interval="1mins" --docker="docker" --docker_kill_orphans="true" --docker_registry="https://registry-1.docker.io" --docker_remove_delay="6hrs" --docker_socket="/var/run/docker.sock" --docker_stop_timeout="0ns" --docker_store_dir="/tmp/Endpoint_SlaveEndpointTest_NoAuthorizer_1_nIFQdJ/store/docker" --docker_volume_checkpoint_dir="/var/run/mesos/isolators/docker/volume" --enforce_container_disk_quota="false" --executor_registration_timeout="1mins" --executor_reregistration_timeout="2secs" --executor_shutdown_grace_period="5secs" --fetcher_cache_dir="/tmp/Endpoint_SlaveEndpointTest_NoAuthorizer_1_nIFQdJ/fetch" --fetcher_cache_size="2GB" --frameworks_home="" --gc_delay="1weeks" --gc_disk_headroom="0.1" --hadoop_home="" --help="false" --hostname_lookup="true" --http_command_executor="false" --http_credentials="/tmp/Endpoint_SlaveEndpointTest_NoAuthorizer_1_nIFQdJ/http_credentials" --http_heartbeat_interval="30secs" --initialize_driver_logging="true" --isolation="posix/cpu,posix/mem" --launcher="posix" --launcher_dir="/mesos/mesos-1.5.0/_build/src" --logbufsecs="0" --logging_level="INFO" --max_completed_executors_per_framework="150" --oversubscribed_resources_interval="15secs" --perf_duration="10secs" --perf_interval="1mins" --port="5051" --qos_correction_interval_min="0ns" --quiet="false" --recover="reconnect" --recovery_timeout="15mins" --registration_backoff_factor="10ms" --resources="cpus:2;gpus:0;mem:1024;disk:1024;ports:[31000-32000]" --revocable_cpu_low_priority="true" --runtime_dir="/tmp/Endpoint_SlaveEndpointTest_NoAuthorizer_1_nIFQdJ" --sandbox_directory="/mnt/mesos/sandbox" --strict="true" --switch_user="true" --systemd_enable_support="true" --systemd_runtime_directory="/run/systemd/system" --version="false" --work_dir="/tmp/Endpoint_SlaveEndpointTest_NoAuthorizer_1_HxxhY1" --zk_session_timeout="10secs"
I0929 22:01:50.134071  5805 credentials.hpp:86] Loading credential for authentication from '/tmp/Endpoint_SlaveEndpointTest_NoAuthorizer_1_nIFQdJ/credential'
I0929 22:01:50.134280  5805 slave.cpp:287] Agent using credential for: test-principal
I0929 22:01:50.134321  5805 credentials.hpp:37] Loading credentials for authentication from '/tmp/Endpoint_SlaveEndpointTest_NoAuthorizer_1_nIFQdJ/http_credentials'
I0929 22:01:50.134675  5805 http.cpp:1045] Creating default 'basic' HTTP authenticator for realm 'mesos-agent-readonly'
I0929 22:01:50.134871  5805 http.cpp:1045] Creating default 'basic' HTTP authenticator for realm 'mesos-agent-readwrite'
I0929 22:01:50.136430  5805 slave.cpp:585] Agent resources: [{"name":"cpus","scalar":{"value":2.0},"type":"SCALAR"},{"name":"mem","scalar":{"value":1024.0},"type":"SCALAR"},{"name":"disk","scalar":{"value":1024.0},"type":"SCALAR"},{"name":"ports","ranges":{"range":[{"begin":31000,"end":32000}]},"type":"RANGES"}]
I0929 22:01:50.136803  5805 slave.cpp:593] Agent attributes: [  ]
I0929 22:01:50.136817  5805 slave.cpp:602] Agent hostname: a083840eb5fa
I0929 22:01:50.137055  5798 status_update_manager.cpp:177] Pausing sending status updates
I0929 22:01:50.139114  5804 state.cpp:64] Recovering state from '/tmp/Endpoint_SlaveEndpointTest_NoAuthorizer_1_HxxhY1/meta'
I0929 22:01:50.139631  5794 status_update_manager.cpp:203] Recovering status update manager
I0929 22:01:50.139828  5807 containerizer.cpp:648] Recovering containerizer
I0929 22:01:50.141546  5795 provisioner.cpp:416] Provisioner recovery complete
I0929 22:01:50.142077  5798 slave.cpp:6313] Finished recovery
I0929 22:01:50.142725  5798 slave.cpp:6495] Querying resource estimator for oversubscribable resources
I0929 22:01:50.143002  5799 slave.cpp:6509] Received oversubscribable resources {} from the resource estimator
I0929 22:01:50.145323  5809 process.cpp:3929] Handling HTTP event for process 'slave(825)' with path: '/slave(825)/monitor/statistics.json'
I0929 22:01:50.146984  5793 http.cpp:1185] HTTP GET for /slave(825)/monitor/statistics.json from 172.17.0.2:49498
I0929 22:01:50.147099  5793 http.cpp:976] Authorizing principal 'test-principal' to GET the '/monitor/statistics.json' endpoint
I0929 22:01:50.150421  5792 slave.cpp:869] Agent terminating
[       OK ] Endpoint/SlaveEndpointTest.NoAuthorizer/1 (37 ms)
[ RUN      ] Endpoint/SlaveEndpointTest.NoAuthorizer/2
I0929 22:01:50.164893  5772 containerizer.cpp:292] Using isolation { environment_secret, posix/cpu, posix/mem, filesystem/posix, network/cni }
W0929 22:01:50.165438  5772 backend.cpp:76] Failed to create 'aufs' backend: AufsBackend requires root privileges
W0929 22:01:50.165565  5772 backend.cpp:76] Failed to create 'bind' backend: BindBackend requires root privileges
I0929 22:01:50.165608  5772 provisioner.cpp:255] Using default backend 'copy'
I0929 22:01:50.167834  5772 cluster.cpp:448] Creating default 'local' authorizer
I0929 22:01:50.170182  5800 slave.cpp:254] Mesos agent started on (826)@172.17.0.2:38107
I0929 22:01:50.170213  5800 slave.cpp:255] Flags at startup: --acls="" --appc_simple_discovery_uri_prefix="http://" --appc_store_dir="/tmp/Endpoint_SlaveEndpointTest_NoAuthorizer_2_hWecxw/store/appc" --authenticate_http_readonly="true" --authenticate_http_readwrite="true" --authenticatee="crammd5" --authentication_backoff_factor="1secs" --authorizer="local" --cgroups_cpu_enable_pids_and_tids_count="false" --cgroups_enable_cfs="false" --cgroups_hierarchy="/sys/fs/cgroup" --cgroups_limit_swap="false" --cgroups_root="mesos" --container_disk_watch_interval="15secs" --containerizers="mesos" --credential="/tmp/Endpoint_SlaveEndpointTest_NoAuthorizer_2_hWecxw/credential" --default_role="*" --disallow_sharing_agent_pid_namespace="false" --disk_watch_interval="1mins" --docker="docker" --docker_kill_orphans="true" --docker_registry="https://registry-1.docker.io" --docker_remove_delay="6hrs" --docker_socket="/var/run/docker.sock" --docker_stop_timeout="0ns" --docker_store_dir="/tmp/Endpoint_SlaveEndpointTest_NoAuthorizer_2_hWecxw/store/docker" --docker_volume_checkpoint_dir="/var/run/mesos/isolators/docker/volume" --enforce_container_disk_quota="false" --executor_registration_timeout="1mins" --executor_reregistration_timeout="2secs" --executor_shutdown_grace_period="5secs" --fetcher_cache_dir="/tmp/Endpoint_SlaveEndpointTest_NoAuthorizer_2_hWecxw/fetch" --fetcher_cache_size="2GB" --frameworks_home="" --gc_delay="1weeks" --gc_disk_headroom="0.1" --hadoop_home="" --help="false" --hostname_lookup="true" --http_command_executor="false" --http_credentials="/tmp/Endpoint_SlaveEndpointTest_NoAuthorizer_2_hWecxw/http_credentials" --http_heartbeat_interval="30secs" --initialize_driver_logging="true" --isolation="posix/cpu,posix/mem" --launcher="posix" --launcher_dir="/mesos/mesos-1.5.0/_build/src" --logbufsecs="0" --logging_level="INFO" --max_completed_executors_per_framework="150" --oversubscribed_resources_interval="15secs" --perf_duration="10secs" --perf_interval="1mins" --port="5051" --qos_correction_interval_min="0ns" --quiet="false" --recover="reconnect" --recovery_timeout="15mins" --registration_backoff_factor="10ms" --resources="cpus:2;gpus:0;mem:1024;disk:1024;ports:[31000-32000]" --revocable_cpu_low_priority="true" --runtime_dir="/tmp/Endpoint_SlaveEndpointTest_NoAuthorizer_2_hWecxw" --sandbox_directory="/mnt/mesos/sandbox" --strict="true" --switch_user="true" --systemd_enable_support="true" --systemd_runtime_directory="/run/systemd/system" --version="false" --work_dir="/tmp/Endpoint_SlaveEndpointTest_NoAuthorizer_2_TAd4bP" --zk_session_timeout="10secs"
I0929 22:01:50.170713  5800 credentials.hpp:86] Loading credential for authentication from '/tmp/Endpoint_SlaveEndpointTest_NoAuthorizer_2_hWecxw/credential'
I0929 22:01:50.170895  5800 slave.cpp:287] Agent using credential for: test-principal
I0929 22:01:50.170920  5800 credentials.hpp:37] Loading credentials for authentication from '/tmp/Endpoint_SlaveEndpointTest_NoAuthorizer_2_hWecxw/http_credentials'
I0929 22:01:50.171190  5800 http.cpp:1045] Creating default 'basic' HTTP authenticator for realm 'mesos-agent-readonly'
I0929 22:01:50.171376  5800 http.cpp:1045] Creating default 'basic' HTTP authenticator for realm 'mesos-agent-readwrite'
I0929 22:01:50.172672  5800 slave.cpp:585] Agent resources: [{"name":"cpus","scalar":{"value":2.0},"type":"SCALAR"},{"name":"mem","scalar":{"value":1024.0},"type":"SCALAR"},{"name":"disk","scalar":{"value":1024.0},"type":"SCALAR"},{"name":"ports","ranges":{"range":[{"begin":31000,"end":32000}]},"type":"RANGES"}]
I0929 22:01:50.172893  5800 slave.cpp:593] Agent attributes: [  ]
I0929 22:01:50.172906  5800 slave.cpp:602] Agent hostname: a083840eb5fa
I0929 22:01:50.173069  5801 status_update_manager.cpp:177] Pausing sending status updates
I0929 22:01:50.174607  5805 state.cpp:64] Recovering state from '/tmp/Endpoint_SlaveEndpointTest_NoAuthorizer_2_TAd4bP/meta'
I0929 22:01:50.174988  5805 status_update_manager.cpp:203] Recovering status update manager
I0929 22:01:50.175226  5814 containerizer.cpp:648] Recovering containerizer
I0929 22:01:50.176707  5793 provisioner.cpp:416] Provisioner recovery complete
I0929 22:01:50.177258  5801 slave.cpp:6313] Finished recovery
I0929 22:01:50.177703  5801 slave.cpp:6495] Querying resource estimator for oversubscribable resources
I0929 22:01:50.177920  5799 slave.cpp:6509] Received oversubscribable resources {} from the resource estimator
I0929 22:01:50.180681  5797 process.cpp:3929] Handling HTTP event for process 'slave(826)' with path: '/slave(826)/containers'
I0929 22:01:50.182309  5812 http.cpp:1185] HTTP GET for /slave(826)/containers from 172.17.0.2:49500
I0929 22:01:50.182473  5812 http.cpp:976] Authorizing principal 'test-principal' to GET the '/containers' endpoint
I0929 22:01:50.186300  5808 slave.cpp:869] Agent terminating
[       OK ] Endpoint/SlaveEndpointTest.NoAuthorizer/2 (34 ms)
[----------] 9 tests from Endpoint/SlaveEndpointTest (334 ms total)

[----------] 2 tests from ContainerizerType/DefaultContainerDNSFlagTest
[ RUN      ] ContainerizerType/DefaultContainerDNSFlagTest.ValidateFlag/0
[       OK ] ContainerizerType/DefaultContainerDNSFlagTest.ValidateFlag/0 (10 ms)
[ RUN      ] ContainerizerType/DefaultContainerDNSFlagTest.ValidateFlag/1
[       OK ] ContainerizerType/DefaultContainerDNSFlagTest.ValidateFlag/1 (10 ms)
[----------] 2 tests from ContainerizerType/DefaultContainerDNSFlagTest (20 ms total)

[----------] Global test environment tear-down
[==========] 1685 tests from 184 test cases ran. (638984 ms total)
[  PASSED  ] 1683 tests.
[  FAILED  ] 2 tests, listed below:
[  FAILED  ] ExamplesTest.TestFramework
[  FAILED  ] ExamplesTest.NoExecutorFramework

 2 FAILED TESTS
  YOU HAVE 21 DISABLED TESTS

I0929 22:01:50.276435  5815 process.cpp:1068] Failed to accept socket: future discarded
make[4]: *** [check-local] Error 1
make[4]: Leaving directory `/mesos/mesos-1.5.0/_build/src'
make[3]: *** [check-am] Error 2
make[3]: Leaving directory `/mesos/mesos-1.5.0/_build/src'
make[2]: *** [check] Error 2
make[2]: Leaving directory `/mesos/mesos-1.5.0/_build/src'
make[1]: *** [check-recursive] Error 1
make[1]: Leaving directory `/mesos/mesos-1.5.0/_build'
make: *** [distcheck] Error 1
+ docker rmi mesos-1506718928-25551
Untagged: mesos-1506718928-25551:latest
Deleted: sha256:ab32be831cff3f1feecc7570c85dfce31568efcde0d09a44a93176faa3fe7b5d
Deleted: sha256:96afca8cc9698c2337a16b34441862f2aaedd014cad35be21d63dbbc8d22e14c
Deleted: sha256:1f75ee74ed3be1fb229da91723256b7b831dc750b8e53be439ee04914689be03
Deleted: sha256:7548ec20487cc3f4e357fde6908030f40cc3944b21420c4744bd3c3a164f358d
Deleted: sha256:10763977af6ca16937a979542cef81b6d936e44fad7d0fc22cce73b827fa20d2
Deleted: sha256:9436b4389f23a2d4219d2e5fe4f10a8feb3e521ef0c8a62cf509240069b27399
Deleted: sha256:d4330a80b2410436b3b69f1b1cae56ece89647ac21d34ed2b0561776a4775b98
Deleted: sha256:6a587bf5e5c9dde5e8d8c95dc0c159f9fcfc16912cee424d386bcecc7d09ca6b
Deleted: sha256:2fe823dbb0b8c9017151caaada674c23338a5ee99d699423829d7bbb21123da6
Deleted: sha256:512c507f29539daeebba696ea0a725c6c0f527cf1bae7be9eb1f8fe4cc420960
Deleted: sha256:bfb1412e6fa2295f59213f6b2988a1d719d5dff48bb1f8dc1a985f65cb54fc36
Deleted: sha256:7b2d74d0a03722105c266ddd920442cbec715332e8b59a619b3633148438fe8d
Deleted: sha256:eb13a79e787287f283ac0a2fb04d9b56c1ee5e1f2ac279376c8c3ef28870f17f
Deleted: sha256:4697f41f85586950939b8d2a8d47f47aad257f68aa8a48207fa67fac83a46ade
Deleted: sha256:18d650e455da7a7c7383d22a0f4cc3031aede0f32b9e9cb52a062dfe25620357
Deleted: sha256:3b6b7d8eec5eda034a81997ba4516101cdeae34fb791dcff877558d885b98679
Deleted: sha256:10628394eea003b22bb7cf8d4bae53ab48cadf533ef4ea0b70b6ae297f939b6c
Deleted: sha256:f1110701b7f967ca0c02608f4da2bdb9f5ef43b0694d14be5035d4bdedef2cea
Deleted: sha256:810c46a455bacff1e4d4bb64868bc9420723318c7b870cc6e4f52c2b212d99db
Deleted: sha256:2330f040d194ae3cca478e62588f35a1c2a687f9f3e66beb5596be27fd8ab30b
Deleted: sha256:f0dcc8cb8ec07f42c9de9f177601356dcb663105ff56fc2ec462ab1ce2b6fc69
Deleted: sha256:1bf84eb6f556744d878f44e8ac6b79e41381ddc05f97882e363d80504a034bb0
Deleted: sha256:c6efc47441b3a268998574b5a7961851b06e2f93909ab2e3c94a7069c2578eec
Deleted: sha256:2ae06ef5b5a752123d657aa70e9067f22aabac6c8e500be3f2c0c0036fa6537f
Deleted: sha256:48c17a328ba36553ee438caba9378ae10cfd00f2e6c602fc61c9dcbeeb223808
Deleted: sha256:6f816ebf7a511e35dbf08b2e3cfa26e232b3f663e1511d9fc75ff3a2589edfb5
Deleted: sha256:a055db005055e61485b7b36186e3bf33e88888478e1ea01a02f4a0f0b40fe229
Deleted: sha256:25b6c52db01c4517887f4df8e34235d6d28a144da5daf9ae52202e97e29f4438
Build step 'Execute shell' marked build as failure

Jenkins build is back to normal : Mesos-Reviewbot #19632

Posted by Apache Jenkins Server <je...@builds.apache.org>.
See <https://builds.apache.org/job/Mesos-Reviewbot/19632/display/redirect>


Build failed in Jenkins: Mesos-Reviewbot #19631

Posted by Apache Jenkins Server <je...@builds.apache.org>.
See <https://builds.apache.org/job/Mesos-Reviewbot/19631/display/redirect>

------------------------------------------
[...truncated 31.88 MB...]
I0929 23:07:56.275722  5799 http.cpp:1045] Creating default 'basic' HTTP authenticator for realm 'mesos-agent-readonly'
I0929 23:07:56.276036  5799 http.cpp:1045] Creating default 'basic' HTTP authenticator for realm 'mesos-agent-readwrite'
I0929 23:07:56.278545  5799 slave.cpp:585] Agent resources: [{"name":"cpus","scalar":{"value":2.0},"type":"SCALAR"},{"name":"mem","scalar":{"value":1024.0},"type":"SCALAR"},{"name":"disk","scalar":{"value":1024.0},"type":"SCALAR"},{"name":"ports","ranges":{"range":[{"begin":31000,"end":32000}]},"type":"RANGES"}]
I0929 23:07:56.278950  5799 slave.cpp:593] Agent attributes: [  ]
I0929 23:07:56.278975  5799 slave.cpp:602] Agent hostname: 2ecc8657e7c8
I0929 23:07:56.279251  5793 status_update_manager.cpp:177] Pausing sending status updates
I0929 23:07:56.281697  5809 state.cpp:64] Recovering state from '/tmp/Endpoint_SlaveEndpointTest_AuthorizedRequest_2_2hxOa3/meta'
I0929 23:07:56.281946  5805 status_update_manager.cpp:203] Recovering status update manager
I0929 23:07:56.282202  5792 containerizer.cpp:648] Recovering containerizer
I0929 23:07:56.283560  5788 provisioner.cpp:416] Provisioner recovery complete
I0929 23:07:56.283943  5790 slave.cpp:6313] Finished recovery
I0929 23:07:56.284390  5790 slave.cpp:6495] Querying resource estimator for oversubscribable resources
I0929 23:07:56.284608  5802 slave.cpp:6509] Received oversubscribable resources {} from the resource estimator
I0929 23:07:56.287467  5803 process.cpp:3929] Handling HTTP event for process 'slave(820)' with path: '/slave(820)/containers'
I0929 23:07:56.289405  5801 http.cpp:1185] HTTP GET for /slave(820)/containers from 172.17.0.2:44604
I0929 23:07:56.289537  5801 http.cpp:976] Authorizing principal 'test-principal' to GET the '/containers' endpoint
I0929 23:07:56.294523  5801 slave.cpp:869] Agent terminating
[       OK ] Endpoint/SlaveEndpointTest.AuthorizedRequest/2 (44 ms)
[ RUN      ] Endpoint/SlaveEndpointTest.UnauthorizedRequest/0
I0929 23:07:56.312127  5769 containerizer.cpp:292] Using isolation { environment_secret, posix/cpu, posix/mem, filesystem/posix, network/cni }
W0929 23:07:56.312840  5769 backend.cpp:76] Failed to create 'aufs' backend: AufsBackend requires root privileges
W0929 23:07:56.313005  5769 backend.cpp:76] Failed to create 'bind' backend: BindBackend requires root privileges
I0929 23:07:56.313053  5769 provisioner.cpp:255] Using default backend 'copy'
I0929 23:07:56.317579  5803 slave.cpp:254] Mesos agent started on (821)@172.17.0.2:45518
I0929 23:07:56.317616  5803 slave.cpp:255] Flags at startup: --acls="" --appc_simple_discovery_uri_prefix="http://" --appc_store_dir="/tmp/Endpoint_SlaveEndpointTest_UnauthorizedRequest_0_w9p3fD/store/appc" --authenticate_http_readonly="true" --authenticate_http_readwrite="true" --authenticatee="crammd5" --authentication_backoff_factor="1secs" --authorizer="local" --cgroups_cpu_enable_pids_and_tids_count="false" --cgroups_enable_cfs="false" --cgroups_hierarchy="/sys/fs/cgroup" --cgroups_limit_swap="false" --cgroups_root="mesos" --container_disk_watch_interval="15secs" --containerizers="mesos" --credential="/tmp/Endpoint_SlaveEndpointTest_UnauthorizedRequest_0_w9p3fD/credential" --default_role="*" --disallow_sharing_agent_pid_namespace="false" --disk_watch_interval="1mins" --docker="docker" --docker_kill_orphans="true" --docker_registry="https://registry-1.docker.io" --docker_remove_delay="6hrs" --docker_socket="/var/run/docker.sock" --docker_stop_timeout="0ns" --docker_store_dir="/tmp/Endpoint_SlaveEndpointTest_UnauthorizedRequest_0_w9p3fD/store/docker" --docker_volume_checkpoint_dir="/var/run/mesos/isolators/docker/volume" --enforce_container_disk_quota="false" --executor_registration_timeout="1mins" --executor_reregistration_timeout="2secs" --executor_shutdown_grace_period="5secs" --fetcher_cache_dir="/tmp/Endpoint_SlaveEndpointTest_UnauthorizedRequest_0_w9p3fD/fetch" --fetcher_cache_size="2GB" --frameworks_home="" --gc_delay="1weeks" --gc_disk_headroom="0.1" --hadoop_home="" --help="false" --hostname_lookup="true" --http_command_executor="false" --http_credentials="/tmp/Endpoint_SlaveEndpointTest_UnauthorizedRequest_0_w9p3fD/http_credentials" --http_heartbeat_interval="30secs" --initialize_driver_logging="true" --isolation="posix/cpu,posix/mem" --launcher="posix" --launcher_dir="/mesos/mesos-1.5.0/_build/src" --logbufsecs="0" --logging_level="INFO" --max_completed_executors_per_framework="150" --oversubscribed_resources_interval="15secs" --perf_duration="10secs" --perf_interval="1mins" --port="5051" --qos_correction_interval_min="0ns" --quiet="false" --recover="reconnect" --recovery_timeout="15mins" --registration_backoff_factor="10ms" --resources="cpus:2;gpus:0;mem:1024;disk:1024;ports:[31000-32000]" --revocable_cpu_low_priority="true" --runtime_dir="/tmp/Endpoint_SlaveEndpointTest_UnauthorizedRequest_0_w9p3fD" --sandbox_directory="/mnt/mesos/sandbox" --strict="true" --switch_user="true" --systemd_enable_support="true" --systemd_runtime_directory="/run/systemd/system" --version="false" --work_dir="/tmp/Endpoint_SlaveEndpointTest_UnauthorizedRequest_0_h0uFBj" --zk_session_timeout="10secs"
I0929 23:07:56.318428  5803 credentials.hpp:86] Loading credential for authentication from '/tmp/Endpoint_SlaveEndpointTest_UnauthorizedRequest_0_w9p3fD/credential'
I0929 23:07:56.318704  5803 slave.cpp:287] Agent using credential for: test-principal
I0929 23:07:56.318753  5803 credentials.hpp:37] Loading credentials for authentication from '/tmp/Endpoint_SlaveEndpointTest_UnauthorizedRequest_0_w9p3fD/http_credentials'
I0929 23:07:56.319170  5803 http.cpp:1045] Creating default 'basic' HTTP authenticator for realm 'mesos-agent-readonly'
I0929 23:07:56.319450  5803 http.cpp:1045] Creating default 'basic' HTTP authenticator for realm 'mesos-agent-readwrite'
I0929 23:07:56.321177  5803 slave.cpp:585] Agent resources: [{"name":"cpus","scalar":{"value":2.0},"type":"SCALAR"},{"name":"mem","scalar":{"value":1024.0},"type":"SCALAR"},{"name":"disk","scalar":{"value":1024.0},"type":"SCALAR"},{"name":"ports","ranges":{"range":[{"begin":31000,"end":32000}]},"type":"RANGES"}]
I0929 23:07:56.321461  5803 slave.cpp:593] Agent attributes: [  ]
I0929 23:07:56.321475  5803 slave.cpp:602] Agent hostname: 2ecc8657e7c8
I0929 23:07:56.321738  5799 status_update_manager.cpp:177] Pausing sending status updates
I0929 23:07:56.323115  5806 state.cpp:64] Recovering state from '/tmp/Endpoint_SlaveEndpointTest_UnauthorizedRequest_0_h0uFBj/meta'
I0929 23:07:56.323415  5790 status_update_manager.cpp:203] Recovering status update manager
I0929 23:07:56.323633  5790 containerizer.cpp:648] Recovering containerizer
I0929 23:07:56.325629  5788 provisioner.cpp:416] Provisioner recovery complete
I0929 23:07:56.326035  5807 slave.cpp:6313] Finished recovery
I0929 23:07:56.326542  5807 slave.cpp:6495] Querying resource estimator for oversubscribable resources
I0929 23:07:56.326822  5789 slave.cpp:6509] Received oversubscribable resources {} from the resource estimator
I0929 23:07:56.330060  5809 process.cpp:3929] Handling HTTP event for process 'slave(821)' with path: '/slave(821)/monitor/statistics'
I0929 23:07:56.331924  5800 http.cpp:1185] HTTP GET for /slave(821)/monitor/statistics from 172.17.0.2:44606
I0929 23:07:56.332018  5800 http.cpp:976] Authorizing principal 'test-principal' to GET the '/monitor/statistics' endpoint
I0929 23:07:56.335176  5769 slave.cpp:869] Agent terminating
[       OK ] Endpoint/SlaveEndpointTest.UnauthorizedRequest/0 (39 ms)
[ RUN      ] Endpoint/SlaveEndpointTest.UnauthorizedRequest/1
I0929 23:07:56.351258  5769 containerizer.cpp:292] Using isolation { environment_secret, posix/cpu, posix/mem, filesystem/posix, network/cni }
W0929 23:07:56.352020  5769 backend.cpp:76] Failed to create 'aufs' backend: AufsBackend requires root privileges
W0929 23:07:56.352206  5769 backend.cpp:76] Failed to create 'bind' backend: BindBackend requires root privileges
I0929 23:07:56.352254  5769 provisioner.cpp:255] Using default backend 'copy'
I0929 23:07:56.357504  5791 slave.cpp:254] Mesos agent started on (822)@172.17.0.2:45518
I0929 23:07:56.357530  5791 slave.cpp:255] Flags at startup: --acls="" --appc_simple_discovery_uri_prefix="http://" --appc_store_dir="/tmp/Endpoint_SlaveEndpointTest_UnauthorizedRequest_1_0ijybU/store/appc" --authenticate_http_readonly="true" --authenticate_http_readwrite="true" --authenticatee="crammd5" --authentication_backoff_factor="1secs" --authorizer="local" --cgroups_cpu_enable_pids_and_tids_count="false" --cgroups_enable_cfs="false" --cgroups_hierarchy="/sys/fs/cgroup" --cgroups_limit_swap="false" --cgroups_root="mesos" --container_disk_watch_interval="15secs" --containerizers="mesos" --credential="/tmp/Endpoint_SlaveEndpointTest_UnauthorizedRequest_1_0ijybU/credential" --default_role="*" --disallow_sharing_agent_pid_namespace="false" --disk_watch_interval="1mins" --docker="docker" --docker_kill_orphans="true" --docker_registry="https://registry-1.docker.io" --docker_remove_delay="6hrs" --docker_socket="/var/run/docker.sock" --docker_stop_timeout="0ns" --docker_store_dir="/tmp/Endpoint_SlaveEndpointTest_UnauthorizedRequest_1_0ijybU/store/docker" --docker_volume_checkpoint_dir="/var/run/mesos/isolators/docker/volume" --enforce_container_disk_quota="false" --executor_registration_timeout="1mins" --executor_reregistration_timeout="2secs" --executor_shutdown_grace_period="5secs" --fetcher_cache_dir="/tmp/Endpoint_SlaveEndpointTest_UnauthorizedRequest_1_0ijybU/fetch" --fetcher_cache_size="2GB" --frameworks_home="" --gc_delay="1weeks" --gc_disk_headroom="0.1" --hadoop_home="" --help="false" --hostname_lookup="true" --http_command_executor="false" --http_credentials="/tmp/Endpoint_SlaveEndpointTest_UnauthorizedRequest_1_0ijybU/http_credentials" --http_heartbeat_interval="30secs" --initialize_driver_logging="true" --isolation="posix/cpu,posix/mem" --launcher="posix" --launcher_dir="/mesos/mesos-1.5.0/_build/src" --logbufsecs="0" --logging_level="INFO" --max_completed_executors_per_framework="150" --oversubscribed_resources_interval="15secs" --perf_duration="10secs" --perf_interval="1mins" --port="5051" --qos_correction_interval_min="0ns" --quiet="false" --recover="reconnect" --recovery_timeout="15mins" --registration_backoff_factor="10ms" --resources="cpus:2;gpus:0;mem:1024;disk:1024;ports:[31000-32000]" --revocable_cpu_low_priority="true" --runtime_dir="/tmp/Endpoint_SlaveEndpointTest_UnauthorizedRequest_1_0ijybU" --sandbox_directory="/mnt/mesos/sandbox" --strict="true" --switch_user="true" --systemd_enable_support="true" --systemd_runtime_directory="/run/systemd/system" --version="false" --work_dir="/tmp/Endpoint_SlaveEndpointTest_UnauthorizedRequest_1_bGyhrA" --zk_session_timeout="10secs"
I0929 23:07:56.358052  5791 credentials.hpp:86] Loading credential for authentication from '/tmp/Endpoint_SlaveEndpointTest_UnauthorizedRequest_1_0ijybU/credential'
I0929 23:07:56.358259  5791 slave.cpp:287] Agent using credential for: test-principal
I0929 23:07:56.358295  5791 credentials.hpp:37] Loading credentials for authentication from '/tmp/Endpoint_SlaveEndpointTest_UnauthorizedRequest_1_0ijybU/http_credentials'
I0929 23:07:56.358630  5791 http.cpp:1045] Creating default 'basic' HTTP authenticator for realm 'mesos-agent-readonly'
I0929 23:07:56.358882  5791 http.cpp:1045] Creating default 'basic' HTTP authenticator for realm 'mesos-agent-readwrite'
I0929 23:07:56.360208  5791 slave.cpp:585] Agent resources: [{"name":"cpus","scalar":{"value":2.0},"type":"SCALAR"},{"name":"mem","scalar":{"value":1024.0},"type":"SCALAR"},{"name":"disk","scalar":{"value":1024.0},"type":"SCALAR"},{"name":"ports","ranges":{"range":[{"begin":31000,"end":32000}]},"type":"RANGES"}]
I0929 23:07:56.360426  5791 slave.cpp:593] Agent attributes: [  ]
I0929 23:07:56.360438  5791 slave.cpp:602] Agent hostname: 2ecc8657e7c8
I0929 23:07:56.360600  5809 status_update_manager.cpp:177] Pausing sending status updates
I0929 23:07:56.361836  5810 state.cpp:64] Recovering state from '/tmp/Endpoint_SlaveEndpointTest_UnauthorizedRequest_1_bGyhrA/meta'
I0929 23:07:56.362293  5788 status_update_manager.cpp:203] Recovering status update manager
I0929 23:07:56.362639  5788 containerizer.cpp:648] Recovering containerizer
I0929 23:07:56.364451  5790 provisioner.cpp:416] Provisioner recovery complete
I0929 23:07:56.364866  5795 slave.cpp:6313] Finished recovery
I0929 23:07:56.365366  5795 slave.cpp:6495] Querying resource estimator for oversubscribable resources
I0929 23:07:56.365654  5800 slave.cpp:6509] Received oversubscribable resources {} from the resource estimator
I0929 23:07:56.368600  5799 process.cpp:3929] Handling HTTP event for process 'slave(822)' with path: '/slave(822)/monitor/statistics.json'
I0929 23:07:56.370471  5790 http.cpp:1185] HTTP GET for /slave(822)/monitor/statistics.json from 172.17.0.2:44608
I0929 23:07:56.370604  5790 http.cpp:976] Authorizing principal 'test-principal' to GET the '/monitor/statistics.json' endpoint
I0929 23:07:56.373822  5769 slave.cpp:869] Agent terminating
[       OK ] Endpoint/SlaveEndpointTest.UnauthorizedRequest/1 (37 ms)
[ RUN      ] Endpoint/SlaveEndpointTest.UnauthorizedRequest/2
I0929 23:07:56.388540  5769 containerizer.cpp:292] Using isolation { environment_secret, posix/cpu, posix/mem, filesystem/posix, network/cni }
W0929 23:07:56.389165  5769 backend.cpp:76] Failed to create 'aufs' backend: AufsBackend requires root privileges
W0929 23:07:56.389308  5769 backend.cpp:76] Failed to create 'bind' backend: BindBackend requires root privileges
I0929 23:07:56.389369  5769 provisioner.cpp:255] Using default backend 'copy'
I0929 23:07:56.394012  5793 slave.cpp:254] Mesos agent started on (823)@172.17.0.2:45518
I0929 23:07:56.394049  5793 slave.cpp:255] Flags at startup: --acls="" --appc_simple_discovery_uri_prefix="http://" --appc_store_dir="/tmp/Endpoint_SlaveEndpointTest_UnauthorizedRequest_2_JUSOtb/store/appc" --authenticate_http_readonly="true" --authenticate_http_readwrite="true" --authenticatee="crammd5" --authentication_backoff_factor="1secs" --authorizer="local" --cgroups_cpu_enable_pids_and_tids_count="false" --cgroups_enable_cfs="false" --cgroups_hierarchy="/sys/fs/cgroup" --cgroups_limit_swap="false" --cgroups_root="mesos" --container_disk_watch_interval="15secs" --containerizers="mesos" --credential="/tmp/Endpoint_SlaveEndpointTest_UnauthorizedRequest_2_JUSOtb/credential" --default_role="*" --disallow_sharing_agent_pid_namespace="false" --disk_watch_interval="1mins" --docker="docker" --docker_kill_orphans="true" --docker_registry="https://registry-1.docker.io" --docker_remove_delay="6hrs" --docker_socket="/var/run/docker.sock" --docker_stop_timeout="0ns" --docker_store_dir="/tmp/Endpoint_SlaveEndpointTest_UnauthorizedRequest_2_JUSOtb/store/docker" --docker_volume_checkpoint_dir="/var/run/mesos/isolators/docker/volume" --enforce_container_disk_quota="false" --executor_registration_timeout="1mins" --executor_reregistration_timeout="2secs" --executor_shutdown_grace_period="5secs" --fetcher_cache_dir="/tmp/Endpoint_SlaveEndpointTest_UnauthorizedRequest_2_JUSOtb/fetch" --fetcher_cache_size="2GB" --frameworks_home="" --gc_delay="1weeks" --gc_disk_headroom="0.1" --hadoop_home="" --help="false" --hostname_lookup="true" --http_command_executor="false" --http_credentials="/tmp/Endpoint_SlaveEndpointTest_UnauthorizedRequest_2_JUSOtb/http_credentials" --http_heartbeat_interval="30secs" --initialize_driver_logging="true" --isolation="posix/cpu,posix/mem" --launcher="posix" --launcher_dir="/mesos/mesos-1.5.0/_build/src" --logbufsecs="0" --logging_level="INFO" --max_completed_executors_per_framework="150" --oversubscribed_resources_interval="15secs" --perf_duration="10secs" --perf_interval="1mins" --port="5051" --qos_correction_interval_min="0ns" --quiet="false" --recover="reconnect" --recovery_timeout="15mins" --registration_backoff_factor="10ms" --resources="cpus:2;gpus:0;mem:1024;disk:1024;ports:[31000-32000]" --revocable_cpu_low_priority="true" --runtime_dir="/tmp/Endpoint_SlaveEndpointTest_UnauthorizedRequest_2_JUSOtb" --sandbox_directory="/mnt/mesos/sandbox" --strict="true" --switch_user="true" --systemd_enable_support="true" --systemd_runtime_directory="/run/systemd/system" --version="false" --work_dir="/tmp/Endpoint_SlaveEndpointTest_UnauthorizedRequest_2_uGLUDR" --zk_session_timeout="10secs"
I0929 23:07:56.394546  5793 credentials.hpp:86] Loading credential for authentication from '/tmp/Endpoint_SlaveEndpointTest_UnauthorizedRequest_2_JUSOtb/credential'
I0929 23:07:56.394721  5793 slave.cpp:287] Agent using credential for: test-principal
I0929 23:07:56.394749  5793 credentials.hpp:37] Loading credentials for authentication from '/tmp/Endpoint_SlaveEndpointTest_UnauthorizedRequest_2_JUSOtb/http_credentials'
I0929 23:07:56.395022  5793 http.cpp:1045] Creating default 'basic' HTTP authenticator for realm 'mesos-agent-readonly'
I0929 23:07:56.395242  5793 http.cpp:1045] Creating default 'basic' HTTP authenticator for realm 'mesos-agent-readwrite'
I0929 23:07:56.396922  5793 slave.cpp:585] Agent resources: [{"name":"cpus","scalar":{"value":2.0},"type":"SCALAR"},{"name":"mem","scalar":{"value":1024.0},"type":"SCALAR"},{"name":"disk","scalar":{"value":1024.0},"type":"SCALAR"},{"name":"ports","ranges":{"range":[{"begin":31000,"end":32000}]},"type":"RANGES"}]
I0929 23:07:56.397207  5793 slave.cpp:593] Agent attributes: [  ]
I0929 23:07:56.397222  5793 slave.cpp:602] Agent hostname: 2ecc8657e7c8
I0929 23:07:56.397375  5797 status_update_manager.cpp:177] Pausing sending status updates
I0929 23:07:56.399029  5811 state.cpp:64] Recovering state from '/tmp/Endpoint_SlaveEndpointTest_UnauthorizedRequest_2_uGLUDR/meta'
I0929 23:07:56.399477  5803 status_update_manager.cpp:203] Recovering status update manager
I0929 23:07:56.399785  5805 containerizer.cpp:648] Recovering containerizer
I0929 23:07:56.401554  5796 provisioner.cpp:416] Provisioner recovery complete
I0929 23:07:56.402046  5789 slave.cpp:6313] Finished recovery
I0929 23:07:56.402624  5789 slave.cpp:6495] Querying resource estimator for oversubscribable resources
I0929 23:07:56.402869  5803 slave.cpp:6509] Received oversubscribable resources {} from the resource estimator
I0929 23:07:56.405329  5799 process.cpp:3929] Handling HTTP event for process 'slave(823)' with path: '/slave(823)/containers'
I0929 23:07:56.406926  5794 http.cpp:1185] HTTP GET for /slave(823)/containers from 172.17.0.2:44610
I0929 23:07:56.407014  5794 http.cpp:976] Authorizing principal 'test-principal' to GET the '/containers' endpoint
I0929 23:07:56.409904  5769 slave.cpp:869] Agent terminating
[       OK ] Endpoint/SlaveEndpointTest.UnauthorizedRequest/2 (35 ms)
[ RUN      ] Endpoint/SlaveEndpointTest.NoAuthorizer/0
I0929 23:07:56.423928  5769 containerizer.cpp:292] Using isolation { environment_secret, posix/cpu, posix/mem, filesystem/posix, network/cni }
W0929 23:07:56.424557  5769 backend.cpp:76] Failed to create 'aufs' backend: AufsBackend requires root privileges
W0929 23:07:56.424705  5769 backend.cpp:76] Failed to create 'bind' backend: BindBackend requires root privileges
I0929 23:07:56.424744  5769 provisioner.cpp:255] Using default backend 'copy'
I0929 23:07:56.426831  5769 cluster.cpp:448] Creating default 'local' authorizer
I0929 23:07:56.429651  5793 slave.cpp:254] Mesos agent started on (824)@172.17.0.2:45518
I0929 23:07:56.429679  5793 slave.cpp:255] Flags at startup: --acls="" --appc_simple_discovery_uri_prefix="http://" --appc_store_dir="/tmp/Endpoint_SlaveEndpointTest_NoAuthorizer_0_2Kco7s/store/appc" --authenticate_http_readonly="true" --authenticate_http_readwrite="true" --authenticatee="crammd5" --authentication_backoff_factor="1secs" --authorizer="local" --cgroups_cpu_enable_pids_and_tids_count="false" --cgroups_enable_cfs="false" --cgroups_hierarchy="/sys/fs/cgroup" --cgroups_limit_swap="false" --cgroups_root="mesos" --container_disk_watch_interval="15secs" --containerizers="mesos" --credential="/tmp/Endpoint_SlaveEndpointTest_NoAuthorizer_0_2Kco7s/credential" --default_role="*" --disallow_sharing_agent_pid_namespace="false" --disk_watch_interval="1mins" --docker="docker" --docker_kill_orphans="true" --docker_registry="https://registry-1.docker.io" --docker_remove_delay="6hrs" --docker_socket="/var/run/docker.sock" --docker_stop_timeout="0ns" --docker_store_dir="/tmp/Endpoint_SlaveEndpointTest_NoAuthorizer_0_2Kco7s/store/docker" --docker_volume_checkpoint_dir="/var/run/mesos/isolators/docker/volume" --enforce_container_disk_quota="false" --executor_registration_timeout="1mins" --executor_reregistration_timeout="2secs" --executor_shutdown_grace_period="5secs" --fetcher_cache_dir="/tmp/Endpoint_SlaveEndpointTest_NoAuthorizer_0_2Kco7s/fetch" --fetcher_cache_size="2GB" --frameworks_home="" --gc_delay="1weeks" --gc_disk_headroom="0.1" --hadoop_home="" --help="false" --hostname_lookup="true" --http_command_executor="false" --http_credentials="/tmp/Endpoint_SlaveEndpointTest_NoAuthorizer_0_2Kco7s/http_credentials" --http_heartbeat_interval="30secs" --initialize_driver_logging="true" --isolation="posix/cpu,posix/mem" --launcher="posix" --launcher_dir="/mesos/mesos-1.5.0/_build/src" --logbufsecs="0" --logging_level="INFO" --max_completed_executors_per_framework="150" --oversubscribed_resources_interval="15secs" --perf_duration="10secs" --perf_interval="1mins" --port="5051" --qos_correction_interval_min="0ns" --quiet="false" --recover="reconnect" --recovery_timeout="15mins" --registration_backoff_factor="10ms" --resources="cpus:2;gpus:0;mem:1024;disk:1024;ports:[31000-32000]" --revocable_cpu_low_priority="true" --runtime_dir="/tmp/Endpoint_SlaveEndpointTest_NoAuthorizer_0_2Kco7s" --sandbox_directory="/mnt/mesos/sandbox" --strict="true" --switch_user="true" --systemd_enable_support="true" --systemd_runtime_directory="/run/systemd/system" --version="false" --work_dir="/tmp/Endpoint_SlaveEndpointTest_NoAuthorizer_0_viCec9" --zk_session_timeout="10secs"
I0929 23:07:56.430130  5793 credentials.hpp:86] Loading credential for authentication from '/tmp/Endpoint_SlaveEndpointTest_NoAuthorizer_0_2Kco7s/credential'
I0929 23:07:56.430276  5793 slave.cpp:287] Agent using credential for: test-principal
I0929 23:07:56.430302  5793 credentials.hpp:37] Loading credentials for authentication from '/tmp/Endpoint_SlaveEndpointTest_NoAuthorizer_0_2Kco7s/http_credentials'
I0929 23:07:56.430647  5793 http.cpp:1045] Creating default 'basic' HTTP authenticator for realm 'mesos-agent-readonly'
I0929 23:07:56.430882  5793 http.cpp:1045] Creating default 'basic' HTTP authenticator for realm 'mesos-agent-readwrite'
I0929 23:07:56.433079  5793 slave.cpp:585] Agent resources: [{"name":"cpus","scalar":{"value":2.0},"type":"SCALAR"},{"name":"mem","scalar":{"value":1024.0},"type":"SCALAR"},{"name":"disk","scalar":{"value":1024.0},"type":"SCALAR"},{"name":"ports","ranges":{"range":[{"begin":31000,"end":32000}]},"type":"RANGES"}]
I0929 23:07:56.433490  5793 slave.cpp:593] Agent attributes: [  ]
I0929 23:07:56.433509  5793 slave.cpp:602] Agent hostname: 2ecc8657e7c8
I0929 23:07:56.433755  5807 status_update_manager.cpp:177] Pausing sending status updates
I0929 23:07:56.435508  5805 state.cpp:64] Recovering state from '/tmp/Endpoint_SlaveEndpointTest_NoAuthorizer_0_viCec9/meta'
I0929 23:07:56.435852  5799 status_update_manager.cpp:203] Recovering status update manager
I0929 23:07:56.436070  5790 containerizer.cpp:648] Recovering containerizer
I0929 23:07:56.437582  5795 provisioner.cpp:416] Provisioner recovery complete
I0929 23:07:56.437971  5795 slave.cpp:6313] Finished recovery
I0929 23:07:56.438426  5795 slave.cpp:6495] Querying resource estimator for oversubscribable resources
I0929 23:07:56.438652  5801 slave.cpp:6509] Received oversubscribable resources {} from the resource estimator
I0929 23:07:56.441181  5788 process.cpp:3929] Handling HTTP event for process 'slave(824)' with path: '/slave(824)/monitor/statistics'
I0929 23:07:56.442481  5809 http.cpp:1185] HTTP GET for /slave(824)/monitor/statistics from 172.17.0.2:44612
I0929 23:07:56.442553  5809 http.cpp:976] Authorizing principal 'test-principal' to GET the '/monitor/statistics' endpoint
I0929 23:07:56.446290  5769 slave.cpp:869] Agent terminating
[       OK ] Endpoint/SlaveEndpointTest.NoAuthorizer/0 (36 ms)
[ RUN      ] Endpoint/SlaveEndpointTest.NoAuthorizer/1
I0929 23:07:56.462990  5769 containerizer.cpp:292] Using isolation { environment_secret, posix/cpu, posix/mem, filesystem/posix, network/cni }
W0929 23:07:56.463681  5769 backend.cpp:76] Failed to create 'aufs' backend: AufsBackend requires root privileges
W0929 23:07:56.463842  5769 backend.cpp:76] Failed to create 'bind' backend: BindBackend requires root privileges
I0929 23:07:56.463886  5769 provisioner.cpp:255] Using default backend 'copy'
I0929 23:07:56.466295  5769 cluster.cpp:448] Creating default 'local' authorizer
I0929 23:07:56.468907  5799 slave.cpp:254] Mesos agent started on (825)@172.17.0.2:45518
I0929 23:07:56.468931  5799 slave.cpp:255] Flags at startup: --acls="" --appc_simple_discovery_uri_prefix="http://" --appc_store_dir="/tmp/Endpoint_SlaveEndpointTest_NoAuthorizer_1_ArzX6K/store/appc" --authenticate_http_readonly="true" --authenticate_http_readwrite="true" --authenticatee="crammd5" --authentication_backoff_factor="1secs" --authorizer="local" --cgroups_cpu_enable_pids_and_tids_count="false" --cgroups_enable_cfs="false" --cgroups_hierarchy="/sys/fs/cgroup" --cgroups_limit_swap="false" --cgroups_root="mesos" --container_disk_watch_interval="15secs" --containerizers="mesos" --credential="/tmp/Endpoint_SlaveEndpointTest_NoAuthorizer_1_ArzX6K/credential" --default_role="*" --disallow_sharing_agent_pid_namespace="false" --disk_watch_interval="1mins" --docker="docker" --docker_kill_orphans="true" --docker_registry="https://registry-1.docker.io" --docker_remove_delay="6hrs" --docker_socket="/var/run/docker.sock" --docker_stop_timeout="0ns" --docker_store_dir="/tmp/Endpoint_SlaveEndpointTest_NoAuthorizer_1_ArzX6K/store/docker" --docker_volume_checkpoint_dir="/var/run/mesos/isolators/docker/volume" --enforce_container_disk_quota="false" --executor_registration_timeout="1mins" --executor_reregistration_timeout="2secs" --executor_shutdown_grace_period="5secs" --fetcher_cache_dir="/tmp/Endpoint_SlaveEndpointTest_NoAuthorizer_1_ArzX6K/fetch" --fetcher_cache_size="2GB" --frameworks_home="" --gc_delay="1weeks" --gc_disk_headroom="0.1" --hadoop_home="" --help="false" --hostname_lookup="true" --http_command_executor="false" --http_credentials="/tmp/Endpoint_SlaveEndpointTest_NoAuthorizer_1_ArzX6K/http_credentials" --http_heartbeat_interval="30secs" --initialize_driver_logging="true" --isolation="posix/cpu,posix/mem" --launcher="posix" --launcher_dir="/mesos/mesos-1.5.0/_build/src" --logbufsecs="0" --logging_level="INFO" --max_completed_executors_per_framework="150" --oversubscribed_resources_interval="15secs" --perf_duration="10secs" --perf_interval="1mins" --port="5051" --qos_correction_interval_min="0ns" --quiet="false" --recover="reconnect" --recovery_timeout="15mins" --registration_backoff_factor="10ms" --resources="cpus:2;gpus:0;mem:1024;disk:1024;ports:[31000-32000]" --revocable_cpu_low_priority="true" --runtime_dir="/tmp/Endpoint_SlaveEndpointTest_NoAuthorizer_1_ArzX6K" --sandbox_directory="/mnt/mesos/sandbox" --strict="true" --switch_user="true" --systemd_enable_support="true" --systemd_runtime_directory="/run/systemd/system" --version="false" --work_dir="/tmp/Endpoint_SlaveEndpointTest_NoAuthorizer_1_iFMc6q" --zk_session_timeout="10secs"
I0929 23:07:56.469328  5799 credentials.hpp:86] Loading credential for authentication from '/tmp/Endpoint_SlaveEndpointTest_NoAuthorizer_1_ArzX6K/credential'
I0929 23:07:56.469509  5799 slave.cpp:287] Agent using credential for: test-principal
I0929 23:07:56.469540  5799 credentials.hpp:37] Loading credentials for authentication from '/tmp/Endpoint_SlaveEndpointTest_NoAuthorizer_1_ArzX6K/http_credentials'
I0929 23:07:56.469846  5799 http.cpp:1045] Creating default 'basic' HTTP authenticator for realm 'mesos-agent-readonly'
I0929 23:07:56.470039  5799 http.cpp:1045] Creating default 'basic' HTTP authenticator for realm 'mesos-agent-readwrite'
I0929 23:07:56.471557  5799 slave.cpp:585] Agent resources: [{"name":"cpus","scalar":{"value":2.0},"type":"SCALAR"},{"name":"mem","scalar":{"value":1024.0},"type":"SCALAR"},{"name":"disk","scalar":{"value":1024.0},"type":"SCALAR"},{"name":"ports","ranges":{"range":[{"begin":31000,"end":32000}]},"type":"RANGES"}]
I0929 23:07:56.471792  5799 slave.cpp:593] Agent attributes: [  ]
I0929 23:07:56.471806  5799 slave.cpp:602] Agent hostname: 2ecc8657e7c8
I0929 23:07:56.471957  5789 status_update_manager.cpp:177] Pausing sending status updates
I0929 23:07:56.473434  5803 state.cpp:64] Recovering state from '/tmp/Endpoint_SlaveEndpointTest_NoAuthorizer_1_iFMc6q/meta'
I0929 23:07:56.473757  5803 status_update_manager.cpp:203] Recovering status update manager
I0929 23:07:56.473963  5798 containerizer.cpp:648] Recovering containerizer
I0929 23:07:56.475360  5809 provisioner.cpp:416] Provisioner recovery complete
I0929 23:07:56.475708  5808 slave.cpp:6313] Finished recovery
I0929 23:07:56.476156  5808 slave.cpp:6495] Querying resource estimator for oversubscribable resources
I0929 23:07:56.476368  5795 slave.cpp:6509] Received oversubscribable resources {} from the resource estimator
I0929 23:07:56.478693  5811 process.cpp:3929] Handling HTTP event for process 'slave(825)' with path: '/slave(825)/monitor/statistics.json'
I0929 23:07:56.480136  5805 http.cpp:1185] HTTP GET for /slave(825)/monitor/statistics.json from 172.17.0.2:44614
I0929 23:07:56.480221  5805 http.cpp:976] Authorizing principal 'test-principal' to GET the '/monitor/statistics.json' endpoint
I0929 23:07:56.483611  5769 slave.cpp:869] Agent terminating
[       OK ] Endpoint/SlaveEndpointTest.NoAuthorizer/1 (36 ms)
[ RUN      ] Endpoint/SlaveEndpointTest.NoAuthorizer/2
I0929 23:07:56.495550  5769 containerizer.cpp:292] Using isolation { environment_secret, posix/cpu, posix/mem, filesystem/posix, network/cni }
W0929 23:07:56.496032  5769 backend.cpp:76] Failed to create 'aufs' backend: AufsBackend requires root privileges
W0929 23:07:56.496135  5769 backend.cpp:76] Failed to create 'bind' backend: BindBackend requires root privileges
I0929 23:07:56.496165  5769 provisioner.cpp:255] Using default backend 'copy'
I0929 23:07:56.497784  5769 cluster.cpp:448] Creating default 'local' authorizer
I0929 23:07:56.499680  5811 slave.cpp:254] Mesos agent started on (826)@172.17.0.2:45518
I0929 23:07:56.499716  5811 slave.cpp:255] Flags at startup: --acls="" --appc_simple_discovery_uri_prefix="http://" --appc_store_dir="/tmp/Endpoint_SlaveEndpointTest_NoAuthorizer_2_qVSTr3/store/appc" --authenticate_http_readonly="true" --authenticate_http_readwrite="true" --authenticatee="crammd5" --authentication_backoff_factor="1secs" --authorizer="local" --cgroups_cpu_enable_pids_and_tids_count="false" --cgroups_enable_cfs="false" --cgroups_hierarchy="/sys/fs/cgroup" --cgroups_limit_swap="false" --cgroups_root="mesos" --container_disk_watch_interval="15secs" --containerizers="mesos" --credential="/tmp/Endpoint_SlaveEndpointTest_NoAuthorizer_2_qVSTr3/credential" --default_role="*" --disallow_sharing_agent_pid_namespace="false" --disk_watch_interval="1mins" --docker="docker" --docker_kill_orphans="true" --docker_registry="https://registry-1.docker.io" --docker_remove_delay="6hrs" --docker_socket="/var/run/docker.sock" --docker_stop_timeout="0ns" --docker_store_dir="/tmp/Endpoint_SlaveEndpointTest_NoAuthorizer_2_qVSTr3/store/docker" --docker_volume_checkpoint_dir="/var/run/mesos/isolators/docker/volume" --enforce_container_disk_quota="false" --executor_registration_timeout="1mins" --executor_reregistration_timeout="2secs" --executor_shutdown_grace_period="5secs" --fetcher_cache_dir="/tmp/Endpoint_SlaveEndpointTest_NoAuthorizer_2_qVSTr3/fetch" --fetcher_cache_size="2GB" --frameworks_home="" --gc_delay="1weeks" --gc_disk_headroom="0.1" --hadoop_home="" --help="false" --hostname_lookup="true" --http_command_executor="false" --http_credentials="/tmp/Endpoint_SlaveEndpointTest_NoAuthorizer_2_qVSTr3/http_credentials" --http_heartbeat_interval="30secs" --initialize_driver_logging="true" --isolation="posix/cpu,posix/mem" --launcher="posix" --launcher_dir="/mesos/mesos-1.5.0/_build/src" --logbufsecs="0" --logging_level="INFO" --max_completed_executors_per_framework="150" --oversubscribed_resources_interval="15secs" --perf_duration="10secs" --perf_interval="1mins" --port="5051" --qos_correction_interval_min="0ns" --quiet="false" --recover="reconnect" --recovery_timeout="15mins" --registration_backoff_factor="10ms" --resources="cpus:2;gpus:0;mem:1024;disk:1024;ports:[31000-32000]" --revocable_cpu_low_priority="true" --runtime_dir="/tmp/Endpoint_SlaveEndpointTest_NoAuthorizer_2_qVSTr3" --sandbox_directory="/mnt/mesos/sandbox" --strict="true" --switch_user="true" --systemd_enable_support="true" --systemd_runtime_directory="/run/systemd/system" --version="false" --work_dir="/tmp/Endpoint_SlaveEndpointTest_NoAuthorizer_2_LrgYlJ" --zk_session_timeout="10secs"
I0929 23:07:56.500222  5811 credentials.hpp:86] Loading credential for authentication from '/tmp/Endpoint_SlaveEndpointTest_NoAuthorizer_2_qVSTr3/credential'
I0929 23:07:56.500393  5811 slave.cpp:287] Agent using credential for: test-principal
I0929 23:07:56.500419  5811 credentials.hpp:37] Loading credentials for authentication from '/tmp/Endpoint_SlaveEndpointTest_NoAuthorizer_2_qVSTr3/http_credentials'
I0929 23:07:56.500680  5811 http.cpp:1045] Creating default 'basic' HTTP authenticator for realm 'mesos-agent-readonly'
I0929 23:07:56.500857  5811 http.cpp:1045] Creating default 'basic' HTTP authenticator for realm 'mesos-agent-readwrite'
I0929 23:07:56.502473  5811 slave.cpp:585] Agent resources: [{"name":"cpus","scalar":{"value":2.0},"type":"SCALAR"},{"name":"mem","scalar":{"value":1024.0},"type":"SCALAR"},{"name":"disk","scalar":{"value":1024.0},"type":"SCALAR"},{"name":"ports","ranges":{"range":[{"begin":31000,"end":32000}]},"type":"RANGES"}]
I0929 23:07:56.502869  5811 slave.cpp:593] Agent attributes: [  ]
I0929 23:07:56.502890  5811 slave.cpp:602] Agent hostname: 2ecc8657e7c8
I0929 23:07:56.503068  5808 status_update_manager.cpp:177] Pausing sending status updates
I0929 23:07:56.505280  5810 state.cpp:64] Recovering state from '/tmp/Endpoint_SlaveEndpointTest_NoAuthorizer_2_LrgYlJ/meta'
I0929 23:07:56.505560  5798 status_update_manager.cpp:203] Recovering status update manager
I0929 23:07:56.505733  5798 containerizer.cpp:648] Recovering containerizer
I0929 23:07:56.507488  5800 provisioner.cpp:416] Provisioner recovery complete
I0929 23:07:56.507901  5808 slave.cpp:6313] Finished recovery
I0929 23:07:56.508389  5808 slave.cpp:6495] Querying resource estimator for oversubscribable resources
I0929 23:07:56.508641  5795 slave.cpp:6509] Received oversubscribable resources {} from the resource estimator
I0929 23:07:56.510908  5804 process.cpp:3929] Handling HTTP event for process 'slave(826)' with path: '/slave(826)/containers'
I0929 23:07:56.512264  5809 http.cpp:1185] HTTP GET for /slave(826)/containers from 172.17.0.2:44616
I0929 23:07:56.512351  5809 http.cpp:976] Authorizing principal 'test-principal' to GET the '/containers' endpoint
I0929 23:07:56.516500  5769 slave.cpp:869] Agent terminating
[       OK ] Endpoint/SlaveEndpointTest.NoAuthorizer/2 (35 ms)
[----------] 9 tests from Endpoint/SlaveEndpointTest (334 ms total)

[----------] 2 tests from ContainerizerType/DefaultContainerDNSFlagTest
[ RUN      ] ContainerizerType/DefaultContainerDNSFlagTest.ValidateFlag/0
[       OK ] ContainerizerType/DefaultContainerDNSFlagTest.ValidateFlag/0 (11 ms)
[ RUN      ] ContainerizerType/DefaultContainerDNSFlagTest.ValidateFlag/1
[       OK ] ContainerizerType/DefaultContainerDNSFlagTest.ValidateFlag/1 (10 ms)
[----------] 2 tests from ContainerizerType/DefaultContainerDNSFlagTest (21 ms total)

[----------] Global test environment tear-down
[==========] 1685 tests from 184 test cases ran. (630940 ms total)
[  PASSED  ] 1683 tests.
[  FAILED  ] 2 tests, listed below:
[  FAILED  ] ExamplesTest.TestHTTPFramework
[  FAILED  ] ExamplesTest.V0JavaFramework

 2 FAILED TESTS
  YOU HAVE 21 DISABLED TESTS

I0929 23:07:56.606590  5812 process.cpp:1068] Failed to accept socket: future discarded
make[4]: *** [check-local] Error 1
make[4]: Leaving directory `/mesos/mesos-1.5.0/_build/src'
make[3]: *** [check-am] Error 2
make[3]: Leaving directory `/mesos/mesos-1.5.0/_build/src'
make[2]: *** [check] Error 2
make[2]: Leaving directory `/mesos/mesos-1.5.0/_build/src'
make[1]: *** [check-recursive] Error 1
make[1]: Leaving directory `/mesos/mesos-1.5.0/_build'
make: *** [distcheck] Error 1
+ docker rmi mesos-1506723089-5809
Untagged: mesos-1506723089-5809:latest
Deleted: sha256:78b62af770088d3771d3c80ea81500c059bdea9aff4e619b4440f9dd598bc0e1
Deleted: sha256:2d044b6c6190822906d4cdad092a20a6b23d96e74e3d16913f93560b2f531ce2
Deleted: sha256:19f9010aaf0cbb3effa78f61ba56a9fa4cebc91ac30b3474a05fcb5ae0ff0c2d
Deleted: sha256:0d35137a747fd73ace50bb2940505f0104d71fa8cc9e543047331ab081db3186
Deleted: sha256:2b7e43b6dc7d3a35ae526d85f1439c0082e0a2ecc97839b44096081194dc2e3b
Deleted: sha256:3631d4f4f9e01a8ed3ba380f968aa68889572a5e5d99acb07f57287a4942b31b
Deleted: sha256:d2a41ec9162c0667dc402bad1095c1cf05e94d9d460c4e190e8d19c211440b31
Deleted: sha256:07b1e4871d809a09111bb147a4c9bf60efd93b7336c8c6923b40f0fc121ef731
Deleted: sha256:8ee6b7c3e69324a8bef1c844c27aab38b73ee964dc3d639da391eb515df14909
Deleted: sha256:613076b81fed7f19a1b6a5c611f19b194039464944d28c23074406da7b4b1d42
Deleted: sha256:15f0196a11a8ce8c4145bc58418aa3134f70399a9bba0254f503c12d25b482b4
Deleted: sha256:b8015e646a5028cd83c65b733219540734ff7ecfc416f17f63e3d2c3b8a6658c
Deleted: sha256:cfb4becfc94ea7e3082600189997191c168ec5469470a95c65fd88e839ca8ce0
Deleted: sha256:fd317c30fc8b54e1367d636f3fe7e73399823ac62418d0d73baf2d2855cf7fab
Deleted: sha256:d881b6e4295e6e799e99c99ad26509fcd8bb22c906de73cad1be7e40f63c2968
Deleted: sha256:90a1e024a08352cd041d7d658e3da48eb7032f1d8d00ef9c46e315c39ecce509
Deleted: sha256:48a63a39fe239c2c16fe0bbdaaa297721095245dfa06d61f63088a57c9ff9dc0
Deleted: sha256:a0819b286b478c8bd578f559eb1011b45eb506d5acae7b7ddf9c3b156ee6daf1
Deleted: sha256:5a9d8ec2e26a57c1ef39c19c8a6a2894ac8878cd28419bb2fc5e59ad1afb726b
Deleted: sha256:f7b6a90407bec370ce098c7b3bb9ae59434b6e6708f3de5d6779a9abbcc33bab
Deleted: sha256:b264b57534845154b54911f11b96c807b8f52244251a1b5e70313aa953fe4a6b
Deleted: sha256:5836cb6c46ff4288489687a8b3fb01808d8bc9512d921518e707c46aee0f3a94
Deleted: sha256:1d5639dc1cbef2380c9a8e696fffa861f58f4bd0a3b9802b75349c1713119127
Deleted: sha256:e651fe5ee90f890756d35b863e3972733f3c38b4159da3d83fa74bd80cec88a0
Deleted: sha256:fb7d666ae505d88296b2cf4055f4310622302bad110bee15e0e2f39b2965d3aa
Deleted: sha256:04883fc5568f14c69910912778939d1ad29fcb0cb479a3040f4110bc4bda0350
Deleted: sha256:4510ddafe4463aa689af99709f8291c735fc9d88e36d413f8b57dc1b389587c5
Deleted: sha256:516fc8815ca58ae331617165324aaa9a0e2ab877ecbdca915ca0abf8cd3887eb
Build step 'Execute shell' marked build as failure