You are viewing a plain text version of this content. The canonical link for it is here.
Posted to dev@lucene.apache.org by Policeman Jenkins Server <je...@thetaphi.de> on 2016/10/22 19:58:02 UTC
[JENKINS-EA] Lucene-Solr-6.x-Linux (64bit/jdk-9-ea+140) - Build #
2013 - Unstable!
Build: https://jenkins.thetaphi.de/job/Lucene-Solr-6.x-Linux/2013/
Java: 64bit/jdk-9-ea+140 -XX:-UseCompressedOops -XX:+UseG1GC
1 tests failed.
FAILED: org.apache.solr.handler.component.SpellCheckComponentTest.test
Error Message:
List size mismatch @ spellcheck/suggestions
Stack Trace:
java.lang.RuntimeException: List size mismatch @ spellcheck/suggestions
at __randomizedtesting.SeedInfo.seed([A019F8A4CD8BDC18:284DC77E6377B1E0]:0)
at org.apache.solr.SolrTestCaseJ4.assertJQ(SolrTestCaseJ4.java:901)
at org.apache.solr.SolrTestCaseJ4.assertJQ(SolrTestCaseJ4.java:848)
at org.apache.solr.handler.component.SpellCheckComponentTest.test(SpellCheckComponentTest.java:147)
at jdk.internal.reflect.NativeMethodAccessorImpl.invoke0(java.base@9-ea/Native Method)
at jdk.internal.reflect.NativeMethodAccessorImpl.invoke(java.base@9-ea/NativeMethodAccessorImpl.java:62)
at jdk.internal.reflect.DelegatingMethodAccessorImpl.invoke(java.base@9-ea/DelegatingMethodAccessorImpl.java:43)
at java.lang.reflect.Method.invoke(java.base@9-ea/Method.java:535)
at com.carrotsearch.randomizedtesting.RandomizedRunner.invoke(RandomizedRunner.java:1713)
at com.carrotsearch.randomizedtesting.RandomizedRunner$8.evaluate(RandomizedRunner.java:907)
at com.carrotsearch.randomizedtesting.RandomizedRunner$9.evaluate(RandomizedRunner.java:943)
at com.carrotsearch.randomizedtesting.RandomizedRunner$10.evaluate(RandomizedRunner.java:957)
at com.carrotsearch.randomizedtesting.rules.SystemPropertiesRestoreRule$1.evaluate(SystemPropertiesRestoreRule.java:57)
at org.apache.lucene.util.TestRuleSetupTeardownChained$1.evaluate(TestRuleSetupTeardownChained.java:49)
at org.apache.lucene.util.AbstractBeforeAfterRule$1.evaluate(AbstractBeforeAfterRule.java:45)
at org.apache.lucene.util.TestRuleThreadAndTestName$1.evaluate(TestRuleThreadAndTestName.java:48)
at org.apache.lucene.util.TestRuleIgnoreAfterMaxFailures$1.evaluate(TestRuleIgnoreAfterMaxFailures.java:64)
at org.apache.lucene.util.TestRuleMarkFailure$1.evaluate(TestRuleMarkFailure.java:47)
at com.carrotsearch.randomizedtesting.rules.StatementAdapter.evaluate(StatementAdapter.java:36)
at com.carrotsearch.randomizedtesting.ThreadLeakControl$StatementRunner.run(ThreadLeakControl.java:367)
at com.carrotsearch.randomizedtesting.ThreadLeakControl.forkTimeoutingTask(ThreadLeakControl.java:811)
at com.carrotsearch.randomizedtesting.ThreadLeakControl$3.evaluate(ThreadLeakControl.java:462)
at com.carrotsearch.randomizedtesting.RandomizedRunner.runSingleTest(RandomizedRunner.java:916)
at com.carrotsearch.randomizedtesting.RandomizedRunner$5.evaluate(RandomizedRunner.java:802)
at com.carrotsearch.randomizedtesting.RandomizedRunner$6.evaluate(RandomizedRunner.java:852)
at com.carrotsearch.randomizedtesting.RandomizedRunner$7.evaluate(RandomizedRunner.java:863)
at com.carrotsearch.randomizedtesting.rules.StatementAdapter.evaluate(StatementAdapter.java:36)
at com.carrotsearch.randomizedtesting.rules.SystemPropertiesRestoreRule$1.evaluate(SystemPropertiesRestoreRule.java:57)
at org.apache.lucene.util.AbstractBeforeAfterRule$1.evaluate(AbstractBeforeAfterRule.java:45)
at com.carrotsearch.randomizedtesting.rules.StatementAdapter.evaluate(StatementAdapter.java:36)
at org.apache.lucene.util.TestRuleStoreClassName$1.evaluate(TestRuleStoreClassName.java:41)
at com.carrotsearch.randomizedtesting.rules.NoShadowingOrOverridesOnMethodsRule$1.evaluate(NoShadowingOrOverridesOnMethodsRule.java:40)
at com.carrotsearch.randomizedtesting.rules.NoShadowingOrOverridesOnMethodsRule$1.evaluate(NoShadowingOrOverridesOnMethodsRule.java:40)
at com.carrotsearch.randomizedtesting.rules.StatementAdapter.evaluate(StatementAdapter.java:36)
at com.carrotsearch.randomizedtesting.rules.StatementAdapter.evaluate(StatementAdapter.java:36)
at com.carrotsearch.randomizedtesting.rules.StatementAdapter.evaluate(StatementAdapter.java:36)
at org.apache.lucene.util.TestRuleAssertionsRequired$1.evaluate(TestRuleAssertionsRequired.java:53)
at org.apache.lucene.util.TestRuleMarkFailure$1.evaluate(TestRuleMarkFailure.java:47)
at org.apache.lucene.util.TestRuleIgnoreAfterMaxFailures$1.evaluate(TestRuleIgnoreAfterMaxFailures.java:64)
at org.apache.lucene.util.TestRuleIgnoreTestSuites$1.evaluate(TestRuleIgnoreTestSuites.java:54)
at com.carrotsearch.randomizedtesting.rules.StatementAdapter.evaluate(StatementAdapter.java:36)
at com.carrotsearch.randomizedtesting.ThreadLeakControl$StatementRunner.run(ThreadLeakControl.java:367)
at java.lang.Thread.run(java.base@9-ea/Thread.java:843)
Build Log:
[...truncated 11482 lines...]
[junit4] Suite: org.apache.solr.handler.component.SpellCheckComponentTest
[junit4] 2> Creating dataDir: /home/jenkins/workspace/Lucene-Solr-6.x-Linux/solr/build/solr-core/test/J1/temp/solr.handler.component.SpellCheckComponentTest_A019F8A4CD8BDC18-001/init-core-data-001
[junit4] 2> 907289 INFO (SUITE-SpellCheckComponentTest-seed#[A019F8A4CD8BDC18]-worker) [ ] o.a.s.SolrTestCaseJ4 Randomized ssl (true) and clientAuth (true) via: @org.apache.solr.util.RandomizeSSL(reason="", ssl=0.0/0.0, value=0.0/0.0, clientAuth=0.0/0.0)
[junit4] 2> 907290 INFO (SUITE-SpellCheckComponentTest-seed#[A019F8A4CD8BDC18]-worker) [ ] o.a.s.SolrTestCaseJ4 ####initCore
[junit4] 2> 907291 INFO (SUITE-SpellCheckComponentTest-seed#[A019F8A4CD8BDC18]-worker) [ ] o.a.s.c.SolrResourceLoader [null] Added 2 libs to classloader, from paths: [/home/jenkins/workspace/Lucene-Solr-6.x-Linux/solr/core/src/test-files/solr/collection1/lib, /home/jenkins/workspace/Lucene-Solr-6.x-Linux/solr/core/src/test-files/solr/collection1/lib/classes]
[junit4] 2> 907346 WARN (SUITE-SpellCheckComponentTest-seed#[A019F8A4CD8BDC18]-worker) [ ] o.a.s.c.Config Beginning with Solr 5.5, <mergePolicy> is deprecated, use <mergePolicyFactory> instead.
[junit4] 2> 907347 INFO (SUITE-SpellCheckComponentTest-seed#[A019F8A4CD8BDC18]-worker) [ ] o.a.s.c.SolrConfig Using Lucene MatchVersion: 6.3.0
[junit4] 2> 907358 INFO (SUITE-SpellCheckComponentTest-seed#[A019F8A4CD8BDC18]-worker) [ ] o.a.s.s.IndexSchema [null] Schema name=test
[junit4] 2> 907429 WARN (SUITE-SpellCheckComponentTest-seed#[A019F8A4CD8BDC18]-worker) [ ] o.a.s.s.IndexSchema [null] default search field in schema is text. WARNING: Deprecated, please use 'df' on request instead.
[junit4] 2> 907430 INFO (SUITE-SpellCheckComponentTest-seed#[A019F8A4CD8BDC18]-worker) [ ] o.a.s.s.IndexSchema Loaded schema test/1.0 with uniqueid field id
[junit4] 2> 907449 INFO (SUITE-SpellCheckComponentTest-seed#[A019F8A4CD8BDC18]-worker) [ ] o.a.s.u.UpdateShardHandler Creating UpdateShardHandler HTTP client with params: socketTimeout=30000&connTimeout=30000&retry=true
[junit4] 2> 907451 INFO (coreLoadExecutor-3094-thread-1) [ ] o.a.s.c.SolrResourceLoader [null] Added 2 libs to classloader, from paths: [/home/jenkins/workspace/Lucene-Solr-6.x-Linux/solr/core/src/test-files/solr/collection1/lib, /home/jenkins/workspace/Lucene-Solr-6.x-Linux/solr/core/src/test-files/solr/collection1/lib/classes]
[junit4] 2> 907500 WARN (coreLoadExecutor-3094-thread-1) [ ] o.a.s.c.Config Beginning with Solr 5.5, <mergePolicy> is deprecated, use <mergePolicyFactory> instead.
[junit4] 2> 907501 INFO (coreLoadExecutor-3094-thread-1) [ ] o.a.s.c.SolrConfig Using Lucene MatchVersion: 6.3.0
[junit4] 2> 907511 INFO (coreLoadExecutor-3094-thread-1) [ ] o.a.s.s.IndexSchema [collection1] Schema name=test
[junit4] 2> 907597 WARN (coreLoadExecutor-3094-thread-1) [ ] o.a.s.s.IndexSchema [collection1] default search field in schema is text. WARNING: Deprecated, please use 'df' on request instead.
[junit4] 2> 907600 INFO (coreLoadExecutor-3094-thread-1) [ ] o.a.s.s.IndexSchema Loaded schema test/1.0 with uniqueid field id
[junit4] 2> 907626 INFO (coreLoadExecutor-3094-thread-1) [ ] o.a.s.c.CoreContainer Creating SolrCore 'collection1' using configuration from instancedir /home/jenkins/workspace/Lucene-Solr-6.x-Linux/solr/core/src/test-files/solr/collection1
[junit4] 2> 907627 INFO (coreLoadExecutor-3094-thread-1) [ ] o.a.s.c.SolrCore [[collection1] ] Opening new SolrCore at [/home/jenkins/workspace/Lucene-Solr-6.x-Linux/solr/core/src/test-files/solr/collection1], dataDir=[/home/jenkins/workspace/Lucene-Solr-6.x-Linux/solr/build/solr-core/test/J1/temp/solr.handler.component.SpellCheckComponentTest_A019F8A4CD8BDC18-001/init-core-data-001/]
[junit4] 2> 907628 INFO (coreLoadExecutor-3094-thread-1) [ ] o.a.s.u.RandomMergePolicy RandomMergePolicy wrapping class org.apache.lucene.index.TieredMergePolicy: [TieredMergePolicy: maxMergeAtOnce=37, maxMergeAtOnceExplicit=12, maxMergedSegmentMB=86.728515625, floorSegmentMB=0.58203125, forceMergeDeletesPctAllowed=10.441512983142001, segmentsPerTier=37.0, maxCFSSegmentSizeMB=8.796093022207999E12, noCFSRatio=0.0
[junit4] 2> 907634 INFO (coreLoadExecutor-3094-thread-1) [ ] o.a.s.u.CommitTracker Hard AutoCommit: disabled
[junit4] 2> 907634 INFO (coreLoadExecutor-3094-thread-1) [ ] o.a.s.u.CommitTracker Soft AutoCommit: disabled
[junit4] 2> 907634 INFO (coreLoadExecutor-3094-thread-1) [ ] o.a.s.u.RandomMergePolicy RandomMergePolicy wrapping class org.apache.lucene.index.LogDocMergePolicy: [LogDocMergePolicy: minMergeSize=1000, mergeFactor=43, maxMergeSize=9223372036854775807, maxMergeSizeForForcedMerge=9223372036854775807, calibrateSizeByDeletes=true, maxMergeDocs=2147483647, maxCFSSegmentSizeMB=8.796093022207999E12, noCFSRatio=0.8742887975593354]
[junit4] 2> 907634 INFO (coreLoadExecutor-3094-thread-1) [ ] o.a.s.s.SolrIndexSearcher Opening [Searcher@5925d93b[collection1] main]
[junit4] 2> 907635 WARN (coreLoadExecutor-3094-thread-1) [ ] o.a.s.r.ManagedResourceStorage Cannot write to config directory /home/jenkins/workspace/Lucene-Solr-6.x-Linux/solr/core/src/test-files/solr/collection1/conf; switching to use InMemory storage instead.
[junit4] 2> 907635 INFO (coreLoadExecutor-3094-thread-1) [ ] o.a.s.h.c.SpellCheckComponent Initializing spell checkers
[junit4] 2> 907680 INFO (coreLoadExecutor-3094-thread-1) [ ] o.a.s.h.c.SpellCheckComponent Registering newSearcher listener for spellchecker: default
[junit4] 2> 907717 INFO (coreLoadExecutor-3094-thread-1) [ ] o.a.s.h.c.SpellCheckComponent Registering newSearcher listener for spellchecker: default_teststop
[junit4] 2> 907717 INFO (coreLoadExecutor-3094-thread-1) [ ] o.a.s.s.DirectSolrSpellChecker init: {name=direct,classname=solr.DirectSolrSpellChecker,minQueryLength=3,maxQueryFrequency=100.0,field=teststop}
[junit4] 2> 907717 INFO (coreLoadExecutor-3094-thread-1) [ ] o.a.s.s.DirectSolrSpellChecker init: {name=direct_lowerfilt,classname=solr.DirectSolrSpellChecker,minQueryLength=3,maxQueryFrequency=100.0,field=lowerfilt}
[junit4] 2> 907754 INFO (coreLoadExecutor-3094-thread-1) [ ] o.a.s.h.c.SpellCheckComponent Registering newSearcher listener for spellchecker: threshold
[junit4] 2> 907754 INFO (coreLoadExecutor-3094-thread-1) [ ] o.a.s.s.DirectSolrSpellChecker init: {name=threshold_direct,classname=solr.DirectSolrSpellChecker,field=lowerfilt,spellcheckIndexDir=spellcheckerThreshold,buildOnCommit=true,thresholdTokenFrequency=0.29}
[junit4] 2> 907754 INFO (coreLoadExecutor-3094-thread-1) [ ] o.a.s.h.c.SpellCheckComponent Registering newSearcher listener for spellchecker: threshold_direct
[junit4] 2> 907791 INFO (coreLoadExecutor-3094-thread-1) [ ] o.a.s.h.c.SpellCheckComponent Registering newSearcher listener for spellchecker: multipleFields
[junit4] 2> 907923 INFO (coreLoadExecutor-3094-thread-1) [ ] o.a.s.h.c.SpellCheckComponent Registering newSearcher listener for spellchecker: freq
[junit4] 2> 907965 INFO (coreLoadExecutor-3094-thread-1) [ ] o.a.s.h.c.SpellCheckComponent Registering newSearcher listener for spellchecker: fqcn
[junit4] 2> 907965 INFO (coreLoadExecutor-3094-thread-1) [ ] o.a.s.h.ReplicationHandler Commits will be reserved for 10000
[junit4] 2> 907966 INFO (searcherExecutor-3095-thread-1) [ ] o.a.s.h.c.SpellCheckComponent Loading spell index for spellchecker: default
[junit4] 2> 907967 INFO (SUITE-SpellCheckComponentTest-seed#[A019F8A4CD8BDC18]-worker) [ ] o.a.s.SolrTestCaseJ4 ####initCore end
[junit4] 2> 907968 INFO (searcherExecutor-3095-thread-1) [ ] o.a.s.h.c.SpellCheckComponent Loading spell index for spellchecker: default_teststop
[junit4] 2> 907969 INFO (TEST-SpellCheckComponentTest.test-seed#[A019F8A4CD8BDC18]) [ ] o.a.s.SolrTestCaseJ4 ###Starting test
[junit4] 2> 907969 INFO (searcherExecutor-3095-thread-1) [ ] o.a.s.h.c.SpellCheckComponent Loading spell index for spellchecker: direct
[junit4] 2> 907970 INFO (searcherExecutor-3095-thread-1) [ ] o.a.s.h.c.SpellCheckComponent Loading spell index for spellchecker: direct_lowerfilt
[junit4] 2> 907970 INFO (searcherExecutor-3095-thread-1) [ ] o.a.s.h.c.SpellCheckComponent Loading spell index for spellchecker: wordbreak
[junit4] 2> 907970 INFO (searcherExecutor-3095-thread-1) [ ] o.a.s.h.c.SpellCheckComponent Loading spell index for spellchecker: threshold
[junit4] 2> 907970 INFO (TEST-SpellCheckComponentTest.test-seed#[A019F8A4CD8BDC18]) [ ] o.a.s.u.p.LogUpdateProcessorFactory [collection1] webapp=null path=null params={}{add=[0]} 0 0
[junit4] 2> 907971 INFO (TEST-SpellCheckComponentTest.test-seed#[A019F8A4CD8BDC18]) [ ] o.a.s.u.p.LogUpdateProcessorFactory [collection1] webapp=null path=null params={}{add=[1]} 0 0
[junit4] 2> 907971 INFO (searcherExecutor-3095-thread-1) [ ] o.a.s.h.c.SpellCheckComponent Loading spell index for spellchecker: threshold_direct
[junit4] 2> 907971 INFO (searcherExecutor-3095-thread-1) [ ] o.a.s.h.c.SpellCheckComponent Loading spell index for spellchecker: multipleFields
[junit4] 2> 907971 INFO (TEST-SpellCheckComponentTest.test-seed#[A019F8A4CD8BDC18]) [ ] o.a.s.u.p.LogUpdateProcessorFactory [collection1] webapp=null path=null params={}{add=[2]} 0 0
[junit4] 2> 907971 INFO (TEST-SpellCheckComponentTest.test-seed#[A019F8A4CD8BDC18]) [ ] o.a.s.u.p.LogUpdateProcessorFactory [collection1] webapp=null path=null params={}{add=[3]} 0 0
[junit4] 2> 907972 INFO (TEST-SpellCheckComponentTest.test-seed#[A019F8A4CD8BDC18]) [ ] o.a.s.u.p.LogUpdateProcessorFactory [collection1] webapp=null path=null params={}{add=[4]} 0 0
[junit4] 2> 907972 INFO (TEST-SpellCheckComponentTest.test-seed#[A019F8A4CD8BDC18]) [ ] o.a.s.u.p.LogUpdateProcessorFactory [collection1] webapp=null path=null params={}{add=[5]} 0 0
[junit4] 2> 907972 INFO (TEST-SpellCheckComponentTest.test-seed#[A019F8A4CD8BDC18]) [ ] o.a.s.u.p.LogUpdateProcessorFactory [collection1] webapp=null path=null params={}{add=[6]} 0 0
[junit4] 2> 907972 INFO (searcherExecutor-3095-thread-1) [ ] o.a.s.h.c.SpellCheckComponent Loading spell index for spellchecker: jarowinkler
[junit4] 2> 907973 INFO (TEST-SpellCheckComponentTest.test-seed#[A019F8A4CD8BDC18]) [ ] o.a.s.u.p.LogUpdateProcessorFactory [collection1] webapp=null path=null params={}{add=[7]} 0 0
[junit4] 2> 907973 INFO (TEST-SpellCheckComponentTest.test-seed#[A019F8A4CD8BDC18]) [ ] o.a.s.u.p.LogUpdateProcessorFactory [collection1] webapp=null path=null params={}{add=[8]} 0 0
[junit4] 2> 907973 INFO (TEST-SpellCheckComponentTest.test-seed#[A019F8A4CD8BDC18]) [ ] o.a.s.u.p.LogUpdateProcessorFactory [collection1] webapp=null path=null params={}{add=[9]} 0 0
[junit4] 2> 907973 INFO (TEST-SpellCheckComponentTest.test-seed#[A019F8A4CD8BDC18]) [ ] o.a.s.u.DirectUpdateHandler2 start commit{,optimize=false,openSearcher=true,waitSearcher=true,expungeDeletes=false,softCommit=false,prepareCommit=false}
[junit4] 2> 907973 INFO (TEST-SpellCheckComponentTest.test-seed#[A019F8A4CD8BDC18]) [ ] o.a.s.u.SolrIndexWriter Calling setCommitData with IW:org.apache.solr.update.SolrIndexWriter@554c97b5
[junit4] 2> 907974 INFO (searcherExecutor-3095-thread-1) [ ] o.a.s.h.c.SpellCheckComponent Loading spell index for spellchecker: external
[junit4] 2> 907975 INFO (searcherExecutor-3095-thread-1) [ ] o.a.s.h.c.SpellCheckComponent Loading spell index for spellchecker: freq
[junit4] 2> 907975 WARN (TEST-SpellCheckComponentTest.test-seed#[A019F8A4CD8BDC18]) [ ] o.a.s.c.SolrCore [collection1] PERFORMANCE WARNING: Overlapping onDeckSearchers=2
[junit4] 2> 907976 INFO (TEST-SpellCheckComponentTest.test-seed#[A019F8A4CD8BDC18]) [ ] o.a.s.s.SolrIndexSearcher Opening [Searcher@42fc07a0[collection1] main]
[junit4] 2> 907976 INFO (TEST-SpellCheckComponentTest.test-seed#[A019F8A4CD8BDC18]) [ ] o.a.s.u.DirectUpdateHandler2 end_commit_flush
[junit4] 2> 907977 INFO (searcherExecutor-3095-thread-1) [ ] o.a.s.h.c.SpellCheckComponent Loading spell index for spellchecker: fqcn
[junit4] 2> 907978 INFO (searcherExecutor-3095-thread-1) [ ] o.a.s.h.c.SpellCheckComponent Loading spell index for spellchecker: perDict
[junit4] 2> 907978 INFO (searcherExecutor-3095-thread-1) [ ] o.a.s.c.SolrCore [collection1] Registered new searcher Searcher@5925d93b[collection1] main{ExitableDirectoryReader(UninvertingDirectoryReader())}
[junit4] 2> 907978 INFO (searcherExecutor-3095-thread-1) [ ] o.a.s.h.c.SpellCheckComponent Loading spell index for spellchecker: default
[junit4] 2> 907987 INFO (searcherExecutor-3095-thread-1) [ ] o.a.s.h.c.SpellCheckComponent Loading spell index for spellchecker: default_teststop
[junit4] 2> 907988 INFO (searcherExecutor-3095-thread-1) [ ] o.a.s.h.c.SpellCheckComponent Loading spell index for spellchecker: direct
[junit4] 2> 907988 INFO (searcherExecutor-3095-thread-1) [ ] o.a.s.h.c.SpellCheckComponent Loading spell index for spellchecker: direct_lowerfilt
[junit4] 2> 907988 INFO (searcherExecutor-3095-thread-1) [ ] o.a.s.h.c.SpellCheckComponent Loading spell index for spellchecker: wordbreak
[junit4] 2> 907988 INFO (searcherExecutor-3095-thread-1) [ ] o.a.s.h.c.SpellCheckComponent Loading spell index for spellchecker: threshold
[junit4] 2> 907989 INFO (searcherExecutor-3095-thread-1) [ ] o.a.s.h.c.SpellCheckComponent Loading spell index for spellchecker: threshold_direct
[junit4] 2> 907989 INFO (searcherExecutor-3095-thread-1) [ ] o.a.s.h.c.SpellCheckComponent Loading spell index for spellchecker: multipleFields
[junit4] 2> 907991 INFO (searcherExecutor-3095-thread-1) [ ] o.a.s.h.c.SpellCheckComponent Loading spell index for spellchecker: jarowinkler
[junit4] 2> 907992 INFO (searcherExecutor-3095-thread-1) [ ] o.a.s.h.c.SpellCheckComponent Loading spell index for spellchecker: external
[junit4] 2> 907994 INFO (searcherExecutor-3095-thread-1) [ ] o.a.s.h.c.SpellCheckComponent Loading spell index for spellchecker: freq
[junit4] 2> 907995 INFO (searcherExecutor-3095-thread-1) [ ] o.a.s.h.c.SpellCheckComponent Loading spell index for spellchecker: fqcn
[junit4] 2> 907997 INFO (searcherExecutor-3095-thread-1) [ ] o.a.s.h.c.SpellCheckComponent Loading spell index for spellchecker: perDict
[junit4] 2> 907997 INFO (searcherExecutor-3095-thread-1) [ ] o.a.s.c.SolrCore [collection1] Registered new searcher Searcher@42fc07a0[collection1] main{ExitableDirectoryReader(UninvertingDirectoryReader(Uninverting(_0(6.3.0):c10)))}
[junit4] 2> 907997 INFO (TEST-SpellCheckComponentTest.test-seed#[A019F8A4CD8BDC18]) [ ] o.a.s.u.p.LogUpdateProcessorFactory [collection1] webapp=null path=null params={}{commit=} 0 23
[junit4] 2> 907998 INFO (TEST-SpellCheckComponentTest.test-seed#[A019F8A4CD8BDC18]) [ ] o.a.s.c.S.Request [collection1] webapp=null path=null params={q=documemt&qt=spellCheckCompRH&spellcheck=true&wt=xml} hits=0 status=0 QTime=1
[junit4] 2> 907999 ERROR (TEST-SpellCheckComponentTest.test-seed#[A019F8A4CD8BDC18]) [ ] o.a.s.SolrTestCaseJ4 query failed JSON validation. error=List size mismatch @ spellcheck/suggestions
[junit4] 2> expected =/spellcheck=={'suggestions':['documemt',{'numFound':1,'startOffset':0,'endOffset':8,'suggestion':['document']}]}
[junit4] 2> response = {
[junit4] 2> "responseHeader":{
[junit4] 2> "status":0,
[junit4] 2> "QTime":1},
[junit4] 2> "response":{"numFound":0,"start":0,"docs":[]
[junit4] 2> },
[junit4] 2> "spellcheck":{
[junit4] 2> "suggestions":[]}}
[junit4] 2>
[junit4] 2> request = q=documemt&qt=spellCheckCompRH&spellcheck=true&wt=xml
[junit4] 2> 907999 INFO (TEST-SpellCheckComponentTest.test-seed#[A019F8A4CD8BDC18]) [ ] o.a.s.SolrTestCaseJ4 ###Ending test
[junit4] 2> 908000 INFO (TEST-SpellCheckComponentTest.test-seed#[A019F8A4CD8BDC18]) [ ] o.a.s.u.DirectUpdateHandler2 [collection1] REMOVING ALL DOCUMENTS FROM INDEX
[junit4] 2> 908000 INFO (TEST-SpellCheckComponentTest.test-seed#[A019F8A4CD8BDC18]) [ ] o.a.s.u.p.LogUpdateProcessorFactory [collection1] webapp=null path=null params={}{deleteByQuery=*:*} 0 0
[junit4] 2> 908000 INFO (TEST-SpellCheckComponentTest.test-seed#[A019F8A4CD8BDC18]) [ ] o.a.s.u.DirectUpdateHandler2 start commit{,optimize=false,openSearcher=true,waitSearcher=true,expungeDeletes=false,softCommit=false,prepareCommit=false}
[junit4] 2> 908000 INFO (TEST-SpellCheckComponentTest.test-seed#[A019F8A4CD8BDC18]) [ ] o.a.s.u.SolrIndexWriter Calling setCommitData with IW:org.apache.solr.update.SolrIndexWriter@554c97b5
[junit4] 2> 908000 INFO (TEST-SpellCheckComponentTest.test-seed#[A019F8A4CD8BDC18]) [ ] o.a.s.s.SolrIndexSearcher Opening [Searcher@47917e02[collection1] main]
[junit4] 2> 908001 INFO (TEST-SpellCheckComponentTest.test-seed#[A019F8A4CD8BDC18]) [ ] o.a.s.u.DirectUpdateHandler2 end_commit_flush
[junit4] 2> 908001 INFO (searcherExecutor-3095-thread-1) [ ] o.a.s.h.c.SpellCheckComponent Building spell index for spell checker: default
[junit4] 2> 908048 INFO (searcherExecutor-3095-thread-1) [ ] o.a.s.h.c.SpellCheckComponent Building spell index for spell checker: default_teststop
[junit4] 2> 908090 INFO (searcherExecutor-3095-thread-1) [ ] o.a.s.h.c.SpellCheckComponent Building spell index for spell checker: threshold
[junit4] 2> 909353 INFO (searcherExecutor-3095-thread-1) [ ] o.a.s.h.c.SpellCheckComponent Building spell index for spell checker: threshold_direct
[junit4] 2> 909353 INFO (searcherExecutor-3095-thread-1) [ ] o.a.s.h.c.SpellCheckComponent Building spell index for spell checker: multipleFields
[junit4] 2> 909696 INFO (searcherExecutor-3095-thread-1) [ ] o.a.s.h.c.SpellCheckComponent Building spell index for spell checker: freq
[junit4] 2> 909764 INFO (searcherExecutor-3095-thread-1) [ ] o.a.s.h.c.SpellCheckComponent Building spell index for spell checker: fqcn
[junit4] 2> 909846 INFO (searcherExecutor-3095-thread-1) [ ] o.a.s.c.SolrCore [collection1] Registered new searcher Searcher@47917e02[collection1] main{ExitableDirectoryReader(UninvertingDirectoryReader())}
[junit4] 2> 909846 INFO (TEST-SpellCheckComponentTest.test-seed#[A019F8A4CD8BDC18]) [ ] o.a.s.u.p.LogUpdateProcessorFactory [collection1] webapp=null path=null params={}{commit=} 0 1845
[junit4] 2> NOTE: reproduce with: ant test -Dtestcase=SpellCheckComponentTest -Dtests.method=test -Dtests.seed=A019F8A4CD8BDC18 -Dtests.multiplier=3 -Dtests.slow=true -Dtests.locale=ta-IN -Dtests.timezone=Asia/Baghdad -Dtests.asserts=true -Dtests.file.encoding=ISO-8859-1
[junit4] ERROR 1.88s J1 | SpellCheckComponentTest.test <<<
[junit4] > Throwable #1: java.lang.RuntimeException: List size mismatch @ spellcheck/suggestions
[junit4] > at __randomizedtesting.SeedInfo.seed([A019F8A4CD8BDC18:284DC77E6377B1E0]:0)
[junit4] > at org.apache.solr.SolrTestCaseJ4.assertJQ(SolrTestCaseJ4.java:901)
[junit4] > at org.apache.solr.SolrTestCaseJ4.assertJQ(SolrTestCaseJ4.java:848)
[junit4] > at org.apache.solr.handler.component.SpellCheckComponentTest.test(SpellCheckComponentTest.java:147)
[junit4] > at jdk.internal.reflect.NativeMethodAccessorImpl.invoke0(java.base@9-ea/Native Method)
[junit4] > at jdk.internal.reflect.NativeMethodAccessorImpl.invoke(java.base@9-ea/NativeMethodAccessorImpl.java:62)
[junit4] > at jdk.internal.reflect.DelegatingMethodAccessorImpl.invoke(java.base@9-ea/DelegatingMethodAccessorImpl.java:43)
[junit4] > at java.lang.Thread.run(java.base@9-ea/Thread.java:843)
[junit4] 2> 909849 INFO (TEST-SpellCheckComponentTest.testRebuildOnCommit-seed#[A019F8A4CD8BDC18]) [ ] o.a.s.SolrTestCaseJ4 ###Starting testRebuildOnCommit
[junit4] 2> 909850 INFO (TEST-SpellCheckComponentTest.testRebuildOnCommit-seed#[A019F8A4CD8BDC18]) [ ] o.a.s.u.p.LogUpdateProcessorFactory [collection1] webapp=null path=null params={}{add=[0]} 0 0
[junit4] 2> 909850 INFO (TEST-SpellCheckComponentTest.testRebuildOnCommit-seed#[A019F8A4CD8BDC18]) [ ] o.a.s.u.p.LogUpdateProcessorFactory [collection1] webapp=null path=null params={}{add=[1]} 0 0
[junit4] 2> 909851 INFO (TEST-SpellCheckComponentTest.testRebuildOnCommit-seed#[A019F8A4CD8BDC18]) [ ] o.a.s.u.p.LogUpdateProcessorFactory [collection1] webapp=null path=null params={}{add=[2]} 0 0
[junit4] 2> 909851 INFO (TEST-SpellCheckComponentTest.testRebuildOnCommit-seed#[A019F8A4CD8BDC18]) [ ] o.a.s.u.p.LogUpdateProcessorFactory [collection1] webapp=null path=null params={}{add=[3]} 0 0
[junit4] 2> 909852 INFO (TEST-SpellCheckComponentTest.testRebuildOnCommit-seed#[A019F8A4CD8BDC18]) [ ] o.a.s.u.p.LogUpdateProcessorFactory [collection1] webapp=null path=null params={}{add=[4]} 0 0
[junit4] 2> 909852 INFO (TEST-SpellCheckComponentTest.testRebuildOnCommit-seed#[A019F8A4CD8BDC18]) [ ] o.a.s.u.p.LogUpdateProcessorFactory [collection1] webapp=null path=null params={}{add=[5]} 0 0
[junit4] 2> 909853 INFO (TEST-SpellCheckComponentTest.testRebuildOnCommit-seed#[A019F8A4CD8BDC18]) [ ] o.a.s.u.p.LogUpdateProcessorFactory [collection1] webapp=null path=null params={}{add=[6]} 0 0
[junit4] 2> 909853 INFO (TEST-SpellCheckComponentTest.testRebuildOnCommit-seed#[A019F8A4CD8BDC18]) [ ] o.a.s.u.p.LogUpdateProcessorFactory [collection1] webapp=null path=null params={}{add=[7]} 0 0
[junit4] 2> 909853 INFO (TEST-SpellCheckComponentTest.testRebuildOnCommit-seed#[A019F8A4CD8BDC18]) [ ] o.a.s.u.p.LogUpdateProcessorFactory [collection1] webapp=null path=null params={}{add=[8]} 0 0
[junit4] 2> 909854 INFO (TEST-SpellCheckComponentTest.testRebuildOnCommit-seed#[A019F8A4CD8BDC18]) [ ] o.a.s.u.p.LogUpdateProcessorFactory [collection1] webapp=null path=null params={}{add=[9]} 0 0
[junit4] 2> 909854 INFO (TEST-SpellCheckComponentTest.testRebuildOnCommit-seed#[A019F8A4CD8BDC18]) [ ] o.a.s.u.DirectUpdateHandler2 start commit{,optimize=false,openSearcher=true,waitSearcher=true,expungeDeletes=false,softCommit=false,prepareCommit=false}
[junit4] 2> 909854 INFO (TEST-SpellCheckComponentTest.testRebuildOnCommit-seed#[A019F8A4CD8BDC18]) [ ] o.a.s.u.SolrIndexWriter Calling setCommitData with IW:org.apache.solr.update.SolrIndexWriter@554c97b5
[junit4] 2> 909857 INFO (TEST-SpellCheckComponentTest.testRebuildOnCommit-seed#[A019F8A4CD8BDC18]) [ ] o.a.s.s.SolrIndexSearcher Opening [Searcher@3ad1f7c8[collection1] main]
[junit4] 2> 909857 INFO (TEST-SpellCheckComponentTest.testRebuildOnCommit-seed#[A019F8A4CD8BDC18]) [ ] o.a.s.u.DirectUpdateHandler2 end_commit_flush
[junit4] 2> 909857 INFO (searcherExecutor-3095-thread-1) [ ] o.a.s.h.c.SpellCheckComponent Building spell index for spell checker: default
[junit4] 2> 910023 INFO (searcherExecutor-3095-thread-1) [ ] o.a.s.h.c.SpellCheckComponent Building spell index for spell checker: default_teststop
[junit4] 2> 910110 INFO (searcherExecutor-3095-thread-1) [ ] o.a.s.h.c.SpellCheckComponent Building spell index for spell checker: threshold
[junit4] 2> 910322 INFO (searcherExecutor-3095-thread-1) [ ] o.a.s.h.c.SpellCheckComponent Building spell index for spell checker: threshold_direct
[junit4] 2> 910322 INFO (searcherExecutor-3095-thread-1) [ ] o.a.s.h.c.SpellCheckComponent Building spell index for spell checker: multipleFields
[junit4] 2> 910497 INFO (searcherExecutor-3095-thread-1) [ ] o.a.s.h.c.SpellCheckComponent Building spell index for spell checker: freq
[junit4] 2> 910663 INFO (searcherExecutor-3095-thread-1) [ ] o.a.s.h.c.SpellCheckComponent Building spell index for spell checker: fqcn
[junit4] 2> 910803 INFO (searcherExecutor-3095-thread-1) [ ] o.a.s.c.SolrCore [collection1] Registered new searcher Searcher@3ad1f7c8[collection1] main{ExitableDirectoryReader(UninvertingDirectoryReader(Uninverting(_1(6.3.0):c10)))}
[junit4] 2> 910803 INFO (TEST-SpellCheckComponentTest.testRebuildOnCommit-seed#[A019F8A4CD8BDC18]) [ ] o.a.s.u.p.LogUpdateProcessorFactory [collection1] webapp=null path=null params={}{commit=} 0 949
[junit4] 2> 910804 INFO (TEST-SpellCheckComponentTest.testRebuildOnCommit-seed#[A019F8A4CD8BDC18]) [ ] o.a.s.c.S.Request [collection1] webapp=null path=null params={q=lowerfilt:lucenejavt&qt=spellCheckCompRH&spellcheck=true&wt=xml} hits=0 status=0 QTime=0
[junit4] 2> 910805 INFO (TEST-SpellCheckComponentTest.testRebuildOnCommit-seed#[A019F8A4CD8BDC18]) [ ] o.a.s.u.p.LogUpdateProcessorFactory [collection1] webapp=null path=null params={}{add=[11231]} 0 0
[junit4] 2> 910805 INFO (TEST-SpellCheckComponentTest.testRebuildOnCommit-seed#[A019F8A4CD8BDC18]) [ ] o.a.s.u.DirectUpdateHandler2 start commit{,optimize=false,openSearcher=true,waitSearcher=true,expungeDeletes=false,softCommit=false,prepareCommit=false}
[junit4] 2> 910805 INFO (TEST-SpellCheckComponentTest.testRebuildOnCommit-seed#[A019F8A4CD8BDC18]) [ ] o.a.s.u.SolrIndexWriter Calling setCommitData with IW:org.apache.solr.update.SolrIndexWriter@554c97b5
[junit4] 2> 910807 INFO (TEST-SpellCheckComponentTest.testRebuildOnCommit-seed#[A019F8A4CD8BDC18]) [ ] o.a.s.s.SolrIndexSearcher Opening [Searcher@48fe599e[collection1] main]
[junit4] 2> 910807 INFO (TEST-SpellCheckComponentTest.testRebuildOnCommit-seed#[A019F8A4CD8BDC18]) [ ] o.a.s.u.DirectUpdateHandler2 end_commit_flush
[junit4] 2> 910807 INFO (searcherExecutor-3095-thread-1) [ ] o.a.s.h.c.SpellCheckComponent Building spell index for spell checker: default
[junit4] 2> 910967 INFO (searcherExecutor-3095-thread-1) [ ] o.a.s.h.c.SpellCheckComponent Building spell index for spell checker: default_teststop
[junit4] 2> 911017 INFO (searcherExecutor-3095-thread-1) [ ] o.a.s.h.c.SpellCheckComponent Building spell index for spell checker: threshold
[junit4] 2> 911165 INFO (searcherExecutor-3095-thread-1) [ ] o.a.s.h.c.SpellCheckComponent Building spell index for spell checker: threshold_direct
[junit4] 2> 911165 INFO (searcherExecutor-3095-thread-1) [ ] o.a.s.h.c.SpellCheckComponent Building spell index for spell checker: multipleFields
[junit4] 2> 911331 INFO (searcherExecutor-3095-thread-1) [ ] o.a.s.h.c.SpellCheckComponent Building spell index for spell checker: freq
[junit4] 2> 911457 INFO (searcherExecutor-3095-thread-1) [ ] o.a.s.h.c.SpellCheckComponent Building spell index for spell checker: fqcn
[junit4] 2> 911586 INFO (searcherExecutor-3095-thread-1) [ ] o.a.s.c.SolrCore [collection1] Registered new searcher Searcher@48fe599e[collection1] main{ExitableDirectoryReader(UninvertingDirectoryReader(Uninverting(_1(6.3.0):c10) Uninverting(_2(6.3.0):c1)))}
[junit4] 2> 911586 INFO (TEST-SpellCheckComponentTest.testRebuildOnCommit-seed#[A019F8A4CD8BDC18]) [ ] o.a.s.u.p.LogUpdateProcessorFactory [collection1] webapp=null path=null params={}{commit=} 0 781
[junit4] 2> 911588 INFO (TEST-SpellCheckComponentTest.testRebuildOnCommit-seed#[A019F8A4CD8BDC18]) [ ] o.a.s.c.S.Request [collection1] webapp=null path=null params={q=lowerfilt:lucenejavt&qt=spellCheckCompRH&spellcheck=true&wt=xml} hits=0 status=0 QTime=784
[junit4] 2> 911588 INFO (TEST-SpellCheckComponentTest.testRebuildOnCommit-seed#[A019F8A4CD8BDC18]) [ ] o.a.s.SolrTestCaseJ4 ###Ending testRebuildOnCommit
[junit4] 2> 911589 INFO (TEST-SpellCheckComponentTest.testRebuildOnCommit-seed#[A019F8A4CD8BDC18]) [ ] o.a.s.u.DirectUpdateHandler2 [collection1] REMOVING ALL DOCUMENTS FROM INDEX
[junit4] 2> 911589 INFO (TEST-SpellCheckComponentTest.testRebuildOnCommit-seed#[A019F8A4CD8BDC18]) [ ] o.a.s.u.p.LogUpdateProcessorFactory [collection1] webapp=null path=null params={}{deleteByQuery=*:*} 0 0
[junit4] 2> 911589 INFO (TEST-SpellCheckComponentTest.testRebuildOnCommit-seed#[A019F8A4CD8BDC18]) [ ] o.a.s.u.DirectUpdateHandler2 start commit{,optimize=false,openSearcher=true,waitSearcher=true,expungeDeletes=false,softCommit=false,prepareCommit=false}
[junit4] 2> 911589 INFO (TEST-SpellCheckComponentTest.testRebuildOnCommit-seed#[A019F8A4CD8BDC18]) [ ] o.a.s.u.SolrIndexWriter Calling setCommitData with IW:org.apache.solr.update.SolrIndexWriter@554c97b5
[junit4] 2> 911589 INFO (TEST-SpellCheckComponentTest.testRebuildOnCommit-seed#[A019F8A4CD8BDC18]) [ ] o.a.s.s.SolrIndexSearcher Opening [Searcher@7232ae46[collection1] main]
[junit4] 2> 911589 INFO (TEST-SpellCheckComponentTest.testRebuildOnCommit-seed#[A019F8A4CD8BDC18]) [ ] o.a.s.u.DirectUpdateHandler2 end_commit_flush
[junit4] 2> 911589 INFO (searcherExecutor-3095-thread-1) [ ] o.a.s.h.c.SpellCheckComponent Building spell index for spell checker: default
[junit4] 2> 911633 INFO (searcherExecutor-3095-thread-1) [ ] o.a.s.h.c.SpellCheckComponent Building spell index for spell checker: default_teststop
[junit4] 2> 911720 INFO (searcherExecutor-3095-thread-1) [ ] o.a.s.h.c.SpellCheckComponent Building spell index for spell checker: threshold
[junit4] 2> 911816 INFO (searcherExecutor-3095-thread-1) [ ] o.a.s.h.c.SpellCheckComponent Building spell index for spell checker: threshold_direct
[junit4] 2> 911816 INFO (searcherExecutor-3095-thread-1) [ ] o.a.s.h.c.SpellCheckComponent Building spell index for spell checker: multipleFields
[junit4] 2> 911893 INFO (searcherExecutor-3095-thread-1) [ ] o.a.s.h.c.SpellCheckComponent Building spell index for spell checker: freq
[junit4] 2> 911965 INFO (searcherExecutor-3095-thread-1) [ ] o.a.s.h.c.SpellCheckComponent Building spell index for spell checker: fqcn
[junit4] 2> 912015 INFO (searcherExecutor-3095-thread-1) [ ] o.a.s.c.SolrCore [collection1] Registered new searcher Searcher@7232ae46[collection1] main{ExitableDirectoryReader(UninvertingDirectoryReader())}
[junit4] 2> 912016 INFO (TEST-SpellCheckComponentTest.testRebuildOnCommit-seed#[A019F8A4CD8BDC18]) [ ] o.a.s.u.p.LogUpdateProcessorFactory [collection1] webapp=null path=null params={}{commit=} 0 426
[junit4] 2> 912017 INFO (TEST-SpellCheckComponentTest.testPerDictionary-seed#[A019F8A4CD8BDC18]) [ ] o.a.s.SolrTestCaseJ4 ###Starting testPerDictionary
[junit4] 2> 912018 INFO (TEST-SpellCheckComponentTest.testPerDictionary-seed#[A019F8A4CD8BDC18]) [ ] o.a.s.u.p.LogUpdateProcessorFactory [collection1] webapp=null path=null params={}{add=[0]} 0 0
[junit4] 2> 912018 INFO (TEST-SpellCheckComponentTest.testPerDictionary-seed#[A019F8A4CD8BDC18]) [ ] o.a.s.u.p.LogUpdateProcessorFactory [collection1] webapp=null path=null params={}{add=[1]} 0 0
[junit4] 2> 912018 INFO (TEST-SpellCheckComponentTest.testPerDictionary-seed#[A019F8A4CD8BDC18]) [ ] o.a.s.u.p.LogUpdateProcessorFactory [collection1] webapp=null path=null params={}{add=[2]} 0 0
[junit4] 2> 912019 INFO (TEST-SpellCheckComponentTest.testPerDictionary-seed#[A019F8A4CD8BDC18]) [ ] o.a.s.u.p.LogUpdateProcessorFactory [collection1] webapp=null path=null params={}{add=[3]} 0 0
[junit4] 2> 912019 INFO (TEST-SpellCheckComponentTest.testPerDictionary-seed#[A019F8A4CD8BDC18]) [ ] o.a.s.u.p.LogUpdateProcessorFactory [collection1] webapp=null path=null params={}{add=[4]} 0 0
[junit4] 2> 912019 INFO (TEST-SpellCheckComponentTest.testPerDictionary-seed#[A019F8A4CD8BDC18]) [ ] o.a.s.u.p.LogUpdateProcessorFactory [collection1] webapp=null path=null params={}{add=[5]} 0 0
[junit4] 2> 912019 INFO (TEST-SpellCheckComponentTest.testPerDictionary-seed#[A019F8A4CD8BDC18]) [ ] o.a.s.u.p.LogUpdateProcessorFactory [collection1] webapp=null path=null params={}{add=[6]} 0 0
[junit4] 2> 912020 INFO (TEST-SpellCheckComponentTest.testPerDictionary-seed#[A019F8A4CD8BDC18]) [ ] o.a.s.u.p.LogUpdateProcessorFactory [collection1] webapp=null path=null params={}{add=[7]} 0 0
[junit4] 2> 912020 INFO (TEST-SpellCheckComponentTest.testPerDictionary-seed#[A019F8A4CD8BDC18]) [ ] o.a.s.u.p.LogUpdateProcessorFactory [collection1] webapp=null path=null params={}{add=[8]} 0 0
[junit4] 2> 912020 INFO (TEST-SpellCheckComponentTest.testPerDictionary-seed#[A019F8A4CD8BDC18]) [ ] o.a.s.u.p.LogUpdateProcessorFactory [collection1] webapp=null path=null params={}{add=[9]} 0 0
[junit4] 2> 912020 INFO (TEST-SpellCheckComponentTest.testPerDictionary-seed#[A019F8A4CD8BDC18]) [ ] o.a.s.u.DirectUpdateHandler2 start commit{,optimize=false,openSearcher=true,waitSearcher=true,expungeDeletes=false,softCommit=false,prepareCommit=false}
[junit4] 2> 912020 INFO (TEST-SpellCheckComponentTest.testPerDictionary-seed#[A019F8A4CD8BDC18]) [ ] o.a.s.u.SolrIndexWriter Calling setCommitData with IW:org.apache.solr.update.SolrIndexWriter@554c97b5
[junit4] 2> 912022 INFO (TEST-SpellCheckComponentTest.testPerDictionary-seed#[A019F8A4CD8BDC18]) [ ] o.a.s.s.SolrIndexSearcher Opening [Searcher@77a0f537[collection1] main]
[junit4] 2> 912022 INFO (TEST-SpellCheckComponentTest.testPerDictionary-seed#[A019F8A4CD8BDC18]) [ ] o.a.s.u.DirectUpdateHandler2 end_commit_flush
[junit4] 2> 912022 INFO (searcherExecutor-3095-thread-1) [ ] o.a.s.h.c.SpellCheckComponent Building spell index for spell checker: default
[junit4] 2> 912183 INFO (searcherExecutor-3095-thread-1) [ ] o.a.s.h.c.SpellCheckComponent Building spell index for spell checker: default_teststop
[junit4] 2> 912231 INFO (searcherExecutor-3095-thread-1) [ ] o.a.s.h.c.SpellCheckComponent Building spell index for spell checker: threshold
[junit4] 2> 912343 INFO (searcherExecutor-3095-thread-1) [ ] o.a.s.h.c.SpellCheckComponent Building spell index for spell checker: threshold_direct
[junit4] 2> 912343 INFO (searcherExecutor-3095-thread-1) [ ] o.a.s.h.c.SpellCheckComponent Building spell index for spell checker: multipleFields
[junit4] 2> 912491 INFO (searcherExecutor-3095-thread-1) [ ] o.a.s.h.c.SpellCheckComponent Building spell index for spell checker: freq
[junit4] 2> 912650 INFO (searcherExecutor-3095-thread-1) [ ] o.a.s.h.c.SpellCheckComponent Building spell index for spell checker: fqcn
[junit4] 2> 912745 INFO (searcherExecutor-3095-thread-1) [ ] o.a.s.c.SolrCore [collection1] Registered new searcher Searcher@77a0f537[collection1] main{ExitableDirectoryReader(UninvertingDirectoryReader(Uninverting(_3(6.3.0):c10)))}
[junit4] 2> 912746 INFO (TEST-SpellCheckComponentTest.testPerDictionary-seed#[A019F8A4CD8BDC18]) [ ] o.a.s.u.p.LogUpdateProcessorFactory [collection1] webapp=null path=null params={}{commit=} 0 725
[junit4] 2> 912746 INFO (TEST-SpellCheckComponentTest.testPerDictionary-seed#[A019F8A4CD8BDC18]) [ ] o.a.s.c.S.Request [collection1] webapp=null path=null params={q=documemt&qt=spellCheckCompRH&spellcheck.dictionary=perDict&json.nl=map&spellcheck..perDict.foo=bar&spellcheck=true&spellcheck..perDict.bar=foo&wt=xml&spellcheck.build=true} hits=0 status=0 QTime=0
[junit4] 2> 912747 INFO (TEST-SpellCheckComponentTest.testPerDictionary-seed#[A019F8A4CD8BDC18]) [ ] o.a.s.SolrTestCaseJ4 ###Ending testPerDictionary
[junit4] 2> 912747 INFO (TEST-SpellCheckComponentTest.testPerDictionary-seed#[A019F8A4CD8BDC18]) [ ] o.a.s.u.DirectUpdateHandler2 [collection1] REMOVING ALL DOCUMENTS FROM INDEX
[junit4] 2> 912747 INFO (TEST-SpellCheckComponentTest.testPerDictionary-seed#[A019F8A4CD8BDC18]) [ ] o.a.s.u.p.LogUpdateProcessorFactory [collection1] webapp=null path=null params={}{deleteByQuery=*:*} 0 0
[junit4] 2> 912747 INFO (TEST-SpellCheckComponentTest.testPerDictionary-seed#[A019F8A4CD8BDC18]) [ ] o.a.s.u.DirectUpdateHandler2 start commit{,optimize=false,openSearcher=true,waitSearcher=true,expungeDeletes=false,softCommit=false,prepareCommit=false}
[junit4] 2> 912747 INFO (TEST-SpellCheckComponentTest.testPerDictionary-seed#[A019F8A4CD8BDC18]) [ ] o.a.s.u.SolrIndexWriter Calling setCommitData with IW:org.apache.solr.update.SolrIndexWriter@554c97b5
[junit4] 2> 912747 INFO (TEST-SpellCheckComponentTest.testPerDictionary-seed#[A019F8A4CD8BDC18]) [ ] o.a.s.s.SolrIndexSearcher Opening [Searcher@305dc995[collection1] main]
[junit4] 2> 912748 INFO (TEST-SpellCheckComponentTest.testPerDictionary-seed#[A019F8A4CD8BDC18]) [ ] o.a.s.u.DirectUpdateHandler2 end_commit_flush
[junit4] 2> 912748 INFO (searcherExecutor-3095-thread-1) [ ] o.a.s.h.c.SpellCheckComponent Building spell index for spell checker: default
[junit4] 2> 912789 INFO (searcherExecutor-3095-thread-1) [ ] o.a.s.h.c.SpellCheckComponent Building spell index for spell checker: default_teststop
[junit4] 2> 912821 INFO (searcherExecutor-3095-thread-1) [ ] o.a.s.h.c.SpellCheckComponent Building spell index for spell checker: threshold
[junit4] 2> 912856 INFO (searcherExecutor-3095-thread-1) [ ] o.a.s.h.c.SpellCheckComponent Building spell index for spell checker: threshold_direct
[junit4] 2> 912856 INFO (searcherExecutor-3095-thread-1) [ ] o.a.s.h.c.SpellCheckComponent Building spell index for spell checker: multipleFields
[junit4] 2> 912926 INFO (searcherExecutor-3095-thread-1) [ ] o.a.s.h.c.SpellCheckComponent Building spell index for spell checker: freq
[junit4] 2> 912968 INFO (searcherExecutor-3095-thread-1) [ ] o.a.s.h.c.SpellCheckComponent Building spell index for spell checker: fqcn
[junit4] 2> 913049 INFO (searcherExecutor-3095-thread-1) [ ] o.a.s.c.SolrCore [collection1] Registered new searcher Searcher@305dc995[collection1] main{ExitableDirectoryReader(UninvertingDirectoryReader())}
[junit4] 2> 913049 INFO (TEST-SpellCheckComponentTest.testPerDictionary-seed#[A019F8A4CD8BDC18]) [ ] o.a.s.u.p.LogUpdateProcessorFactory [collection1] webapp=null path=null params={}{commit=} 0 302
[junit4] 2> 913051 INFO (TEST-SpellCheckComponentTest.testCollate-seed#[A019F8A4CD8BDC18]) [ ] o.a.s.SolrTestCaseJ4 ###Starting testCollate
[junit4] 2> 913051 INFO (TEST-SpellCheckComponentTest.testCollate-seed#[A019F8A4CD8BDC18]) [ ] o.a.s.u.p.LogUpdateProcessorFactory [collection1] webapp=null path=null params={}{add=[0]} 0 0
[junit4] 2> 913052 INFO (TEST-SpellCheckComponentTest.testCollate-seed#[A019F8A4CD8BDC18]) [ ] o.a.s.u.p.LogUpdateProcessorFactory [collection1] webapp=null path=null params={}{add=[1]} 0 0
[junit4] 2> 913052 INFO (TEST-SpellCheckComponentTest.testCollate-seed#[A019F8A4CD8BDC18]) [ ] o.a.s.u.p.LogUpdateProcessorFactory [collection1] webapp=null path=null params={}{add=[2]} 0 0
[junit4] 2> 913052 INFO (TEST-SpellCheckComponentTest.testCollate-seed#[A019F8A4CD8BDC18]) [ ] o.a.s.u.p.LogUpdateProcessorFactory [collection1] webapp=null path=null params={}{add=[3]} 0 0
[junit4] 2> 913052 INFO (TEST-SpellCheckComponentTest.testCollate-seed#[A019F8A4CD8BDC18]) [ ] o.a.s.u.p.LogUpdateProcessorFactory [collection1] webapp=null path=null params={}{add=[4]} 0 0
[junit4] 2> 913053 INFO (TEST-SpellCheckComponentTest.testCollate-seed#[A019F8A4CD8BDC18]) [ ] o.a.s.u.p.LogUpdateProcessorFactory [collection1] webapp=null path=null params={}{add=[5]} 0 0
[junit4] 2> 913053 INFO (TEST-SpellCheckComponentTest.testCollate-seed#[A019F8A4CD8BDC18]) [ ] o.a.s.u.p.LogUpdateProcessorFactory [collection1] webapp=null path=null params={}{add=[6]} 0 0
[junit4] 2> 913053 INFO (TEST-SpellCheckComponentTest.testCollate-seed#[A019F8A4CD8BDC18]) [ ] o.a.s.u.p.LogUpdateProcessorFactory [collection1] webapp=null path=null params={}{add=[7]} 0 0
[junit4] 2> 913053 INFO (TEST-SpellCheckComponentTest.testCollate-seed#[A019F8A4CD8BDC18]) [ ] o.a.s.u.p.LogUpdateProcessorFactory [collection1] webapp=null path=null params={}{add=[8]} 0 0
[junit4] 2> 913053 INFO (TEST-SpellCheckComponentTest.testCollate-seed#[A019F8A4CD8BDC18]) [ ] o.a.s.u.p.LogUpdateProcessorFactory [collection1] webapp=null path=null params={}{add=[9]} 0 0
[junit4] 2> 913054 INFO (TEST-SpellCheckComponentTest.testCollate-seed#[A019F8A4CD8BDC18]) [ ] o.a.s.u.DirectUpdateHandler2 start commit{,optimize=false,openSearcher=true,waitSearcher=true,expungeDeletes=false,softCommit=false,prepareCommit=false}
[junit4] 2> 913054 INFO (TEST-SpellCheckComponentTest.testCollate-seed#[A019F8A4CD8BDC18]) [ ] o.a.s.u.SolrIndexWriter Calling setCommitData with IW:org.apache.solr.update.SolrIndexWriter@554c97b5
[junit4] 2> 913056 INFO (TEST-SpellCheckComponentTest.testCollate-seed#[A019F8A4CD8BDC18]) [ ] o.a.s.s.SolrIndexSearcher Opening [Searcher@51a7869b[collection1] main]
[junit4] 2> 913056 INFO (TEST-SpellCheckComponentTest.testCollate-seed#[A019F8A4CD8BDC18]) [ ] o.a.s.u.DirectUpdateHandler2 end_commit_flush
[junit4] 2> 913056 INFO (searcherExecutor-3095-thread-1) [ ] o.a.s.h.c.SpellCheckComponent Building spell index for spell checker: default
[junit4] 2> 913171 INFO (searcherExecutor-3095-thread-1) [ ] o.a.s.h.c.SpellCheckComponent Building spell index for spell checker: default_teststop
[junit4] 2> 913230 INFO (searcherExecutor-3095-thread-1) [ ] o.a.s.h.c.SpellCheckComponent Building spell index for spell checker: threshold
[junit4] 2> 913379 INFO (searcherExecutor-3095-thread-1) [ ] o.a.s.h.c.SpellCheckComponent Building spell index for spell checker: threshold_direct
[junit4] 2> 913379 INFO (searcherExecutor-3095-thread-1) [ ] o.a.s.h.c.SpellCheckComponent Building spell index for spell checker: multipleFields
[junit4] 2> 913527 INFO (searcherExecutor-3095-thread-1) [ ] o.a.s.h.c.SpellCheckComponent Building spell index for spell checker: freq
[junit4] 2> 913690 INFO (searcherExecutor-3095-thread-1) [ ] o.a.s.h.c.SpellCheckComponent Building spell index for spell checker: fqcn
[junit4] 2> 913821 INFO (searcherExecutor-3095-thread-1) [ ] o.a.s.c.SolrCore [collection1] Registered new searcher Searcher@51a7869b[collection1] main{ExitableDirectoryReader(UninvertingDirectoryReader(Uninverting(_4(6.3.0):c10)))}
[junit4] 2> 913821 INFO (TEST-SpellCheckComponentTest.testCollate-seed#[A019F8A4CD8BDC18]) [ ] o.a.s.u.p.LogUpdateProcessorFactory [collection1] webapp=null path=null params={}{commit=} 0 767
[junit4] 2> 913945 INFO (TEST-SpellCheckComponentTest.testCollate-seed#[A019F8A4CD8BDC18]) [ ] o.a.s.c.S.Request [collection1] webapp=null path=null params={q=documemt&qt=spellCheckCompRH&json.nl=map&spellcheck=true&wt=xml&spellcheck.build=true&spellcheck.collate=true} hits=0 status=0 QTime=123
[junit4] 2> 913946 INFO (TEST-SpellCheckComponentTest.testCollate-seed#[A019F8A4CD8BDC18]) [ ] o.a.s.c.S.Request [collection1] webapp=null path=null params={q=documemt+lowerfilt:broen^4&qt=spellCheckCompRH&json.nl=map&spellcheck=true&wt=xml&spellcheck.collate=true} hits=0 status=0 QTime=0
[junit4] 2> 913947 INFO (TEST-SpellCheckComponentTest.testCollate-seed#[A019F8A4CD8BDC18]) [ ] o.a.s.c.S.Request [collection1] webapp=null path=null params={q=documemtsss+broens&qt=spellCheckCompRH&json.nl=map&spellcheck=true&wt=xml&spellcheck.collate=true} hits=0 status=0 QTime=0
[junit4] 2> 913948 INFO (TEST-SpellCheckComponentTest.testCollate-seed#[A019F8A4CD8BDC18]) [ ] o.a.s.c.S.Request [collection1] webapp=null path=null params={q=pixma&qt=spellCheckCompRH&json.nl=map&spellcheck=true&wt=xml&spellcheck.collate=true} hits=0 status=0 QTime=0
[junit4] 2> 913948 INFO (TEST-SpellCheckComponentTest.testCollate-seed#[A019F8A4CD8BDC18]) [ ] o.a.s.SolrTestCaseJ4 ###Ending testCollate
[junit4] 2> 913948 INFO (TEST-SpellCheckComponentTest.testCollate-seed#[A019F8A4CD8BDC18]) [ ] o.a.s.u.DirectUpdateHandler2 [collection1] REMOVING ALL DOCUMENTS FROM INDEX
[junit4] 2> 913948 INFO (TEST-SpellCheckComponentTest.testCollate-seed#[A019F8A4CD8BDC18]) [ ] o.a.s.u.p.LogUpdateProcessorFactory [collection1] webapp=null path=null params={}{deleteByQuery=*:*} 0 0
[junit4] 2> 913948 INFO (TEST-SpellCheckComponentTest.testCollate-seed#[A019F8A4CD8BDC18]) [ ] o.a.s.u.DirectUpdateHandler2 start commit{,optimize=false,openSearcher=true,waitSearcher=true,expungeDeletes=false,softCommit=false,prepareCommit=false}
[junit4] 2> 913948 INFO (TEST-SpellCheckComponentTest.testCollate-seed#[A019F8A4CD8BDC18]) [ ] o.a.s.u.SolrIndexWriter Calling setCommitData with IW:org.apache.solr.update.SolrIndexWriter@554c97b5
[junit4] 2> 913948 INFO (TEST-SpellCheckComponentTest.testCollate-seed#[A019F8A4CD8BDC18]) [ ] o.a.s.s.SolrIndexSearcher Opening [Searcher@4fd11a15[collection1] main]
[junit4] 2> 913949 INFO (TEST-SpellCheckComponentTest.testCollate-seed#[A019F8A4CD8BDC18]) [ ] o.a.s.u.DirectUpdateHandler2 end_commit_flush
[junit4] 2> 913949 INFO (searcherExecutor-3095-thread-1) [ ] o.a.s.h.c.SpellCheckComponent Building spell index for spell checker: default
[junit4] 2> 913990 INFO (searcherExecutor-3095-thread-1) [ ] o.a.s.h.c.SpellCheckComponent Building spell index for spell checker: default_teststop
[junit4] 2> 914024 INFO (searcherExecutor-3095-thread-1) [ ] o.a.s.h.c.SpellCheckComponent Building spell index for spell checker: threshold
[junit4] 2> 914089 INFO (searcherExecutor-3095-thread-1) [ ] o.a.s.h.c.SpellCheckComponent Building spell index for spell checker: threshold_direct
[junit4] 2> 914089 INFO (searcherExecutor-3095-thread-1) [ ] o.a.s.h.c.SpellCheckComponent Building spell index for spell checker: multipleFields
[junit4] 2> 914144 INFO (searcherExecutor-3095-thread-1) [ ] o.a.s.h.c.SpellCheckComponent Building spell index for spell checker: freq
[junit4] 2> 914204 INFO (searcherExecutor-3095-thread-1) [ ] o.a.s.h.c.SpellCheckComponent Building spell index for spell checker: fqcn
[junit4] 2> 914250 INFO (searcherExecutor-3095-thread-1) [ ] o.a.s.c.SolrCore [collection1] Registered new searcher Searcher@4fd11a15[collection1] main{ExitableDirectoryReader(UninvertingDirectoryReader())}
[junit4] 2> 914250 INFO (TEST-SpellCheckComponentTest.testCollate-seed#[A019F8A4CD8BDC18]) [ ] o.a.s.u.p.LogUpdateProcessorFactory [collection1] webapp=null path=null params={}{commit=} 0 302
[junit4] 2> 914251 INFO (TEST-SpellCheckComponentTest.testExtendedResultsCount-seed#[A019F8A4CD8BDC18]) [ ] o.a.s.SolrTestCaseJ4 ###Starting testExtendedResultsCount
[junit4] 2> 914252 INFO (TEST-SpellCheckComponentTest.testExtendedResultsCount-seed#[A019F8A4CD8BDC18]) [ ] o.a.s.u.p.LogUpdateProcessorFactory [collection1] webapp=null path=null params={}{add=[0]} 0 0
[junit4] 2> 914252 INFO (TEST-SpellCheckComponentTest.testExtendedResultsCount-seed#[A019F8A4CD8BDC18]) [ ] o.a.s.u.p.LogUpdateProcessorFactory [collection1] webapp=null path=null params={}{add=[1]} 0 0
[junit4] 2> 914252 INFO (TEST-SpellCheckComponentTest.testExtendedResultsCount-seed#[A019F8A4CD8BDC18]) [ ] o.a.s.u.p.LogUpdateProcessorFactory [collection1] webapp=null path=null params={}{add=[2]} 0 0
[junit4] 2> 914253 INFO (TEST-SpellCheckComponentTest.testExtendedResultsCount-seed#[A019F8A4CD8BDC18]) [ ] o.a.s.u.p.LogUpdateProcessorFactory [collection1] webapp=null path=null params={}{add=[3]} 0 0
[junit4] 2> 914253 INFO (TEST-SpellCheckComponentTest.testExtendedResultsCount-seed#[A019F8A4CD8BDC18]) [ ] o.a.s.u.p.LogUpdateProcessorFactory [collection1] webapp=null path=null params={}{add=[4]} 0 0
[junit4] 2> 914253 INFO (TEST-SpellCheckComponentTest.testExtendedResultsCount-seed#[A019F8A4CD8BDC18]) [ ] o.a.s.u.p.LogUpdateProcessorFactory [collection1] webapp=null path=null params={}{add=[5]} 0 0
[junit4] 2> 914253 INFO (TEST-SpellCheckComponentTest.testExtendedResultsCount-seed#[A019F8A4CD8BDC18]) [ ] o.a.s.u.p.LogUpdateProcessorFactory [collection1] webapp=null path=null params={}{add=[6]} 0 0
[junit4] 2> 914254 INFO (TEST-SpellCheckComponentTest.testExtendedResultsCount-seed#[A019F8A4CD8BDC18]) [ ] o.a.s.u.p.LogUpdateProcessorFactory [collection1] webapp=null path=null params={}{add=[7]} 0 0
[junit4] 2> 914254 INFO (TEST-SpellCheckComponentTest.testExtendedResultsCount-seed#[A019F8A4CD8BDC18]) [ ] o.a.s.u.p.LogUpdateProcessorFactory [collection1] webapp=null path=null params={}{add=[8]} 0 0
[junit4] 2> 914254 INFO (TEST-SpellCheckComponentTest.testExtendedResultsCount-seed#[A019F8A4CD8BDC18]) [ ] o.a.s.u.p.LogUpdateProcessorFactory [collection1] webapp=null path=null params={}{add=[9]} 0 0
[junit4] 2> 914254 INFO (TEST-SpellCheckComponentTest.testExtendedResultsCount-seed#[A019F8A4CD8BDC18]) [ ] o.a.s.u.DirectUpdateHandler2 start commit{,optimize=false,openSearcher=true,waitSearcher=true,expungeDeletes=false,softCommit=false,prepareCommit=false}
[junit4] 2> 914254 INFO (TEST-SpellCheckComponentTest.testExtendedResultsCount-seed#[A019F8A4CD8BDC18]) [ ] o.a.s.u.SolrIndexWriter Calling setCommitData with IW:org.apache.solr.update.SolrIndexWriter@554c97b5
[junit4] 2> 914257 INFO (TEST-SpellCheckComponentTest.testExtendedResultsCount-seed#[A019F8A4CD8BDC18]) [ ] o.a.s.s.SolrIndexSearcher Opening [Searcher@4768e839[collection1] main]
[junit4] 2> 914257 INFO (TEST-SpellCheckComponentTest.testExtendedResultsCount-seed#[A019F8A4CD8BDC18]) [ ] o.a.s.u.DirectUpdateHandler2 end_commit_flush
[junit4] 2> 914257 INFO (searcherExecutor-3095-thread-1) [ ] o.a.s.h.c.SpellCheckComponent Building spell index for spell checker: default
[junit4] 2> 914387 INFO (searcherExecutor-3095-thread-1) [ ] o.a.s.h.c.SpellCheckComponent Building spell index for spell checker: default_teststop
[junit4] 2> 914466 INFO (searcherExecutor-3095-thread-1) [ ] o.a.s.h.c.SpellCheckComponent Building spell index for spell checker: threshold
[junit4] 2> 914579 INFO (searcherExecutor-3095-thread-1) [ ] o.a.s.h.c.SpellCheckComponent Building spell index for spell checker: threshold_direct
[junit4] 2> 914579 INFO (searcherExecutor-3095-thread-1) [ ] o.a.s.h.c.SpellCheckComponent Building spell index for spell checker: multipleFields
[junit4] 2> 914749 INFO (searcherExecutor-3095-thread-1) [ ] o.a.s.h.c.SpellCheckComponent Building spell index for spell checker: freq
[junit4] 2> 914887 INFO (searcherExecutor-3095-thread-1) [ ] o.a.s.h.c.SpellCheckComponent Building spell index for spell checker: fqcn
[junit4] 2> 915044 INFO (searcherExecutor-3095-thread-1) [ ] o.a.s.c.SolrCore [collection1] Registered new searcher Searcher@4768e839[collection1] main{ExitableDirectoryReader(UninvertingDirectoryReader(Uninverting(_5(6.3.0):c10)))}
[junit4] 2> 915044 INFO (TEST-SpellCheckComponentTest.testExtendedResultsCount-seed#[A019F8A4CD8BDC18]) [ ] o.a.s.u.p.LogUpdateProcessorFactory [collection1] webapp=null path=null params={}{commit=} 0 790
[junit4] 2> 915217 INFO (TEST-SpellCheckComponentTest.testExtendedResultsCount-seed#[A019F8A4CD8BDC18]) [ ] o.a.s.c.S.Request [collection1] webapp=null path=null params={q=bluo&qt=spellCheckCompRH&spellcheck=true&spellcheck.count=5&wt=xml&spellcheck.build=true&spellcheck.extendedResults=false} hits=0 status=0 QTime=172
[junit4] 2> 915218 INFO (TEST-SpellCheckComponentTest.testExtendedResultsCount-seed#[A019F8A4CD8BDC18]) [ ] o.a.s.c.S.Request [collection1] webapp=null path=null params={q=bluo&qt=spellCheckCompRH&spellcheck=true&spellcheck.count=3&wt=xml&spellcheck.extendedResults=true} hits=0 status=0 QTime=0
[junit4] 2> 915218 INFO (TEST-SpellCheckComponentTest.testExtendedResultsCount-seed#[A019F8A4CD8BDC18]) [ ] o.a.s.SolrTestCaseJ4 ###Ending testExtendedResultsCount
[junit4] 2> 915218 INFO (TEST-SpellCheckComponentTest.testExtendedResultsCount-seed#[A019F8A4CD8BDC18]) [ ] o.a.s.u.DirectUpdateHandler2 [collection1] REMOVING ALL DOCUMENTS FROM INDEX
[junit4] 2> 915218 INFO (TEST-SpellCheckComponentTest.testExtendedResultsCount-seed#[A019F8A4CD8BDC18]) [ ] o.a.s.u.p.LogUpdateProcessorFactory [collection1] webapp=null path=null params={}{deleteByQuery=*:*} 0 0
[junit4] 2> 915219 INFO (TEST-SpellCheckComponentTest.testExtendedResultsCount-seed#[A019F8A4CD8BDC18]) [ ] o.a.s.u.DirectUpdateHandler2 start commit{,optimize=false,openSearcher=true,waitSearcher=true,expungeDeletes=false,softCommit=false,prepareCommit=false}
[junit4] 2> 915219 INFO (TEST-SpellCheckComponentTest.testExtendedResultsCount-seed#[A019F8A4CD8BDC18]) [ ] o.a.s.u.SolrIndexWriter Calling setCommitData with IW:org.apache.solr.update.SolrIndexWriter@554c97b5
[junit4] 2> 915219 INFO (TEST-SpellCheckComponentTest.testExtendedResultsCount-seed#[A019F8A4CD8BDC18]) [ ] o.a.s.s.SolrIndexSearcher Opening [Searcher@5a16f51a[collection1] main]
[junit4] 2> 915219 INFO (TEST-SpellCheckComponentTest.testExtendedResultsCount-seed#[A019F8A4CD8BDC18]) [ ] o.a.s.u.DirectUpdateHandler2 end_commit_flush
[junit4] 2> 915219 INFO (searcherExecutor-3095-thread-1) [ ] o.a.s.h.c.SpellCheckComponent Building spell index for spell checker: default
[junit4] 2> 915287 INFO (searcherExecutor-3095-thread-1) [ ] o.a.s.h.c.SpellCheckComponent Building spell index for spell checker: default_teststop
[junit4] 2> 915350 INFO (searcherExecutor-3095-thread-1) [ ] o.a.s.h.c.SpellCheckComponent Building spell index for spell checker: threshold
[junit4] 2> 915408 INFO (searcherExecutor-3095-thread-1) [ ] o.a.s.h.c.SpellCheckComponent Building spell index for spell checker: threshold_direct
[junit4] 2> 915408 INFO (searcherExecutor-3095-thread-1) [ ] o.a.s.h.c.SpellCheckComponent Building spell index for spell checker: multipleFields
[junit4] 2> 915483 INFO (searcherExecutor-3095-thread-1) [ ] o.a.s.h.c.SpellCheckComponent Building spell index for spell checker: freq
[junit4] 2> 915534 INFO (searcherExecutor-3095-thread-1) [ ] o.a.s.h.c.SpellCheckComponent Building spell index for spell checker: fqcn
[junit4] 2> 915585 INFO (searcherExecutor-3095-thread-1) [ ] o.a.s.c.SolrCore [collection1] Registered new searcher Searcher@5a16f51a[collection1] main{ExitableDirectoryReader(UninvertingDirectoryReader())}
[junit4] 2> 915585 INFO (TEST-SpellCheckComponentTest.testExtendedResultsCount-seed#[A019F8A4CD8BDC18]) [ ] o.a.s.u.p.LogUpdateProcessorFactory [collection1] webapp=null path=null params={}{commit=} 0 366
[junit4] 2> 915587 INFO (TEST-SpellCheckComponentTest.testNumericQuery-seed#[A019F8A4CD8BDC18]) [ ] o.a.s.SolrTestCaseJ4 ###Starting testNumericQuery
[junit4] 2> 915588 INFO (TEST-SpellCheckComponentTest.testNumericQuery-seed#[A019F8A4CD8BDC18]) [ ] o.a.s.u.p.LogUpdateProcessorFactory [collection1] webapp=null path=null params={}{add=[0]} 0 1
[junit4] 2> 915588 INFO (TEST-SpellCheckComponentTest.testNumericQuery-seed#[A019F8A4CD8BDC18]) [ ] o.a.s.u.p.LogUpdateProcessorFactory [collection1] webapp=null path=null params={}{add=[1]} 0 0
[junit4] 2> 915589 INFO (TEST-SpellCheckComponentTest.testNumericQuery-seed#[A019F8A4CD8BDC18]) [ ] o.a.s.u.p.LogUpdateProcessorFactory [collection1] webapp=null path=null params={}{add=[2]} 0 0
[junit4] 2> 915589 INFO (TEST-SpellCheckComponentTest.testNumericQuery-seed#[A019F8A4CD8BDC18]) [ ] o.a.s.u.p.LogUpdateProcessorFactory [collection1] webapp=null path=null params={}{add=[3]} 0 0
[junit4] 2> 915589 INFO (TEST-SpellCheckComponentTest.testNumericQuery-seed#[A019F8A4CD8BDC18]) [ ] o.a.s.u.p.LogUpdateProcessorFactory [collection1] webapp=null path=null params={}{add=[4]} 0 0
[junit4] 2> 915589 INFO (TEST-SpellCheckComponentTest.testNumericQuery-seed#[A019F8A4CD8BDC18]) [ ] o.a.s.u.p.LogUpdateProcessorFactory [collection1] webapp=null path=null params={}{add=[5]} 0 0
[junit4] 2> 915590 INFO (TEST-SpellCheckComponentTest.testNumericQuery-seed#[A019F8A4CD8BDC18]) [ ] o.a.s.u.p.LogUpdateProcessorFactory [collection1] webapp=null path=null params={}{add=[6]} 0 0
[junit4] 2> 915590 INFO (TEST-SpellCheckComponentTest.testNumericQuery-seed#[A019F8A4CD8BDC18]) [ ] o.a.s.u.p.LogUpdateProcessorFactory [collection1] webapp=null path=null params={}{add=[7]} 0 0
[junit4] 2> 915590 INFO (TEST-SpellCheckComponentTest.testNumericQuery-seed#[A019F8A4CD8BDC18]) [ ] o.a.s.u.p.LogUpdateProcessorFactory [collection1] webapp=null path=null params={}{add=[8]} 0 0
[junit4] 2> 915590 INFO (TEST-SpellCheckComponentTest.testNumericQuery-seed#[A019F8A4CD8BDC18]) [ ] o.a.s.u.p.LogUpdateProcessorFactory [collection1] webapp=null path=null params={}{add=[9]} 0 0
[junit4] 2> 915590 INFO (TEST-SpellCheckComponentTest.testNumericQuery-seed#[A019F8A4CD8BDC18]) [ ] o.a.s.u.DirectUpdateHandler2 start commit{,optimize=false,openSearcher=true,waitSearcher=true,expungeDeletes=false,softCommit=false,prepareCommit=false}
[junit4] 2> 915591 INFO (TEST-SpellCheckComponentTest.testNumericQuery-seed#[A019F8A4CD8BDC18]) [ ] o.a.s.u.SolrIndexWriter Calling setCommitData with IW:org.apache.solr.update.SolrIndexWriter@554c97b5
[junit4] 2> 915593 INFO (TEST-SpellCheckComponentTest.testNumericQuery-seed#[A019F8A4CD8BDC18]) [ ] o.a.s.s.SolrIndexSearcher Opening [Searcher@268ecb44[collection1] main]
[junit4] 2> 915593 INFO (TEST-SpellCheckComponentTest.testNumericQuery-seed#[A019F8A4CD8BDC18]) [ ] o.a.s.u.DirectUpdateHandler2 end_commit_flush
[junit4] 2> 915593 INFO (searcherExecutor-3095-thread-1) [ ] o.a.s.h.c.SpellCheckComponent Building spell index for spell checker: default
[junit4] 2> 915778 INFO (searcherExecutor-3095-thread-1) [ ] o.a.s.h.c.SpellCheckComponent Building spell index for spell checker: default_teststop
[junit4] 2> 915843 INFO (searcherExecutor-3095-thread-1) [ ] o.a.s.h.c.SpellCheckComponent Building spell index for spell checker: threshold
[junit4] 2> 915983 INFO (searcherExecutor-3095-thread-1) [ ] o.a.s.h.c.SpellCheckComponent Building spell index for spell checker: threshold_direct
[junit4] 2> 915983 INFO (searcherExecutor-3095-thread-1) [ ] o.a.s.h.c.SpellCheckComponent Building spell index for spell checker: multipleFields
[junit4] 2> 916160 INFO (searcherExecutor-3095-thread-1) [ ] o.a.s.h.c.SpellCheckComponent Building spell index for spell checker: freq
[junit4] 2> 916328 INFO (searcherExecutor-3095-thread-1) [ ] o.a.s.h.c.SpellCheckComponent Building spell index for spell checker: fqcn
[junit4] 2> 916447 INFO (searcherExecutor-3095-thread-1) [ ] o.a.s.c.SolrCore [collection1] Registered new searcher Searcher@268ecb44[collection1] main{ExitableDirectoryReader(UninvertingDirectoryReader(Uninverting(_6(6.3.0):c10)))}
[junit4] 2> 916447 INFO (TEST-SpellCheckComponentTest.testNumericQuery-seed#[A019F8A4CD8BDC18]) [ ] o.a.s.u.p.LogUpdateProcessorFactory [collection1] webapp=null path=null params={}{commit=} 0 856
[junit4] 2> 916448 INFO (TEST-SpellCheckComponentTest.testNumericQuery-seed#[A019F8A4CD8BDC18]) [ ] o.a.s.c.S.Request [collection1] webapp=null path=null params={q=12346&qt=spellCheckCompRH&spellcheck=true&wt=xml} hits=0 status=0 QTime=0
[junit4] 2> 916449 INFO (TEST-SpellCheckComponentTest.testNumericQuery-seed#[A019F8A4CD8BDC18]) [ ] o.a.s.SolrTestCaseJ4 ###Ending testNumericQuery
[junit4] 2> 916449 INFO (TEST-SpellCheckComponentTest.testNumericQuery-seed#[A019F8A4CD8BDC18]) [ ] o.a.s.u.DirectUpdateHandler2 [collection1] REMOVING ALL DOCUMENTS FROM INDEX
[junit4] 2> 916449 INFO (TEST-SpellCheckComponentTest.testNumericQuery-seed#[A019F8A4CD8BDC18]) [ ] o.a.s.u.p.LogUpdateProcessorFactory [collection1] webapp=null path=null params={}{deleteByQuery=*:*} 0 0
[junit4] 2> 916449 INFO (TEST-SpellCheckComponentTest.testNumericQuery-seed#[A019F8A4CD8BDC18]) [ ] o.a.s.u.DirectUpdateHandler2 start commit{,optimize=false,openSearcher=true,waitSearcher=true,expungeDeletes=false,softCommit=false,prepareCommit=false}
[junit4] 2> 916449 INFO (TEST-SpellCheckComponentTest.testNumericQuery-seed#[A019F8A4CD8BDC18]) [ ] o.a.s.u.SolrIndexWriter Calling setCommitData with IW:org.apache.solr.update.SolrIndexWriter@554c97b5
[junit4] 2> 916449 INFO (TEST-SpellCheckComponentTest.testNumericQuery-seed#[A019F8A4CD8BDC18]) [ ] o.a.s.s.SolrIndexSearcher Opening [Searcher@205ddc35[collection1] main]
[junit4] 2> 916449 INFO (TEST-SpellCheckComponentTest.testNumericQuery-seed#[A019F8A4CD8BDC18]) [ ] o.a.s.u.DirectUpdateHandler2 end_commit_flush
[junit4] 2> 916449 INFO (searcherExecutor-3095-thread-1) [ ] o.a.s.h.c.SpellCheckComponent Building spell index for spell checker: default
[junit4] 2> 916524 INFO (searcherExecutor-3095-thread-1) [ ] o.a.s.h.c.SpellCheckComponent Building spell index for spell checker: default_teststop
[junit4] 2> 916569 INFO (searcherExecutor-3095-thread-1) [ ] o.a.s.h.c.SpellCheckComponent Building spell index for spell checker: threshold
[junit4] 2> 916618 INFO (searcherExecutor-3095-thread-1) [ ] o.a.s.h.c.SpellCheckComponent Building spell index for spell checker: threshold_direct
[junit4] 2> 916618 INFO (searcherExecutor-3095-thread-1) [ ] o.a.s.h.c.SpellCheckComponent Building spell index for spell checker: multipleFields
[junit4] 2> 916667 INFO (searcherExecutor-3095-thread-1) [ ] o.a.s.h.c.SpellCheckComponent Building spell index for spell checker: freq
[junit4] 2> 916738 INFO (searcherExecutor-3095-thread-1) [ ] o.a.s.h.c.SpellCheckComponent Building spell index for spell checker: fqcn
[junit4] 2> 916822 INFO (searcherExecutor-3095-thread-1) [ ] o.a.s.c.SolrCore [collection1] Registered new searcher Searcher@205ddc35[collection1] main{ExitableDirectoryReader(UninvertingDirectoryReader())}
[junit4] 2> 916822 INFO (TEST-SpellCheckComponentTest.testNumericQuery-seed#[A019F8A4CD8BDC18]) [ ] o.a.s.u.p.LogUpdateProcessorFactory [collection1] webapp=null path=null params={}{commit=} 0 373
[junit4] 2> 916824 INFO (TEST-SpellCheckComponentTest.testThresholdTokenFrequency-seed#[A019F8A4CD8BDC18]) [ ] o.a.s.SolrTestCaseJ4 ###Starting testThresholdTokenFrequency
[junit4] 2> 916825 INFO (TEST-SpellCheckComponentTest.testThresholdTokenFrequency-seed#[A019F8A4CD8BDC18]) [ ] o.a.s.u.p.LogUpdateProcessorFactory [collection1] webapp=null path=null params={}{add=[0]} 0 0
[junit4] 2> 916825 INFO (TEST-SpellCheckComponentTest.testThresholdTokenFrequency-seed#[A019F8A4CD8BDC18]) [ ] o.a.s.u.p.LogUpdateProcessorFactory [collection1] webapp=null path=null params={}{add=[1]} 0 0
[junit4] 2> 916825 INFO (TEST-SpellCheckComponentTest.testThresholdTokenFrequency-seed#[A019F8A4CD8BDC18]) [ ] o.a.s.u.p.LogUpdateProcessorFactory [collection1] webapp=null path=null params={}{add=[2]} 0 0
[junit4] 2> 916825 INFO (TEST-SpellCheckComponentTest.testThresholdTokenFrequency-seed#[A019F8A4CD8BDC18]) [ ] o.a.s.u.p.LogUpdateProcessorFactory [collection1] webapp=null path=null params={}{add=[3]} 0 0
[junit4] 2> 916826 INFO (TEST-SpellCheckComponentTest.testThresholdTokenFrequency-seed#[A019F8A4CD8BDC18]) [ ] o.a.s.u.p.LogUpdateProcessorFactory [collection1] webapp=null path=null params={}{add=[4]} 0 0
[junit4] 2> 916826 INFO (TEST-SpellCheckComponentTest.testThresholdTokenFrequency-seed#[A019F8A4CD8BDC18]) [ ] o.a.s.u.p.LogUpdateProcessorFactory [collection1] webapp=null path=null params={}{add=[5]} 0 0
[junit4] 2> 916826 INFO (TEST-SpellCheckComponentTest.testThresholdTokenFrequency-seed#[A019F8A4CD8BDC18]) [ ] o.a.s.u.p.LogUpdateProcessorFactory [collection1] webapp=null path=null params={}{add=[6]} 0 0
[junit4] 2> 916826 INFO (TEST-SpellCheckComponentTest.testThresholdTokenFrequency-seed#[A019F8A4CD8BDC18]) [ ] o.a.s.u.p.LogUpdateProcessorFactory [collection1] webapp=null path=null params={}{add=[7]} 0 0
[junit4] 2> 916827 INFO (TEST-SpellCheckComponentTest.testThresholdTokenFrequency-seed#[A019F8A4CD8BDC18]) [ ] o.a.s.u.p.LogUpdateProcessorFactory [collection1] webapp=null path=null params={}{add=[8]} 0 0
[junit4] 2> 916827 INFO (TEST-SpellCheckComponentTest.testThresholdTokenFrequency-seed#[A019F8A4CD8BDC18]) [ ] o.a.s.u.p.LogUpdateProcessorFactory [collection1] webapp=null path=null params={}{add=[9]} 0 0
[junit4] 2> 916827 INFO (TEST-SpellCheckComponentTest.testThresholdTokenFrequency-seed#[A019F8A4CD8BDC18]) [ ] o.a.s.u.DirectUpdateHandler2 start commit{,optimize=false,openSearcher=true,waitSearcher=true,expungeDeletes=false,softCommit=false,prepareCommit=false}
[junit4] 2> 916827 INFO (TEST-SpellCheckComponentTest.testThresholdTokenFrequency-seed#[A019F8A4CD8BDC18]) [ ] o.a.s.u.SolrIndexWriter Calling setCommitData with IW:org.apache.solr.update.SolrIndexWriter@554c97b5
[junit4] 2> 916829 INFO (TEST-SpellCheckComponentTest.testThresholdTokenFrequency-seed#[A019F8A4CD8BDC18]) [ ] o.a.s.s.SolrIndexSearcher Opening [Searcher@2738d5a7[collection1] main]
[junit4] 2> 916829 INFO (TEST-SpellCheckComponentTest.testThresholdTokenFrequency-seed#[A019F8A4CD8BDC18]) [ ] o.a.s.u.DirectUpdateHandler2 end_commit_flush
[junit4] 2> 916829 INFO (searcherExecutor-3095-thread-1) [ ] o.a.s.h.c.SpellCheckComponent Building spell index for spell checker: default
[junit4] 2> 917053 INFO (searcherExecutor-3095-thread-1) [ ] o.a.s.h.c.SpellCheckComponent Building spell index for spell checker: default_teststop
[junit4] 2> 917118 INFO (searcherExecutor-3095-thread-1) [ ] o.a.s.h.c.SpellCheckComponent Building spell index for spell checker: threshold
[junit4] 2> 917275 INFO (searcherExecutor-3095-thread-1) [ ] o.a.s.h.c.SpellCheckComponent Building spell index for spell checker: threshold_direct
[junit4] 2> 917275 INFO (searcherExecutor-3095-thread-1) [ ] o.a.s.h.c.SpellCheckComponent Building spell index for spell checker: multipleFields
[junit4] 2> 917418 INFO (searcherExecutor-3095-thread-1) [ ] o.a.s.h.c.SpellCheckComponent Building spell index for spell checker: freq
[junit4] 2> 917571 INFO (searcherExecutor-3095-thread-1) [ ] o.a.s.h.c.SpellCheckComponent Building spell index for spell checker: fqcn
[junit4] 2> 917749 INFO (searcherExecutor-3095-thread-1) [ ] o.a.s.c.SolrCore [collection1] Registered new searcher Searcher@2738d5a7[collection1] main{ExitableDirectoryReader(UninvertingDirectoryReader(Uninverting(_7(6.3.0):c10)))}
[junit4] 2> 917749 INFO (TEST-SpellCheckComponentTest.testThresholdTokenFrequency-seed#[A019F8A4CD8BDC18]) [ ] o.a.s.u.p.LogUpdateProcessorFactory [collection1] webapp=null path=null params={}{commit=} 0 922
[junit4] 2> 917750 INFO (TEST-SpellCheckComponentTest.testThresholdTokenFrequency-seed#[A019F8A4CD8BDC18]) [ ] o.a.s.c.S.Request [collection1] webapp=null path=null params={q=documenq&qt=spellCheckCompRH&spellcheck.dictionary=threshold&spellcheck=true&spellcheck.count=5&wt=xml&spellcheck.extendedResults=true} hits=0 status=0 QTime=0
[junit4] 2> 917764 INFO (TEST-SpellCheckComponentTest.testThresholdTokenFrequency-seed#[A019F8A4CD8BDC18]) [ ] o.a.s.c.S.Request [collection1] webapp=null path=null params={q=documenq&qt=spellCheckCompRH&spellcheck.dictionary=threshold_direct&spellcheck=true&spellcheck.count=5&wt=xml&spellcheck.extendedResults=true} hits=0 status=0 QTime=13
[junit4] 2> 917772 INFO (TEST-SpellCheckComponentTest.testThresholdTokenFrequency-seed#[A019F8A4CD8BDC18]) [ ] o.a.s.SolrTestCaseJ4 ###Ending testThresholdTokenFrequency
[junit4] 2> 917773 INFO (TEST-SpellCheckComponentTest.testThresholdTokenFrequency-seed#[A019F8A4CD8BDC18]) [ ] o.a.s.u.DirectUpdateHandler2 [collection1] REMOVING ALL DOCUMENTS FROM INDEX
[junit4] 2> 917773 INFO (TEST-SpellCheckComponentTest.testThresholdTokenFrequency-seed#[A019F8A4CD8BDC18]) [ ] o.a.s.u.p.LogUpdateProcessorFactory [collection1] webapp=null path=null params={}{deleteByQuery=*:*} 0 0
[junit4] 2> 917773 INFO (TEST-SpellCheckComponentTest.testThresholdTokenFrequency-seed#[A019F8A4CD8BDC18]) [ ] o.a.s.u.DirectUpdateHandler2 start commit{,optimize=false,openSearcher=true,waitSearcher=true,expungeDeletes=false,softCommit=false,prepareCommit=false}
[junit4] 2> 917773 INFO (TEST-SpellCheckComponentTest.testThresholdTokenFrequency-seed#[A019F8A4CD8BDC18]) [ ] o.a.s.u.SolrIndexWriter Calling setCommitData with IW:org.apache.solr.update.SolrIndexWriter@554c97b5
[junit4] 2> 917774 INFO (TEST-SpellCheckComponentTest.testThresholdTokenFrequency-seed#[A019F8A4CD8BDC18]) [ ] o.a.s.s.SolrIndexSearcher Opening [Searcher@54eb70a6[collection1] main]
[junit4] 2> 917774 INFO (TEST-SpellCheckComponentTest.testThresholdTokenFrequency-seed#[A019F8A4CD8BDC18]) [ ] o.a.s.u.DirectUpdateHandler2 end_commit_flush
[junit4] 2> 917774 INFO (searcherExecutor-3095-thread-1) [ ] o.a.s.h.c.SpellCheckComponent Building spell index for spell checker: default
[junit4] 2> 917824 INFO (searcherExecutor-3095-thread-1) [ ] o.a.s.h.c.SpellCheckComponent Building spell index for spell checker: default_teststop
[junit4] 2> 917877 INFO (searcherExecutor-3095-thread-1) [ ] o.a.s.h.c.SpellCheckComponent Building spell index for spell checker: threshold
[junit4] 2> 917940 INFO (searcherExecutor-3095-thread-1) [ ] o.a.s.h.c.SpellCheckComponent Building spell index for spell checker: threshold_direct
[junit4] 2> 917940 INFO (searcherExecutor-3095-thread-1) [ ] o.a.s.h.c.SpellCheckComponent Building spell index for spell checker: multipleFields
[junit4] 2> 917998 INFO (searcherExecutor-3095-thread-1) [ ] o.a.s.h.c.SpellCheckComponent Building spell index for spell checker: freq
[junit4] 2> 918042 INFO (searcherExecutor-3095-thread-1) [ ] o.a.s.h.c.SpellCheckComponent Building spell index for spell checker: fqcn
[junit4] 2> 918120 INFO (searcherExecutor-3095-thread-1) [ ] o.a.s.c.SolrCore [collection1] Registered new searcher Searcher@54eb70a6[collection1] main{ExitableDirectoryReader(UninvertingDirectoryReader())}
[junit4] 2> 918120 INFO (TEST-SpellCheckComponentTest.testThresholdTokenFrequency-seed#[A019F8A4CD8BDC18]) [ ] o.a.s.u.p.LogUpdateProcessorFactory [collection1] webapp=null path=null params={}{commit=} 0 346
[junit4] 2> 918121 INFO (TEST-SpellCheckComponentTest.testReloadOnStart-seed#[A019F8A4CD8BDC18]) [ ] o.a.s.SolrTestCaseJ4 ###Starting testReloadOnStart
[junit4] 2> 918122 INFO (TEST-SpellCheckComponentTest.testReloadOnStart-seed#[A019F8A4CD8BDC18]) [ ] o.a.s.u.p.LogUpdateProcessorFactory [collection1] webapp=null path=null params={}{add=[0]} 0 0
[junit4] 2> 918122 INFO (TEST-SpellCheckComponentTest.testReloadOnStart-seed#[A019F8A4CD8BDC18]) [ ] o.a.s.u.p.LogUpdateProcessorFactory [collection1] webapp=null path=null params={}{add=[1]} 0 0
[junit4] 2> 918122 INFO (TEST-SpellCheckComponentTest.testReloadOnStart-seed#[A019F8A4CD8BDC18]) [ ] o.a.s.u.p.LogUpdateProcessorFactory [collection1] webapp=null path=null params={}{add=[2]} 0 0
[junit4] 2> 918123 INFO (TEST-SpellCheckComponentTest.testReloadOnStart-seed#[A019F8A4CD8BDC18]) [ ] o.a.s.u.p.LogUpdateProcessorFactory [collection1] webapp=null path=null params={}{add=[3]} 0 0
[junit4] 2> 918123 INFO (TEST-SpellCheckComponentTest.testReloadOnStart-seed#[A019F8A4CD8BDC18]) [ ] o.a.s.u.p.LogUpdateProcessorFactory [collection1] webapp=null path=null params={}{add=[4]} 0 0
[junit4] 2> 918123 INFO (TEST-SpellCheckComponentTest.testReloadOnStart-seed#[A019F8A4CD8BDC18]) [ ] o.a.s.u.p.LogUpdateProcessorFactory [collection1] webapp=null path=null params={}{add=[5]} 0 0
[junit4] 2> 918123 INFO (TEST-SpellCheckComponentTest.testReloadOnStart-seed#[A019F8A4CD8BDC18]) [ ] o.a.s.u.p.LogUpdateProcessorFactory [collection1] webapp=null path=null params={}{add=[6]} 0 0
[junit4] 2> 918124 INFO (TEST-SpellCheckComponentTest.testReloadOnStart-seed#[A019F8A4CD8BDC18]) [ ] o.a.s.u.p.LogUpdateProcessorFactory [collection1] webapp=null path=null params={}{add=[7]} 0 0
[junit4] 2> 918124 INFO (TEST-SpellCheckComponentTest.testReloadOnStart-seed#[A019F8A4CD8BDC18]) [ ] o.a.s.u.p.LogUpdateProcessorFactory [collection1] webapp=null path=null params={}{add=[8]} 0 0
[junit4] 2> 918124 INFO (TEST-SpellCheckComponentTest.testReloadOnStart-seed#[A019F8A4CD8BDC18]) [ ] o.a.s.u.p.LogUpdateProcessorFactory [collection1] webapp=null path=null params={}{add=[9]} 0 0
[junit4] 2> 918124 INFO (TEST-SpellCheckComponentTest.testReloadOnStart-seed#[A019F8A4CD8BDC18]) [ ] o.a.s.u.DirectUpdateHandler2 start commit{,optimize=false,openSearcher=true,waitSearcher=true,expungeDeletes=false,softCommit=false,prepareCommit=false}
[junit4] 2> 918124 INFO (TEST-SpellCheckComponentTest.testReloadOnStart-seed#[A019F8A4CD8BDC18]) [ ] o.a.s.u.SolrIndexWriter Calling setCommitData with IW:org.apache.solr.update.SolrIndexWriter@554c97b5
[junit4] 2> 918126 INFO (TEST-SpellCheckComponentTest.testReloadOnStart-seed#[A019F8A4CD8BDC18]) [ ] o.a.s.s.SolrIndexSearcher Opening [Searcher@36b11a0a[collection1] main]
[junit4] 2> 918126 INFO (TEST-SpellCheckComponentTest.testReloadOnStart-seed#[A019F8A4CD8BDC18]) [ ] o.a.s.u.DirectUpdateHandler2 end_commit_flush
[junit4] 2> 918126 INFO (searcherExecutor-3095-thread-1) [ ] o.a.s.h.c.SpellCheckComponent Building spell index for spell checker: default
[junit4] 2> 918274 INFO (searcherExecutor-3095-thread-1) [ ] o.a.s.h.c.SpellCheckComponent Building spell index for spell checker: default_teststop
[junit4] 2> 918327 INFO (searcherExecutor-3095-thread-1) [ ] o.a.s.h.c.SpellCheckComponent Building spell index for spell checker: threshold
[junit4] 2> 918447 INFO (searcherExecutor-3095-thread-1) [ ] o.a.s.h.c.SpellCheckComponent Building spell index for spell checker: threshold_direct
[junit4] 2> 918447 INFO (searcherExecutor-3095-thread-1) [ ] o.a.s.h.c.SpellCheckComponent Building spell index for spell checker: multipleFields
[junit4] 2> 918638 INFO (searcherExecutor-3095-thread-1) [ ] o.a.s.h.c.SpellCheckComponent Building spell index for spell checker: freq
[junit4] 2> 918823 INFO (searcherExecutor-3095-thread-1) [ ] o.a.s.h.c.SpellCheckComponent Building spell index for spell checker: fqcn
[junit4] 2> 918990 INFO (searcherExecutor-3095-thread-1) [ ] o.a.s.c.SolrCore [collection1] Registered new searcher Searcher@36b11a0a[collection1] main{ExitableDirectoryReader(UninvertingDirectoryReader(Uninverting(_8(6.3.0):c10)))}
[junit4] 2> 918990 INFO (TEST-SpellCheckComponentTest.testReloadOnStart-seed#[A019F8A4CD8BDC18]) [ ] o.a.s.u.p.LogUpdateProcessorFactory [collection1] webapp=null path=null params={}{commit=} 0 865
[junit4] 2> 918991 INFO (TEST-SpellCheckComponentTest.testReloadOnStart-seed#[A019F8A4CD8BDC18]) [ ] o.a.s.u.p.LogUpdateProcessorFactory [collection1] webapp=null path=null params={}{add=[0]} 0 0
[junit4] 2> 918991 INFO (TEST-SpellCheckComponentTest.testReloadOnStart-seed#[A019F8A4CD8BDC18]) [ ] o.a.s.u.DirectUpdateHandler2 start commit{,optimize=false,openSearcher=true,waitSearcher=true,expungeDeletes=false,softCommit=false,prepareCommit=false}
[junit4] 2> 918991 INFO (TEST-SpellCheckComponentTest.testReloadOnStart-seed#[A019F8A4CD8BDC18]) [ ] o.a.s.u.SolrIndexWriter Calling setCommitData with IW:org.apache.solr.update.SolrIndexWriter@554c97b5
[junit4] 2> 918993 INFO (TEST-SpellCheckComponentTest.testReloadOnStart-seed#[A019F8A4CD8BDC18]) [ ] o.a.s.s.SolrIndexSearcher Opening [Searcher@1539bc5a[collection1] main]
[junit4] 2> 918993 INFO (TEST-SpellCheckComponentTest.testReloadOnStart-seed#[A019F8A4CD8BDC18]) [ ] o.a.s.u.DirectUpdateHandler2 end_commit_flush
[junit4] 2> 918993 INFO (searcherExecutor-3095-thread-1) [ ] o.a.s.h.c.SpellCheckComponent Building spell index for spell checker: default
[junit4] 2> 919178 INFO (searcherExecutor-3095-thread-1) [ ] o.a.s.h.c.SpellCheckComponent Building spell index for spell checker: default_teststop
[junit4] 2> 919243 INFO (searcherExecutor-3095-thread-1) [ ] o.a.s.h.c.SpellCheckComponent Building spell index for spell checker: threshold
[junit4] 2> 919458 INFO (searcherExecutor-3095-thread-1) [ ] o.a.s.h.c.SpellCheckComponent Building spell index for spell checker: threshold_direct
[junit4] 2> 919458 INFO (searcherExecutor-3095-thread-1) [ ] o.a.s.h.c.SpellCheckComponent Building spell index for spell checker: multipleFields
[junit4] 2> 919657 INFO (searcherExecutor-3095-thread-1) [ ] o.a.s.h.c.SpellCheckComponent Building spell index for spell checker: freq
[junit4] 2> 919797 INFO (searcherExecutor-3095-thread-1) [ ] o.a.s.h.c.SpellCheckComponent Building spell index for spell checker: fqcn
[junit4] 2> 919968 INFO (searcherExecutor-3095-thread-1) [ ] o.a.s.c.SolrCore [collection1] Registered new searcher Searcher@1539bc5a[collection1] main{ExitableDirectoryReader(UninvertingDirectoryReader(Uninverting(_8(6.3.0):c10/1:delGen=1) Uninverting(_9(6.3.0):c1)))}
[junit4] 2> 919968 INFO (TEST-SpellCheckComponentTest.testReloadOnStart-seed#[A019F8A4CD8BDC18]) [ ] o.a.s.u.p.LogUpdateProcessorFactory [collection1] webapp=null path=null params={}{commit=} 0 977
[junit4] 2> 920257 INFO (TEST-SpellCheckComponentTest.testReloadOnStart-seed#[A019F8A4CD8BDC18]) [ ] o.a.s.c.S.Request [collection1] webapp=null path=null params={q=*:*&spellcheck.q=ttle&qt=spellCheckCompRH&spellcheck.dictionary=default&spellcheck=true&wt=xml&spellcheck.build=true} hits=10 status=0 QTime=289
[junit4] 2> 920259 INFO (TEST-SpellCheckComponentTest.testReloadOnStart-seed#[A019F8A4CD8BDC18]) [ ] o.a.s.h.c.SpellCheckComponent Initializing spell checkers
[junit4] 2> 920281 INFO (TEST-SpellCheckComponentTest.testReloadOnStart-seed#[A019F8A4CD8BDC18]) [ ] o.a.s.SolrTestCaseJ4 ###Ending testReloadOnStart
[junit4] 2> 920282 INFO (TEST-SpellCheckComponentTest.testReloadOnStart-seed#[A019F8A4CD8BDC18]) [ ] o.a.s.u.DirectUpdateHandler2 [collection1] REMOVING ALL DOCUMENTS FROM INDEX
[junit4] 2> 920282 INFO (TEST-SpellCheckComponentTest.testReloadOnStart-seed#[A019F8A4CD8BDC18]) [ ] o.a.s.u.p.LogUpdateProcessorFactory [collection1] webapp=null path=null params={}{deleteByQuery=*:*} 0 0
[junit4] 2> 920282 INFO (TEST-SpellCheckComponentTest.testReloadOnStart-seed#[A019F8A4CD8BDC18]) [ ] o.a.s.u.DirectUpdateHandler2 start commit{,optimize=false,openSearcher=true,waitSearcher=true,expungeDeletes=false,softCommit=false,prepareCommit=false}
[junit4] 2> 920282 INFO (TEST-SpellCheckComponentTest.testReloadOnStart-seed#[A019F8A4CD8BDC18]) [ ] o.a.s.u.SolrIndexWriter Calling setCommitData with IW:org.apache.solr.update.SolrIndexWriter@554c97b5
[junit4] 2> 920282 INFO (TEST-SpellCheckComponentTest.testReloadOnStart-seed#[A019F8A4CD8BDC18]) [ ] o.a.s.s.SolrIndexSearcher Opening [Searcher@150fb9ba[collection1] main]
[junit4] 2> 920282 INFO (TEST-SpellCheckComponentTest.testReloadOnStart-seed#[A019F8A4CD8BDC18]) [ ] o.a.s.u.DirectUpdateHandler2 end_commit_flush
[junit4] 2> 920282 INFO (searcherExecutor-3095-thread-1) [ ] o.a.s.h.c.SpellCheckComponent Building spell index for spell checker: default
[junit4] 2> 920406 INFO (searcherExecutor-3095-thread-1) [ ] o.a.s.h.c.SpellCheckComponent Building spell index for spell checker: default_teststop
[junit4] 2> 920511 INFO (searcherExecutor-3095-thread-1) [ ] o.a.s.h.c.SpellCheckComponent Building spell index for spell checker: threshold
[junit4] 2> 920602 INFO (searcherExecutor-3095-thread-1) [ ] o.a.s.h.c.SpellCheckComponent Building spell index for spell checker: threshold_direct
[junit4] 2> 920602 INFO (searcherExecutor-3095-thread-1) [ ] o.a.s.h.c.SpellCheckComponent Building spell index for spell checker: multipleFields
[junit4] 2> 920691 INFO (searcherExecutor-3095-thread-1) [ ] o.a.s.h.c.SpellCheckComponent Building spell index for spell checker: freq
[junit4] 2> 920784 INFO (searcherExecutor-3095-thread-1) [ ] o.a.s.h.c.SpellCheckComponent Building spell index for spell checker: fqcn
[junit4] 2> 920857 INFO (searcherExecutor-3095-thread-1) [ ] o.a.s.c.SolrCore [collection1] Registered new searcher Searcher@150fb9ba[collection1] main{ExitableDirectoryReader(UninvertingDirectoryReader())}
[junit4] 2> 920857 INFO (TEST-SpellCheckComponentTest.testReloadOnStart-seed#[A019F8A4CD8BDC18]) [ ] o.a.s.u.p.LogUpdateProcessorFactory [collection1] webapp=null path=null params={}{commit=} 0 574
[junit4] 2> 920858 INFO (TEST-SpellCheckComponentTest.testCorrectSpelling-seed#[A019F8A4CD8BDC18]) [ ] o.a.s.SolrTestCaseJ4 ###Starting testCorrectSpelling
[junit4] 2> 920859 INFO (TEST-SpellCheckComponentTest.testCorrectSpelling-seed#[A019F8A4CD8BDC18]) [ ] o.a.s.u.p.LogUpdateProcessorFactory [collection1] webapp=null path=null params={}{add=[0]} 0 0
[junit4] 2> 920859 INFO (TEST-SpellCheckComponentTest.testCorrectSpelling-seed#[A019F8A4CD8BDC18]) [ ] o.a.s.u.p.LogUpdateProcessorFactory [collection1] webapp=null path=null params={}{add=[1]} 0 0
[junit4] 2> 920860 INFO (TEST-SpellCheckComponentTest.testCorrectSpelling-seed#[A019F8A4CD8BDC18]) [ ] o.a.s.u.p.LogUpdateProcessorFactory [collection1] webapp=null path=null params={}{add=[2]} 0 0
[junit4] 2> 920860 INFO (TEST-SpellCheckComponentTest.testCorrectSpelling-seed#[A019F8A4CD8BDC18]) [ ] o.a.s.u.p.LogUpdateProcessorFactory [collection1] webapp=null path=null params={}{add=[3]} 0 0
[junit4] 2> 920860 INFO (TEST-SpellCheckComponentTest.testCorrectSpelling-seed#[A019F8A4CD8BDC18]) [ ] o.a.s.u.p.LogUpdateProcessorFactory [collection1] webapp=null path=null params={}{add=[4]} 0 0
[junit4] 2> 920860 INFO (TEST-SpellCheckComponentTest.testCorrectSpelling-seed#[A019F8A4CD8BDC18]) [ ] o.a.s.u.p.LogUpdateProcessorFactory [collection1] webapp=null path=null params={}{add=[5]} 0 0
[junit4] 2> 920860 INFO (TEST-SpellCheckComponentTest.testCorrectSpelling-seed#[A019F8A4CD8BDC18]) [ ] o.a.s.u.p.LogUpdateProcessorFactory [collection1] webapp=null path=null params={}{add=[6]} 0 0
[junit4] 2> 920861 INFO (TEST-SpellCheckComponentTest.testCorrectSpelling-seed#[A019F8A4CD8BDC18]) [ ] o.a.s.u.p.LogUpdateProcessorFactory [collection1] webapp=null path=null params={}{add=[7]} 0 0
[junit4] 2> 920861 INFO (TEST-SpellCheckComponentTest.testCorrectSpelling-seed#[A019F8A4CD8BDC18]) [ ] o.a.s.u.p.LogUpdateProcessorFactory [collection1] webapp=null path=null params={}{add=[8]} 0 0
[junit4] 2> 920861 INFO (TEST-SpellCheckComponentTest.testCorrectSpelling-seed#[A019F8A4CD8BDC18]) [ ] o.a.s.u.p.LogUpdateProcessorFactory [collection1] webapp=null path=null params={}{add=[9]} 0 0
[junit4] 2> 920861 INFO (TEST-SpellCheckComponentTest.testCorrectSpelling-seed#[A019F8A4CD8BDC18]) [ ] o.a.s.u.DirectUpdateHandler2 start commit{,optimize=false,openSearcher=true,waitSearcher=true,expungeDeletes=false,softCommit=false,prepareCommit=false}
[junit4] 2> 920861 INFO (TEST-SpellCheckComponentTest.testCorrectSpelling-seed#[A019F8A4CD8BDC18]) [ ] o.a.s.u.SolrIndexWriter Calling setCommitData with IW:org.apache.solr.update.SolrIndexWriter@554c97b5
[junit4] 2> 920863 INFO (TEST-SpellCheckComponentTest.testCorrectSpelling-seed#[A019F8A4CD8BDC18]) [ ] o.a.s.s.SolrIndexSearcher Opening [Searcher@58672bb6[collection1] main]
[junit4] 2> 920864 INFO (TEST-SpellCheckComponentTest.testCorrectSpelling-seed#[A019F8A4CD8BDC18]) [ ] o.a.s.u.DirectUpdateHandler2 end_commit_flush
[junit4] 2> 920864 INFO (searcherExecutor-3095-thread-1) [ ] o.a.s.h.c.SpellCheckComponent Building spell index for spell checker: default
[junit4] 2> 921072 INFO (searcherExecutor-3095-thread-1) [ ] o.a.s.h.c.SpellCheckComponent Building spell index for spell checker: default_teststop
[junit4] 2> 921152 INFO (searcherExecutor-3095-thread-1) [ ] o.a.s.h.c.SpellCheckComponent Building spell index for spell checker: threshold
[junit4] 2> 921370 INFO (searcherExecutor-3095-thread-1) [ ] o.a.s.h.c.SpellCheckComponent Building spell index for spell checker: threshold_direct
[junit4] 2> 921370 INFO (searcherExecutor-3095-thread-1) [ ] o.a.s.h.c.SpellCheckComponent Building spell index for spell checker: multipleFields
[junit4] 2> 921553 INFO (
[...truncated too long message...]
={q=lowerfilt:(this+OR+brwn)&spellcheck.maxResultsForSuggest=.64&qt=spellCheckCompRH&spellcheck=true&fq=id:[0+TO+9]&spellcheck.count=5&wt=xml&spellcheck.build=true&spellcheck.maxResultsForSuggest.fq=lowerfilt:th*&spellcheck.extendedResults=false} hits=7 status=0 QTime=181
[junit4] 2> 925808 ERROR (TEST-SpellCheckComponentTest.testMaximumResultsForSuggest-seed#[A019F8A4CD8BDC18]) [ ] o.a.s.SolrTestCaseJ4 query failed JSON validation. error=Path not found: /spellcheck/suggestions/[1]/numFound
[junit4] 2> expected =/spellcheck/suggestions/[1]/numFound==1
[junit4] 2> response = {
[junit4] 2> "responseHeader":{
[junit4] 2> "status":0,
[junit4] 2> "QTime":181},
[junit4] 2> "command":"build",
[junit4] 2> "response":{"numFound":7,"start":0,"docs":[
[junit4] 2> {
[junit4] 2> "id":4,
[junit4] 2> "range_facet_l":[4],
[junit4] 2> "range_facet_l_dv":[4],
[junit4] 2> "range_facet_i_dv":[4],
[junit4] 2> "lowerfilt":["this blue"],
[junit4] 2> "lowerfilt1and2":["this blue"],
[junit4] 2> "multiDefault":["muLti-Default"],
[junit4] 2> "intDefault":42,
[junit4] 2> "timestamp":"2016-10-22T19:21:49.401Z"},
[junit4] 2> {
[junit4] 2> "id":5,
[junit4] 2> "range_facet_l":[5],
[junit4] 2> "range_facet_l_dv":[5],
[junit4] 2> "range_facet_i_dv":[5],
[junit4] 2> "lowerfilt":["this blud"],
[junit4] 2> "lowerfilt1and2":["this blud"],
[junit4] 2> "multiDefault":["muLti-Default"],
[junit4] 2> "intDefault":42,
[junit4] 2> "timestamp":"2016-10-22T19:21:49.402Z"},
[junit4] 2> {
[junit4] 2> "id":6,
[junit4] 2> "range_facet_l":[6],
[junit4] 2> "range_facet_l_dv":[6],
[junit4] 2> "range_facet_i_dv":[6],
[junit4] 2> "lowerfilt":["this boue"],
[junit4] 2> "lowerfilt1and2":["this boue"],
[junit4] 2> "multiDefault":["muLti-Default"],
[junit4] 2> "intDefault":42,
[junit4] 2> "timestamp":"2016-10-22T19:21:49.402Z"},
[junit4] 2> {
[junit4] 2> "id":7,
[junit4] 2> "range_facet_l":[7],
[junit4] 2> "range_facet_l_dv":[7],
[junit4] 2> "range_facet_i_dv":[7],
[junit4] 2> "lowerfilt":["this glue"],
[junit4] 2> "lowerfilt1and2":["this glue"],
[junit4] 2> "multiDefault":["muLti-Default"],
[junit4] 2> "intDefault":42,
[junit4] 2> "timestamp":"2016-10-22T19:21:49.402Z"},
[junit4] 2> {
[junit4] 2> "id":8,
[junit4] 2> "range_facet_l":[8],
[junit4] 2> "range_facet_l_dv":[8],
[junit4] 2> "range_facet_i_dv":[8],
[junit4] 2> "lowerfilt":["this blee"],
[junit4] 2> "lowerfilt1and2":["this blee"],
[junit4] 2> "multiDefault":["muLti-Default"],
[junit4] 2> "intDefault":42,
[junit4] 2> "timestamp":"2016-10-22T19:21:49.402Z"},
[junit4] 2> {
[junit4] 2> "id":0,
[junit4] 2> "range_facet_l":[0],
[junit4] 2> "range_facet_l_dv":[0],
[junit4] 2> "range_facet_i_dv":[0],
[junit4] 2> "lowerfilt":["This is a title"],
[junit4] 2> "lowerfilt1and2":["This is a title"],
[junit4] 2> "multiDefault":["muLti-Default"],
[junit4] 2> "intDefault":42,
[junit4] 2> "timestamp":"2016-10-22T19:21:49.400Z"},
[junit4] 2> {
[junit4] 2> "id":2,
[junit4] 2> "range_facet_l":[2],
[junit4] 2> "range_facet_l_dv":[2],
[junit4] 2> "range_facet_i_dv":[2],
[junit4] 2> "lowerfilt":["This is a document"],
[junit4] 2> "lowerfilt1and2":["This is a document"],
[junit4] 2> "multiDefault":["muLti-Default"],
[junit4] 2> "intDefault":42,
[junit4] 2> "timestamp":"2016-10-22T19:21:49.401Z"}]
[junit4] 2> },
[junit4] 2> "spellcheck":{
[junit4] 2> "suggestions":[]}}
[junit4] 2>
[junit4] 2> request = q=lowerfilt:(this+OR+brwn)&spellcheck.maxResultsForSuggest=.64&qt=spellCheckCompRH&spellcheck=true&fq=id:[0+TO+9]&spellcheck.count=5&wt=xml&spellcheck.build=true&spellcheck.maxResultsForSuggest.fq=lowerfilt:th*&spellcheck.extendedResults=false
[junit4] 2> 925808 INFO (TEST-SpellCheckComponentTest.testMaximumResultsForSuggest-seed#[A019F8A4CD8BDC18]) [ ] o.a.s.SolrTestCaseJ4 ###Ending testMaximumResultsForSuggest
[junit4] 2> 925808 INFO (TEST-SpellCheckComponentTest.testMaximumResultsForSuggest-seed#[A019F8A4CD8BDC18]) [ ] o.a.s.u.DirectUpdateHandler2 [collection1] REMOVING ALL DOCUMENTS FROM INDEX
[junit4] 2> 925808 INFO (TEST-SpellCheckComponentTest.testMaximumResultsForSuggest-seed#[A019F8A4CD8BDC18]) [ ] o.a.s.u.p.LogUpdateProcessorFactory [collection1] webapp=null path=null params={}{deleteByQuery=*:*} 0 0
[junit4] 2> 925809 INFO (TEST-SpellCheckComponentTest.testMaximumResultsForSuggest-seed#[A019F8A4CD8BDC18]) [ ] o.a.s.u.DirectUpdateHandler2 start commit{,optimize=false,openSearcher=true,waitSearcher=true,expungeDeletes=false,softCommit=false,prepareCommit=false}
[junit4] 2> 925809 INFO (TEST-SpellCheckComponentTest.testMaximumResultsForSuggest-seed#[A019F8A4CD8BDC18]) [ ] o.a.s.u.SolrIndexWriter Calling setCommitData with IW:org.apache.solr.update.SolrIndexWriter@554c97b5
[junit4] 2> 925809 INFO (TEST-SpellCheckComponentTest.testMaximumResultsForSuggest-seed#[A019F8A4CD8BDC18]) [ ] o.a.s.s.SolrIndexSearcher Opening [Searcher@441199c1[collection1] main]
[junit4] 2> 925809 INFO (TEST-SpellCheckComponentTest.testMaximumResultsForSuggest-seed#[A019F8A4CD8BDC18]) [ ] o.a.s.u.DirectUpdateHandler2 end_commit_flush
[junit4] 2> 925809 INFO (searcherExecutor-3095-thread-1) [ ] o.a.s.h.c.SpellCheckComponent Building spell index for spell checker: default
[junit4] 2> 925878 INFO (searcherExecutor-3095-thread-1) [ ] o.a.s.h.c.SpellCheckComponent Building spell index for spell checker: default_teststop
[junit4] 2> 925912 INFO (searcherExecutor-3095-thread-1) [ ] o.a.s.h.c.SpellCheckComponent Building spell index for spell checker: threshold
[junit4] 2> 926009 INFO (searcherExecutor-3095-thread-1) [ ] o.a.s.h.c.SpellCheckComponent Building spell index for spell checker: threshold_direct
[junit4] 2> 926009 INFO (searcherExecutor-3095-thread-1) [ ] o.a.s.h.c.SpellCheckComponent Building spell index for spell checker: multipleFields
[junit4] 2> 926056 INFO (searcherExecutor-3095-thread-1) [ ] o.a.s.h.c.SpellCheckComponent Building spell index for spell checker: freq
[junit4] 2> 926108 INFO (searcherExecutor-3095-thread-1) [ ] o.a.s.h.c.SpellCheckComponent Building spell index for spell checker: fqcn
[junit4] 2> 926157 INFO (searcherExecutor-3095-thread-1) [ ] o.a.s.c.SolrCore [collection1] Registered new searcher Searcher@441199c1[collection1] main{ExitableDirectoryReader(UninvertingDirectoryReader())}
[junit4] 2> 926157 INFO (TEST-SpellCheckComponentTest.testMaximumResultsForSuggest-seed#[A019F8A4CD8BDC18]) [ ] o.a.s.u.p.LogUpdateProcessorFactory [collection1] webapp=null path=null params={}{commit=} 0 348
[junit4] 2> 926158 INFO (SUITE-SpellCheckComponentTest-seed#[A019F8A4CD8BDC18]-worker) [ ] o.a.s.SolrTestCaseJ4 ###deleteCore
[junit4] 2> 926158 INFO (SUITE-SpellCheckComponentTest-seed#[A019F8A4CD8BDC18]-worker) [ ] o.a.s.c.CoreContainer Shutting down CoreContainer instance=1593248227
[junit4] 2> 926158 INFO (coreCloseExecutor-3099-thread-1) [ ] o.a.s.c.SolrCore [collection1] CLOSING SolrCore org.apache.solr.core.SolrCore@61fd5435
[junit4] 2> NOTE: leaving temporary files on disk at: /home/jenkins/workspace/Lucene-Solr-6.x-Linux/solr/build/solr-core/test/J1/temp/solr.handler.component.SpellCheckComponentTest_A019F8A4CD8BDC18-001
[junit4] 2> NOTE: test params are: codec=CheapBastard, sim=ClassicSimilarity, locale=ta-IN, timezone=Asia/Baghdad
[junit4] 2> NOTE: Linux 4.4.0-42-generic amd64/Oracle Corporation 9-ea (64-bit)/cpus=12,threads=1,free=251573784,total=536870912
[junit4] 2> NOTE: All tests run in this JVM: [TestFieldCacheSanityChecker, BufferStoreTest, OpenCloseCoreStressTest, DocValuesTest, TestRequestStatusCollectionAPI, ShardRoutingTest, RollingRestartTest, BJQParserTest, TestSubQueryTransformerCrossCore, SparseHLLTest, TestSolrXml, PreAnalyzedUpdateProcessorTest, ZkStateWriterTest, DataDrivenBlockJoinTest, TestUseDocValuesAsStored2, StressHdfsTest, TestQuerySenderListener, TestHighFrequencyDictionaryFactory, TestSearcherReuse, TestBackupRepositoryFactory, SolrIndexConfigTest, ShardSplitTest, DistributedFacetPivotLargeTest, TestSchemaNameResource, TestLuceneMatchVersion, TestDocTermOrds, TestRestoreCore, TestSimpleTrackingShardHandler, TestHashPartitioner, PeerSyncReplicationTest, WordBreakSolrSpellCheckerTest, TestSolrConfigHandlerCloud, IndexBasedSpellCheckerTest, DistributedMLTComponentTest, TestRawResponseWriter, SimpleCollectionCreateDeleteTest, HighlighterTest, TestLRUCache, TestSlowCompositeReaderWrapper, TestRTGBase, TestMinMaxOnMultiValuedField, SecurityConfHandlerTest, TestHashQParserPlugin, TestRebalanceLeaders, DeleteStatusTest, TestConfigSetProperties, TestLeaderRecoverFromLogOnStartup, ChaosMonkeySafeLeaderTest, AtomicUpdatesTest, DeleteNodeTest, MigrateRouteKeyTest, TermVectorComponentTest, TestFieldResource, TestManagedSynonymFilterFactory, TestDynamicFieldCollectionResource, DistributedQueryComponentOptimizationTest, SpellCheckComponentTest]
[junit4] Completed [261/643 (1!)] on J1 in 18.88s, 11 tests, 1 error <<< FAILURES!
[...truncated 51171 lines...]