You are viewing a plain text version of this content. The canonical link for it is here.
Posted to mapreduce-dev@hadoop.apache.org by Apache Hudson Server <hu...@hudson.apache.org> on 2010/11/20 08:02:10 UTC
Build failed in Hudson: Hadoop-Mapreduce-trunk-Commit #550
See <https://hudson.apache.org/hudson/job/Hadoop-Mapreduce-trunk-Commit/550/changes>
Changes:
[nigel] Fix bug in tar file name
------------------------------------------
[...truncated 8611 lines...]
| | modules || artifacts |
| conf | number| search|dwnlded|evicted|| number|dwnlded|
---------------------------------------------------------------------
| common | 37 | 1 | 0 | 4 || 33 | 0 |
---------------------------------------------------------------------
ivy-retrieve-common:
[ivy:retrieve] :: retrieving :: org.apache.hadoop#dynamic-priority [sync]
[ivy:retrieve] confs: [common]
[ivy:retrieve] 33 artifacts copied, 0 already retrieved (12136kB/57ms)
[ivy:cachepath] DEPRECATED: 'ivy.conf.file' is deprecated, use 'ivy.settings.file' instead
[ivy:cachepath] :: loading settings :: file = <https://hudson.apache.org/hudson/job/Hadoop-Mapreduce-trunk-Commit/ws/trunk/ivy/ivysettings.xml>
compile:
[echo] contrib: dynamic-priority
jar:
[echo] contrib: dynamic-priority
[jar] Building jar: <https://hudson.apache.org/hudson/job/Hadoop-Mapreduce-trunk-Commit/ws/trunk/build/contrib/dynamic-priority/hadoop-0.23.0-SNAPSHOT-dynamic-priority.jar>
compile-examples:
jar-examples:
package:
[mkdir] Created dir: <https://hudson.apache.org/hudson/job/Hadoop-Mapreduce-trunk-Commit/ws/trunk/build/hadoop-mapred-0.23.0-SNAPSHOT/contrib/dynamic-priority>
[copy] Copying 1 file to <https://hudson.apache.org/hudson/job/Hadoop-Mapreduce-trunk-Commit/ws/trunk/build/hadoop-mapred-0.23.0-SNAPSHOT/contrib/dynamic-priority>
[mkdir] Created dir: <https://hudson.apache.org/hudson/job/Hadoop-Mapreduce-trunk-Commit/ws/trunk/build/hadoop-mapred-0.23.0-SNAPSHOT/contrib/dynamic-priority/lib>
check-contrib:
init:
[echo] contrib: eclipse-plugin
init-contrib:
ivy-download:
[get] Getting: http://repo2.maven.org/maven2/org/apache/ivy/ivy/2.1.0/ivy-2.1.0.jar
[get] To: <https://hudson.apache.org/hudson/job/Hadoop-Mapreduce-trunk-Commit/ws/trunk/ivy/ivy-2.1.0.jar>
[get] Not modified - so not downloaded
ivy-probe-antlib:
ivy-init-antlib:
ivy-init:
[ivy:configure] :: loading settings :: file = <https://hudson.apache.org/hudson/job/Hadoop-Mapreduce-trunk-Commit/ws/trunk/ivy/ivysettings.xml>
ivy-resolve-common:
[ivy:resolve] :: resolving dependencies :: org.apache.hadoop#eclipse-plugin;working@h6.grid.sp2.yahoo.net
[ivy:resolve] confs: [common]
[ivy:resolve] found org.apache.hadoop#hadoop-common;0.22.0-SNAPSHOT in apache-snapshot
[ivy:resolve] found commons-cli#commons-cli;1.2 in default
[ivy:resolve] found xmlenc#xmlenc;0.52 in default
[ivy:resolve] found commons-httpclient#commons-httpclient;3.1 in default
[ivy:resolve] found commons-codec#commons-codec;1.4 in default
[ivy:resolve] found commons-net#commons-net;1.4.1 in default
[ivy:resolve] found oro#oro;2.0.8 in default
[ivy:resolve] found org.mortbay.jetty#jetty;6.1.14 in default
[ivy:resolve] found org.mortbay.jetty#jetty-util;6.1.14 in default
[ivy:resolve] found org.mortbay.jetty#servlet-api-2.5;6.1.14 in default
[ivy:resolve] found tomcat#jasper-runtime;5.5.12 in default
[ivy:resolve] found tomcat#jasper-compiler;5.5.12 in default
[ivy:resolve] found org.mortbay.jetty#jsp-api-2.1;6.1.14 in default
[ivy:resolve] found org.mortbay.jetty#jsp-2.1;6.1.14 in default
[ivy:resolve] found org.eclipse.jdt#core;3.1.1 in default
[ivy:resolve] found ant#ant;1.6.5 in default
[ivy:resolve] found commons-el#commons-el;1.0 in default
[ivy:resolve] found net.java.dev.jets3t#jets3t;0.7.1 in default
[ivy:resolve] found commons-logging#commons-logging;1.1.1 in default
[ivy:resolve] found net.sf.kosmosfs#kfs;0.3 in default
[ivy:resolve] found junit#junit;4.8.1 in default
[ivy:resolve] found hsqldb#hsqldb;1.8.0.10 in default
[ivy:resolve] found org.apache.hadoop#avro;1.3.2 in default
[ivy:resolve] found org.codehaus.jackson#jackson-mapper-asl;1.4.2 in default
[ivy:resolve] found org.codehaus.jackson#jackson-core-asl;1.4.2 in default
[ivy:resolve] found org.slf4j#slf4j-api;1.5.11 in default
[ivy:resolve] found com.thoughtworks.paranamer#paranamer;2.2 in default
[ivy:resolve] found com.thoughtworks.paranamer#paranamer-ant;2.2 in default
[ivy:resolve] found com.thoughtworks.paranamer#paranamer-generator;2.2 in default
[ivy:resolve] found com.thoughtworks.qdox#qdox;1.10.1 in default
[ivy:resolve] found asm#asm;3.2 in default
[ivy:resolve] found commons-lang#commons-lang;2.5 in default
[ivy:resolve] found org.apache.hadoop#hadoop-hdfs;0.22.0-SNAPSHOT in apache-snapshot
[ivy:resolve] found log4j#log4j;1.2.15 in default
[ivy:resolve] :: resolution report :: resolve 1284ms :: artifacts dl 20ms
[ivy:resolve] :: evicted modules:
[ivy:resolve] commons-logging#commons-logging;1.0.4 by [commons-logging#commons-logging;1.1.1] in [common]
[ivy:resolve] commons-codec#commons-codec;1.2 by [commons-codec#commons-codec;1.4] in [common]
[ivy:resolve] commons-logging#commons-logging;1.0.3 by [commons-logging#commons-logging;1.1.1] in [common]
[ivy:resolve] commons-codec#commons-codec;1.3 by [commons-codec#commons-codec;1.4] in [common]
---------------------------------------------------------------------
| | modules || artifacts |
| conf | number| search|dwnlded|evicted|| number|dwnlded|
---------------------------------------------------------------------
| common | 38 | 2 | 0 | 4 || 34 | 0 |
---------------------------------------------------------------------
ivy-retrieve-common:
[ivy:retrieve] :: retrieving :: org.apache.hadoop#eclipse-plugin [sync]
[ivy:retrieve] confs: [common]
[ivy:retrieve] 34 artifacts copied, 0 already retrieved (13140kB/61ms)
[ivy:cachepath] DEPRECATED: 'ivy.conf.file' is deprecated, use 'ivy.settings.file' instead
[ivy:cachepath] :: loading settings :: file = <https://hudson.apache.org/hudson/job/Hadoop-Mapreduce-trunk-Commit/ws/trunk/ivy/ivysettings.xml>
compile:
[echo] contrib: eclipse-plugin
jar:
[mkdir] Created dir: <https://hudson.apache.org/hudson/job/Hadoop-Mapreduce-trunk-Commit/ws/trunk/build/contrib/eclipse-plugin/lib>
[copy] Copying 1 file to <https://hudson.apache.org/hudson/job/Hadoop-Mapreduce-trunk-Commit/ws/trunk/build/contrib/eclipse-plugin/lib>
[copy] Copying 1 file to <https://hudson.apache.org/hudson/job/Hadoop-Mapreduce-trunk-Commit/ws/trunk/build/contrib/eclipse-plugin/lib>
[copy] Copying <https://hudson.apache.org/hudson/job/Hadoop-Mapreduce-trunk-Commit/ws/trunk/build/ivy/lib/Hadoop/common/commons-cli-1.2.jar> to <https://hudson.apache.org/hudson/job/Hadoop-Mapreduce-trunk-Commit/ws/trunk/build/contrib/eclipse-plugin/lib/commons-cli-1.2.jar>
[jar] Building jar: <https://hudson.apache.org/hudson/job/Hadoop-Mapreduce-trunk-Commit/ws/trunk/build/contrib/eclipse-plugin/hadoop-0.23.0-SNAPSHOT-eclipse-plugin.jar>
compile-examples:
jar-examples:
package:
[mkdir] Created dir: <https://hudson.apache.org/hudson/job/Hadoop-Mapreduce-trunk-Commit/ws/trunk/build/hadoop-mapred-0.23.0-SNAPSHOT/contrib/eclipse-plugin>
[copy] Copying 1 file to <https://hudson.apache.org/hudson/job/Hadoop-Mapreduce-trunk-Commit/ws/trunk/build/hadoop-mapred-0.23.0-SNAPSHOT/contrib/eclipse-plugin>
[mkdir] Created dir: <https://hudson.apache.org/hudson/job/Hadoop-Mapreduce-trunk-Commit/ws/trunk/build/hadoop-mapred-0.23.0-SNAPSHOT/contrib/eclipse-plugin/lib>
check-contrib:
init:
[echo] contrib: fairscheduler
init-contrib:
ivy-download:
[get] Getting: http://repo2.maven.org/maven2/org/apache/ivy/ivy/2.1.0/ivy-2.1.0.jar
[get] To: <https://hudson.apache.org/hudson/job/Hadoop-Mapreduce-trunk-Commit/ws/trunk/ivy/ivy-2.1.0.jar>
[get] Not modified - so not downloaded
ivy-probe-antlib:
ivy-init-antlib:
ivy-init:
[ivy:configure] :: loading settings :: file = <https://hudson.apache.org/hudson/job/Hadoop-Mapreduce-trunk-Commit/ws/trunk/ivy/ivysettings.xml>
ivy-resolve-common:
[ivy:resolve] :: resolving dependencies :: org.apache.hadoop#fairscheduler;working@h6.grid.sp2.yahoo.net
[ivy:resolve] confs: [common]
[ivy:resolve] found org.apache.hadoop#hadoop-common;0.22.0-SNAPSHOT in apache-snapshot
[ivy:resolve] found commons-cli#commons-cli;1.2 in default
[ivy:resolve] found xmlenc#xmlenc;0.52 in default
[ivy:resolve] found commons-httpclient#commons-httpclient;3.1 in default
[ivy:resolve] found commons-codec#commons-codec;1.4 in default
[ivy:resolve] found commons-net#commons-net;1.4.1 in default
[ivy:resolve] found oro#oro;2.0.8 in default
[ivy:resolve] found org.mortbay.jetty#jetty;6.1.14 in default
[ivy:resolve] found org.mortbay.jetty#jetty-util;6.1.14 in default
[ivy:resolve] found org.mortbay.jetty#servlet-api-2.5;6.1.14 in default
[ivy:resolve] found tomcat#jasper-runtime;5.5.12 in default
[ivy:resolve] found tomcat#jasper-compiler;5.5.12 in default
[ivy:resolve] found org.mortbay.jetty#jsp-api-2.1;6.1.14 in default
[ivy:resolve] found org.mortbay.jetty#jsp-2.1;6.1.14 in default
[ivy:resolve] found org.eclipse.jdt#core;3.1.1 in default
[ivy:resolve] found ant#ant;1.6.5 in default
[ivy:resolve] found commons-el#commons-el;1.0 in default
[ivy:resolve] found net.java.dev.jets3t#jets3t;0.7.1 in default
[ivy:resolve] found commons-logging#commons-logging;1.1.1 in default
[ivy:resolve] found net.sf.kosmosfs#kfs;0.3 in default
[ivy:resolve] found junit#junit;4.8.1 in default
[ivy:resolve] found hsqldb#hsqldb;1.8.0.10 in default
[ivy:resolve] found org.apache.hadoop#avro;1.3.2 in maven2
[ivy:resolve] found org.codehaus.jackson#jackson-mapper-asl;1.4.2 in default
[ivy:resolve] found org.codehaus.jackson#jackson-core-asl;1.4.2 in default
[ivy:resolve] found org.slf4j#slf4j-api;1.5.11 in default
[ivy:resolve] found com.thoughtworks.paranamer#paranamer;2.2 in default
[ivy:resolve] found com.thoughtworks.paranamer#paranamer-ant;2.2 in default
[ivy:resolve] found com.thoughtworks.paranamer#paranamer-generator;2.2 in default
[ivy:resolve] found com.thoughtworks.qdox#qdox;1.10.1 in default
[ivy:resolve] found asm#asm;3.2 in default
[ivy:resolve] found commons-lang#commons-lang;2.5 in default
[ivy:resolve] found org.apache.hadoop#hadoop-hdfs;0.22.0-SNAPSHOT in apache-snapshot
[ivy:resolve] found log4j#log4j;1.2.15 in default
[ivy:resolve] downloading https://repository.apache.org/content/repositories/snapshots/org/apache/hadoop/hadoop-common/0.22.0-SNAPSHOT/hadoop-common-0.22.0-20101119.063222-143.jar ...
[ivy:resolve] ....................................................................................................................................................................................................... (1339kB)
[ivy:resolve] .. (0kB)
[ivy:resolve] [SUCCESSFUL ] org.apache.hadoop#hadoop-common;0.22.0-SNAPSHOT!hadoop-common.jar (734ms)
[ivy:resolve] downloading https://repository.apache.org/content/repositories/snapshots/org/apache/hadoop/hadoop-hdfs/0.22.0-SNAPSHOT/hadoop-hdfs-0.22.0-20101119.072222-315.jar ...
[ivy:resolve] ...................................................................................................................................................... (1003kB)
[ivy:resolve] .. (0kB)
[ivy:resolve] [SUCCESSFUL ] org.apache.hadoop#hadoop-hdfs;0.22.0-SNAPSHOT!hadoop-hdfs.jar (1346ms)
[ivy:resolve] downloading http://repo1.maven.org/maven2/org/apache/hadoop/avro/1.3.2/avro-1.3.2.jar ...
[ivy:resolve] :: resolution report :: resolve 5241ms :: artifacts dl 2640ms
[ivy:resolve] :: evicted modules:
[ivy:resolve] commons-logging#commons-logging;1.0.4 by [commons-logging#commons-logging;1.1.1] in [common]
[ivy:resolve] commons-codec#commons-codec;1.2 by [commons-codec#commons-codec;1.4] in [common]
[ivy:resolve] commons-logging#commons-logging;1.0.3 by [commons-logging#commons-logging;1.1.1] in [common]
[ivy:resolve] commons-codec#commons-codec;1.3 by [commons-codec#commons-codec;1.4] in [common]
[ivy:resolve] org.codehaus.jackson#jackson-mapper-asl;${jackson.version} by [org.codehaus.jackson#jackson-mapper-asl;1.4.2] in [common]
[ivy:resolve] com.thoughtworks.paranamer#paranamer;${paranamer.version} by [com.thoughtworks.paranamer#paranamer;2.2] in [common]
[ivy:resolve] com.thoughtworks.paranamer#paranamer-ant;${paranamer.version} by [com.thoughtworks.paranamer#paranamer-ant;2.2] in [common]
---------------------------------------------------------------------
| | modules || artifacts |
| conf | number| search|dwnlded|evicted|| number|dwnlded|
---------------------------------------------------------------------
| common | 41 | 3 | 3 | 7 || 34 | 2 |
---------------------------------------------------------------------
[ivy:resolve]
[ivy:resolve] :: problems summary ::
[ivy:resolve] :::: WARNINGS
[ivy:resolve] impossible to put metadata file in cache: http://repo1.maven.org/maven2/org/apache/hadoop/avro/1.3.2/avro-1.3.2.pom (1.3.2). java.io.FileNotFoundException: /homes/hudson/.ivy2/cache/org.apache.hadoop/avro/ivy-1.3.2.xml.original (No such file or directory)
[ivy:resolve] [FAILED ] org.apache.hadoop#avro;1.3.2!avro.jar: Stale NFS file handle (518ms)
[ivy:resolve] [FAILED ] org.apache.hadoop#avro;1.3.2!avro.jar: (0ms)
[ivy:resolve] ==== apache-snapshot: tried
[ivy:resolve] https://repository.apache.org/content/repositories/snapshots/org/apache/hadoop/avro/1.3.2/avro-1.3.2.jar
[ivy:resolve] ==== maven2: tried
[ivy:resolve] http://repo1.maven.org/maven2/org/apache/hadoop/avro/1.3.2/avro-1.3.2.jar
[ivy:resolve] ::::::::::::::::::::::::::::::::::::::::::::::
[ivy:resolve] :: FAILED DOWNLOADS ::
[ivy:resolve] :: ^ see resolution messages for details ^ ::
[ivy:resolve] ::::::::::::::::::::::::::::::::::::::::::::::
[ivy:resolve] :: org.apache.hadoop#avro;1.3.2!avro.jar
[ivy:resolve] ::::::::::::::::::::::::::::::::::::::::::::::
[ivy:resolve]
[ivy:resolve] :: USE VERBOSE OR DEBUG MESSAGE LEVEL FOR MORE DETAILS
BUILD FAILED
<https://hudson.apache.org/hudson/job/Hadoop-Mapreduce-trunk-Commit/ws/trunk/build.xml>:1149: The following error occurred while executing this line:
<https://hudson.apache.org/hudson/job/Hadoop-Mapreduce-trunk-Commit/ws/trunk/src/contrib/build.xml>:48: The following error occurred while executing this line:
<https://hudson.apache.org/hudson/job/Hadoop-Mapreduce-trunk-Commit/ws/trunk/src/contrib/build-contrib.xml>:327: impossible to resolve dependencies:
resolve failed - see output for details
Total time: 5 minutes 26 seconds
======================================================================
======================================================================
STORE: saving artifacts
======================================================================
======================================================================
mv: cannot stat `build/*.tar.gz': No such file or directory
mv: cannot stat `build/test/findbugs': No such file or directory
Build Failed
[FINDBUGS] Skipping publisher since build result is FAILURE
Publishing Javadoc
Archiving artifacts
Recording test results
Recording fingerprints
Publishing Clover coverage report...
No Clover report will be published due to a Build Failure
Hadoop-Mapreduce-trunk-Commit - Build # 562 - Still Failing
Posted by Apache Hudson Server <hu...@hudson.apache.org>.
See https://hudson.apache.org/hudson/job/Hadoop-Mapreduce-trunk-Commit/562/
###################################################################################
########################## LAST 60 LINES OF THE CONSOLE ###########################
[...truncated 2382 lines...]
clean:
[echo] contrib: raid
clean:
[echo] contrib: streaming
clean:
[echo] contrib: vaidya
clean:
[echo] contrib: vertica
clean-fi:
clean:
BUILD SUCCESSFUL
Total time: 0 seconds
======================================================================
======================================================================
BUILD: ant veryclean mvn-deploy tar findbugs -Dtest.junit.output.format=xml -Dtest.output=yes -Dcompile.c++=true -Dcompile.native=true -Dfindbugs.home=$FINDBUGS_HOME -Djava5.home=$JAVA5_HOME -Dforrest.home=$FORREST_HOME -Dclover.home=$CLOVER_HOME -Declipse.home=$ECLIPSE_HOME
======================================================================
======================================================================
Buildfile: build.xml
clean-cache:
[delete] Deleting directory /homes/hudson/.ivy2/cache/org.apache.hadoop/hadoop-common
BUILD FAILED
/grid/0/hudson/hudson-slave/workspace/Hadoop-Mapreduce-trunk-Commit/trunk/build.xml:1367: Unable to delete file /homes/hudson/.ivy2/cache/org.apache.hadoop/hadoop-common/jars/.nfs00000000054240a400000063
Total time: 0 seconds
======================================================================
======================================================================
STORE: saving artifacts
======================================================================
======================================================================
mv: cannot stat `build/*.tar.gz': No such file or directory
mv: cannot stat `build/*.jar': No such file or directory
mv: cannot stat `build/test/findbugs': No such file or directory
mv: cannot stat `build/docs/api': No such file or directory
Build Failed
[FINDBUGS] Skipping publisher since build result is FAILURE
Publishing Javadoc
Archiving artifacts
Recording test results
Recording fingerprints
Publishing Clover coverage report...
No Clover report will be published due to a Build Failure
Email was triggered for: Failure
Sending email for trigger: Failure
###################################################################################
############################## FAILED TESTS (if any) ##############################
No tests ran.
Hadoop-Mapreduce-trunk-Commit - Build # 561 - Failure
Posted by Apache Hudson Server <hu...@hudson.apache.org>.
See https://hudson.apache.org/hudson/job/Hadoop-Mapreduce-trunk-Commit/561/
###################################################################################
########################## LAST 60 LINES OF THE CONSOLE ###########################
[...truncated 2382 lines...]
clean:
[echo] contrib: raid
clean:
[echo] contrib: streaming
clean:
[echo] contrib: vaidya
clean:
[echo] contrib: vertica
clean-fi:
clean:
BUILD SUCCESSFUL
Total time: 0 seconds
======================================================================
======================================================================
BUILD: ant veryclean mvn-deploy tar findbugs -Dtest.junit.output.format=xml -Dtest.output=yes -Dcompile.c++=true -Dcompile.native=true -Dfindbugs.home=$FINDBUGS_HOME -Djava5.home=$JAVA5_HOME -Dforrest.home=$FORREST_HOME -Dclover.home=$CLOVER_HOME -Declipse.home=$ECLIPSE_HOME
======================================================================
======================================================================
Buildfile: build.xml
clean-cache:
[delete] Deleting directory /homes/hudson/.ivy2/cache/org.apache.hadoop/hadoop-common
BUILD FAILED
/grid/0/hudson/hudson-slave/workspace/Hadoop-Mapreduce-trunk-Commit/trunk/build.xml:1367: Unable to delete directory /homes/hudson/.ivy2/cache/org.apache.hadoop/hadoop-common
Total time: 0 seconds
======================================================================
======================================================================
STORE: saving artifacts
======================================================================
======================================================================
mv: cannot stat `build/*.tar.gz': No such file or directory
mv: cannot stat `build/*.jar': No such file or directory
mv: cannot stat `build/test/findbugs': No such file or directory
mv: cannot stat `build/docs/api': No such file or directory
Build Failed
[FINDBUGS] Skipping publisher since build result is FAILURE
Publishing Javadoc
Archiving artifacts
Recording test results
Recording fingerprints
Publishing Clover coverage report...
No Clover report will be published due to a Build Failure
Email was triggered for: Failure
Sending email for trigger: Failure
###################################################################################
############################## FAILED TESTS (if any) ##############################
No tests ran.
Hadoop-Mapreduce-trunk-Commit - Build # 560 - Unstable
Posted by Apache Hudson Server <hu...@hudson.apache.org>.
See https://hudson.apache.org/hudson/job/Hadoop-Mapreduce-trunk-Commit/560/
###################################################################################
########################## LAST 60 LINES OF THE CONSOLE ###########################
[...truncated 35909 lines...]
[junit] 2010-12-21 21:51:30,041 INFO mapred.JobTracker (JobTracker.java:close(1783)) - Stopping expireLaunchingTasks
[junit] 2010-12-21 21:51:30,042 INFO jobhistory.JobHistory (JobHistory.java:shutDown(195)) - Interrupting History Cleaner
[junit] 2010-12-21 21:51:30,042 INFO jobhistory.JobHistory (JobHistory.java:run(544)) - History Cleaner thread exiting
[junit] 2010-12-21 21:51:30,042 INFO mapred.JobTracker (JobTracker.java:close(1806)) - stopped all jobtracker services
[junit] Tests run: 1, Failures: 0, Errors: 0, Time elapsed: 47.1 sec
[junit] Running org.apache.hadoop.mapreduce.lib.input.TestFileInputFormat
[junit] 2010-12-21 21:51:31,056 WARN conf.Configuration (Configuration.java:set(582)) - fs.default.name is deprecated. Instead, use fs.defaultFS
[junit] 2010-12-21 21:51:31,252 WARN conf.Configuration (Configuration.java:set(582)) - fs.default.name is deprecated. Instead, use fs.defaultFS
[junit] defaultfs.getUri() = s3://abc:xyz@hostname
[junit] original = file:/foo
[junit] results = [file:/foo]
[junit] original = file:/bar
[junit] results = [file:/bar]
[junit] Tests run: 2, Failures: 0, Errors: 0, Time elapsed: 0.902 sec
[junit] Running org.apache.hadoop.mapreduce.lib.output.TestFileOutputCommitter
[junit] 2010-12-21 21:51:32,661 INFO output.FileOutputCommitter (FileOutputCommitter.java:commitTask(173)) - Saved output of task 'attempt_200707121733_0001_m_000000_0' to /grid/0/hudson/hudson-slave/workspace/Hadoop-Mapreduce-trunk-Commit/trunk/build/test/data/output
[junit] Tests run: 3, Failures: 0, Errors: 0, Time elapsed: 0.607 sec
checkfailure:
clover.check:
clover.setup:
[clover-setup] Clover Version 3.0.2, built on April 13 2010 (build-790)
[clover-setup] Loaded from: /homes/hudson/tools/clover/latest/lib/clover.jar
[clover-setup] Clover: Open Source License registered to Apache.
[clover-setup] Clover is enabled with initstring '/grid/0/hudson/hudson-slave/workspace/Hadoop-Mapreduce-trunk-Commit/trunk/build/test/clover/db/hadoop_coverage.db'
clover.info:
clover:
generate-clover-reports:
[mkdir] Created dir: /grid/0/hudson/hudson-slave/workspace/Hadoop-Mapreduce-trunk-Commit/trunk/build/test/clover/reports
[clover-report] Clover Version 3.0.2, built on April 13 2010 (build-790)
[clover-report] Loaded from: /homes/hudson/tools/clover/latest/lib/clover.jar
[clover-report] Clover: Open Source License registered to Apache.
[clover-report] Loading coverage database from: '/grid/0/hudson/hudson-slave/workspace/Hadoop-Mapreduce-trunk-Commit/trunk/build/test/clover/db/hadoop_coverage.db'
[clover-report] Writing HTML report to '/grid/0/hudson/hudson-slave/workspace/Hadoop-Mapreduce-trunk-Commit/trunk/build/test/clover/reports'
[clover-report] Done. Processed 54 packages in 12426ms (230ms per package).
[clover-report] Clover Version 3.0.2, built on April 13 2010 (build-790)
[clover-report] Loaded from: /homes/hudson/tools/clover/latest/lib/clover.jar
[clover-report] Clover: Open Source License registered to Apache.
[clover-report] Loading coverage database from: '/grid/0/hudson/hudson-slave/workspace/Hadoop-Mapreduce-trunk-Commit/trunk/build/test/clover/db/hadoop_coverage.db'
[clover-report] Writing report to '/grid/0/hudson/hudson-slave/workspace/Hadoop-Mapreduce-trunk-Commit/trunk/build/test/clover/reports/clover.xml'
BUILD SUCCESSFUL
Total time: 12 minutes 28 seconds
[FINDBUGS] Collecting findbugs analysis files...
Publishing Javadoc
Archiving artifacts
Recording test results
Recording fingerprints
Publishing Clover coverage report...
Publishing Clover HTML report...
Publishing Clover XML report...
Publishing Clover coverage results...
Email was triggered for: Unstable
Sending email for trigger: Unstable
###################################################################################
############################## FAILED TESTS (if any) ##############################
All tests passed
Hadoop-Mapreduce-trunk-Commit - Build # 559 - Still Failing
Posted by Apache Hudson Server <hu...@hudson.apache.org>.
See https://hudson.apache.org/hudson/job/Hadoop-Mapreduce-trunk-Commit/559/
###################################################################################
########################## LAST 60 LINES OF THE CONSOLE ###########################
[...truncated 182 lines...]
A src/test/mapred/org/apache/hadoop/conf/TestJobConf.java
A src/test/mapred/org/apache/hadoop/conf/TestNoDefaultsJobConf.java
A src/test/mapred/org/apache/hadoop/mapreduce
A src/test/mapred/org/apache/hadoop/mapreduce/TestNoJobSetupCleanup.java
A src/test/mapred/org/apache/hadoop/mapreduce/TestCounters.java
A src/test/mapred/org/apache/hadoop/mapreduce/MapReduceTestUtil.java
A src/test/mapred/org/apache/hadoop/mapreduce/SleepJob.java
A src/test/mapred/org/apache/hadoop/mapreduce/TestValueIterReset.java
A src/test/mapred/org/apache/hadoop/mapreduce/TestMapReduce.java
A src/test/mapred/org/apache/hadoop/mapreduce/FailJob.java
A src/test/mapred/org/apache/hadoop/mapreduce/TestTaskContext.java
A src/test/mapred/org/apache/hadoop/mapreduce/TestMRJobClient.java
A src/test/mapred/org/apache/hadoop/mapreduce/jobhistory
A src/test/mapred/org/apache/hadoop/mapreduce/jobhistory/TestJobHistoryEvents.java
A src/test/mapred/org/apache/hadoop/mapreduce/TestJobACLs.java
A src/test/mapred/org/apache/hadoop/mapreduce/TestMapReduceLocal.java
A src/test/mapred/org/apache/hadoop/mapreduce/GenericMRLoadGenerator.java
A src/test/mapred/org/apache/hadoop/mapreduce/filecache
A src/test/mapred/org/apache/hadoop/mapreduce/filecache/TestURIFragments.java
A src/test/mapred/org/apache/hadoop/mapreduce/filecache/TestTrackerDistributedCacheManager.java
A src/test/mapred/org/apache/hadoop/mapreduce/TestChild.java
A src/test/mapred/org/apache/hadoop/mapreduce/TestLocalRunner.java
A src/test/mapred/org/apache/hadoop/mapreduce/TestMapReduceLazyOutput.java
A src/test/mapred/org/apache/hadoop/mapreduce/lib
A src/test/mapred/org/apache/hadoop/mapreduce/lib/input
A src/test/mapred/org/apache/hadoop/mapreduce/lib/input/TestMRKeyValueTextInputFormat.java
A src/test/mapred/org/apache/hadoop/mapreduce/lib/input/TestCombineFileInputFormat.java
A src/test/mapred/org/apache/hadoop/mapreduce/lib/input/TestFileInputFormat.java
A src/test/mapred/org/apache/hadoop/mapreduce/lib/input/TestMRSequenceFileAsBinaryInputFormat.java
A src/test/mapred/org/apache/hadoop/mapreduce/lib/input/TestMRSequenceFileAsTextInputFormat.java
A src/test/mapred/org/apache/hadoop/mapreduce/lib/input/TestDelegatingInputFormat.java
A src/test/mapred/org/apache/hadoop/mapreduce/lib/input/TestMRSequenceFileInputFilter.java
A src/test/mapred/org/apache/hadoop/mapreduce/lib/input/TestMultipleInputs.java
A src/test/mapred/org/apache/hadoop/mapreduce/lib/input/TestNLineInputFormat.java
A src/test/mapred/org/apache/hadoop/mapreduce/lib/join
A src/test/mapred/org/apache/hadoop/mapreduce/lib/join/TestJoinTupleWritable.java
A src/test/mapred/org/apache/hadoop/mapreduce/lib/join/TestWrappedRRClassloader.java
A src/test/mapred/org/apache/hadoop/mapreduce/lib/join/TestJoinDatamerge.java
A src/test/mapred/org/apache/hadoop/mapreduce/lib/join/TestJoinProperties.java
A src/test/mapred/org/apache/hadoop/mapreduce/lib/output
A src/test/mapred/org/apache/hadoop/mapreduce/lib/output/TestJobOutputCommitter.java
A src/test/mapred/org/apache/hadoop/mapreduce/lib/output/TestFileOutputCommitter.java
A src/test/mapred/org/apache/hadoop/mapreduce/lib/output/TestMRSequenceFileAsBinaryOutputFormat.java
A src/test/mapred/org/apache/hadoop/mapreduce/lib/output/TestMRMultipleOutputs.java
A src/test/mapred/org/apache/hadoop/mapreduce/lib/chain
A src/test/mapred/org/apache/hadoop/mapreduce/lib/chain/TestChainErrors.java
A src/test/mapred/org/apache/hadoop/mapreduce/lib/chain/TestMapReduceChain.java
A src/test/mapred/org/apache/hadoop/mapreduce/lib/chain/TestSingleElementChain.java
A src/test/mapred/org/apache/hadoop/mapreduce/lib/db
SCM check out aborted
[FINDBUGS] Skipping publisher since build result is FAILURE
Publishing Javadoc
Archiving artifacts
Recording test results
Recording fingerprints
Publishing Clover coverage report...
No Clover report will be published due to a Build Failure
Email was triggered for: Failure
Sending email for trigger: Failure
###################################################################################
############################## FAILED TESTS (if any) ##############################
No tests ran.
Hadoop-Mapreduce-trunk-Commit - Build # 558 - Failure
Posted by Apache Hudson Server <hu...@hudson.apache.org>.
See https://hudson.apache.org/hudson/job/Hadoop-Mapreduce-trunk-Commit/558/
###################################################################################
########################## LAST 60 LINES OF THE CONSOLE ###########################
[...truncated 559 lines...]
A src/contrib/raid/src/test/org/apache/hadoop/raid
A src/contrib/raid/src/test/org/apache/hadoop/raid/TestHarIndexParser.java
A src/contrib/raid/src/test/org/apache/hadoop/raid/TestGaloisField.java
A src/contrib/raid/src/test/org/apache/hadoop/raid/TestRaidPurge.java
A src/contrib/raid/src/test/org/apache/hadoop/raid/TestErasureCodes.java
A src/contrib/raid/src/test/org/apache/hadoop/raid/TestRaidFilter.java
A src/contrib/raid/src/test/org/apache/hadoop/raid/TestRaidNode.java
A src/contrib/raid/src/test/org/apache/hadoop/raid/TestReedSolomonEncoder.java
A src/contrib/raid/src/test/org/apache/hadoop/raid/TestRaidShell.java
A src/contrib/raid/src/test/org/apache/hadoop/raid/TestBlockFixer.java
A src/contrib/raid/src/test/org/apache/hadoop/raid/TestDirectoryTraversal.java
A src/contrib/raid/src/test/org/apache/hadoop/raid/TestRaidHar.java
A src/contrib/raid/src/test/org/apache/hadoop/raid/TestReedSolomonDecoder.java
A src/contrib/raid/src/test/org/apache/hadoop/raid/TestRaidShellFsck.java
A src/contrib/raid/src/test/org/apache/hadoop/hdfs
A src/contrib/raid/src/test/org/apache/hadoop/hdfs/TestRaidDfs.java
A src/contrib/raid/src/java
A src/contrib/raid/src/java/org
A src/contrib/raid/src/java/org/apache
A src/contrib/raid/src/java/org/apache/hadoop
A src/contrib/raid/src/java/org/apache/hadoop/raid
A src/contrib/raid/src/java/org/apache/hadoop/raid/RaidUtils.java
A src/contrib/raid/src/java/org/apache/hadoop/raid/ConfigManager.java
A src/contrib/raid/src/java/org/apache/hadoop/raid/LocalRaidNode.java
A src/contrib/raid/src/java/org/apache/hadoop/raid/ErasureCode.java
A src/contrib/raid/src/java/org/apache/hadoop/raid/HarIndex.java
A src/contrib/raid/src/java/org/apache/hadoop/raid/DistRaid.java
A src/contrib/raid/src/java/org/apache/hadoop/raid/LocalBlockFixer.java
A src/contrib/raid/src/java/org/apache/hadoop/raid/ParityInputStream.java
A src/contrib/raid/src/java/org/apache/hadoop/raid/Decoder.java
A src/contrib/raid/src/java/org/apache/hadoop/raid/RaidShell.java
A src/contrib/raid/src/java/org/apache/hadoop/raid/XOREncoder.java
A src/contrib/raid/src/java/org/apache/hadoop/raid/DistRaidNode.java
A src/contrib/raid/src/java/org/apache/hadoop/raid/ReedSolomonDecoder.java
A src/contrib/raid/src/java/org/apache/hadoop/raid/DistBlockFixer.java
A src/contrib/raid/src/java/org/apache/hadoop/raid/Encoder.java
A src/contrib/raid/src/java/org/apache/hadoop/raid/ReedSolomonCode.java
A src/contrib/raid/src/java/org/apache/hadoop/raid/protocol
A src/contrib/raid/src/java/org/apache/hadoop/raid/protocol/RaidProtocol.java
A src/contrib/raid/src/java/org/apache/hadoop/raid/protocol/PolicyInfo.java
A src/contrib/raid/src/java/org/apache/hadoop/raid/protocol/PolicyList.java
A src/contrib/raid/src/java/org/apache/hadoop/raid/JobMonitor.java
A src/contrib/raid/src/java/org/apache/hadoop/raid/GaloisField.java
A src/contrib/raid/src/java/org/apache/hadoop/raid/RaidFilter.java
A src/contrib/raid/src/java/org/apache/hadoop/raid/RaidNode.java
A src/contrib/raid/src/java/org/apache/hadoop/raid/RaidConfigurationException.java
A src/contrib/raid/src/java/org/apache/hadoop/raid/ReedSolomonEncoder.java
A src/contrib/raid/src/java/org/apache/hadoop/raid/DirectoryTraversal.java
A src/contrib/raid/src/java/org/apache/hadoop/raid/BlockFixer.java
SCM check out aborted
[FINDBUGS] Skipping publisher since build result is FAILURE
Publishing Javadoc
Archiving artifacts
Recording test results
Recording fingerprints
Publishing Clover coverage report...
No Clover report will be published due to a Build Failure
Email was triggered for: Failure
Sending email for trigger: Failure
###################################################################################
############################## FAILED TESTS (if any) ##############################
No tests ran.
Hadoop-Mapreduce-trunk-Commit - Build # 557 - Still Unstable
Posted by Apache Hudson Server <hu...@hudson.apache.org>.
See https://hudson.apache.org/hudson/job/Hadoop-Mapreduce-trunk-Commit/557/
###################################################################################
########################## LAST 60 LINES OF THE CONSOLE ###########################
[...truncated 36797 lines...]
[junit] 2010-12-04 16:40:59,571 WARN conf.Configuration (Configuration.java:set(582)) - fs.default.name is deprecated. Instead, use fs.defaultFS
[junit] 2010-12-04 16:40:59,777 WARN conf.Configuration (Configuration.java:set(582)) - fs.default.name is deprecated. Instead, use fs.defaultFS
[junit] defaultfs.getUri() = s3://abc:xyz@hostname
[junit] original = file:/foo
[junit] results = [file:/foo]
[junit] original = file:/bar
[junit] results = [file:/bar]
[junit] Tests run: 2, Failures: 0, Errors: 0, Time elapsed: 0.97 sec
[junit] Running org.apache.hadoop.mapreduce.lib.output.TestFileOutputCommitter
[junit] 2010-12-04 16:41:01,209 INFO output.FileOutputCommitter (FileOutputCommitter.java:commitTask(173)) - Saved output of task 'attempt_200707121733_0001_m_000000_0' to /grid/0/hudson/hudson-slave/workspace/Hadoop-Mapreduce-trunk-Commit/trunk/build/test/data/output
[junit] Tests run: 3, Failures: 0, Errors: 0, Time elapsed: 0.518 sec
checkfailure:
clover.check:
clover.setup:
[clover-setup] Clover Version 3.0.2, built on April 13 2010 (build-790)
[clover-setup] Loaded from: /homes/hudson/tools/clover/latest/lib/clover.jar
[clover-setup] Clover: Open Source License registered to Apache.
[clover-setup] Clover is enabled with initstring '/grid/0/hudson/hudson-slave/workspace/Hadoop-Mapreduce-trunk-Commit/trunk/build/test/clover/db/hadoop_coverage.db'
clover.info:
clover:
generate-clover-reports:
[mkdir] Created dir: /grid/0/hudson/hudson-slave/workspace/Hadoop-Mapreduce-trunk-Commit/trunk/build/test/clover/reports
[clover-report] Clover Version 3.0.2, built on April 13 2010 (build-790)
[clover-report] Loaded from: /homes/hudson/tools/clover/latest/lib/clover.jar
[clover-report] Clover: Open Source License registered to Apache.
[clover-report] Loading coverage database from: '/grid/0/hudson/hudson-slave/workspace/Hadoop-Mapreduce-trunk-Commit/trunk/build/test/clover/db/hadoop_coverage.db'
[clover-report] Writing HTML report to '/grid/0/hudson/hudson-slave/workspace/Hadoop-Mapreduce-trunk-Commit/trunk/build/test/clover/reports'
Fontconfig error: Cannot load default config file
[clover-report] Done. Processed 54 packages in 12445ms (230ms per package).
[clover-report] Clover Version 3.0.2, built on April 13 2010 (build-790)
[clover-report] Loaded from: /homes/hudson/tools/clover/latest/lib/clover.jar
[clover-report] Clover: Open Source License registered to Apache.
[clover-report] Loading coverage database from: '/grid/0/hudson/hudson-slave/workspace/Hadoop-Mapreduce-trunk-Commit/trunk/build/test/clover/db/hadoop_coverage.db'
[clover-report] Writing report to '/grid/0/hudson/hudson-slave/workspace/Hadoop-Mapreduce-trunk-Commit/trunk/build/test/clover/reports/clover.xml'
BUILD SUCCESSFUL
Total time: 28 minutes 12 seconds
[FINDBUGS] Collecting findbugs analysis files...
Publishing Javadoc
Archiving artifacts
Recording test results
Recording fingerprints
Updating MAPREDUCE-1783
Updating MAPREDUCE-1752
Updating MAPREDUCE-1878
Updating MAPREDUCE-2156
Updating MAPREDUCE-2155
Publishing Clover coverage report...
Publishing Clover HTML report...
Publishing Clover XML report...
Publishing Clover coverage results...
Email was triggered for: Unstable
Sending email for trigger: Unstable
###################################################################################
############################## FAILED TESTS (if any) ##############################
All tests passed
Hadoop-Mapreduce-trunk-Commit - Build # 556 - Still Unstable
Posted by Apache Hudson Server <hu...@hudson.apache.org>.
See https://hudson.apache.org/hudson/job/Hadoop-Mapreduce-trunk-Commit/556/
###################################################################################
########################## LAST 60 LINES OF THE CONSOLE ###########################
[...truncated 37027 lines...]
[junit] 2010-11-26 10:48:40,894 INFO jobhistory.JobHistory (JobHistory.java:shutDown(195)) - Interrupting History Cleaner
[junit] 2010-11-26 10:48:40,894 INFO jobhistory.JobHistory (JobHistory.java:run(544)) - History Cleaner thread exiting
[junit] 2010-11-26 10:48:40,894 INFO mapred.JobTracker (JobTracker.java:close(1806)) - stopped all jobtracker services
[junit] Tests run: 1, Failures: 0, Errors: 0, Time elapsed: 112.185 sec
[junit] Running org.apache.hadoop.mapreduce.lib.input.TestFileInputFormat
[junit] 2010-11-26 10:48:41,959 WARN conf.Configuration (Configuration.java:set(582)) - fs.default.name is deprecated. Instead, use fs.defaultFS
[junit] 2010-11-26 10:48:42,159 WARN conf.Configuration (Configuration.java:set(582)) - fs.default.name is deprecated. Instead, use fs.defaultFS
[junit] defaultfs.getUri() = s3://abc:xyz@hostname
[junit] original = file:/foo
[junit] results = [file:/foo]
[junit] original = file:/bar
[junit] results = [file:/bar]
[junit] Tests run: 2, Failures: 0, Errors: 0, Time elapsed: 0.974 sec
[junit] Running org.apache.hadoop.mapreduce.lib.output.TestFileOutputCommitter
[junit] 2010-11-26 10:48:43,607 INFO output.FileOutputCommitter (FileOutputCommitter.java:commitTask(173)) - Saved output of task 'attempt_200707121733_0001_m_000000_0' to /grid/0/hudson/hudson-slave/workspace/Hadoop-Mapreduce-trunk-Commit/trunk/build/test/data/output
[junit] Tests run: 3, Failures: 0, Errors: 0, Time elapsed: 0.487 sec
checkfailure:
clover.check:
clover.setup:
[clover-setup] Clover Version 3.0.2, built on April 13 2010 (build-790)
[clover-setup] Loaded from: /homes/hudson/tools/clover/latest/lib/clover.jar
[clover-setup] Clover: Open Source License registered to Apache.
[clover-setup] Clover is enabled with initstring '/grid/0/hudson/hudson-slave/workspace/Hadoop-Mapreduce-trunk-Commit/trunk/build/test/clover/db/hadoop_coverage.db'
clover.info:
clover:
generate-clover-reports:
[mkdir] Created dir: /grid/0/hudson/hudson-slave/workspace/Hadoop-Mapreduce-trunk-Commit/trunk/build/test/clover/reports
[clover-report] Clover Version 3.0.2, built on April 13 2010 (build-790)
[clover-report] Loaded from: /homes/hudson/tools/clover/latest/lib/clover.jar
[clover-report] Clover: Open Source License registered to Apache.
[clover-report] Loading coverage database from: '/grid/0/hudson/hudson-slave/workspace/Hadoop-Mapreduce-trunk-Commit/trunk/build/test/clover/db/hadoop_coverage.db'
[clover-report] Writing HTML report to '/grid/0/hudson/hudson-slave/workspace/Hadoop-Mapreduce-trunk-Commit/trunk/build/test/clover/reports'
[clover-report] Done. Processed 54 packages in 12529ms (232ms per package).
[clover-report] Clover Version 3.0.2, built on April 13 2010 (build-790)
[clover-report] Loaded from: /homes/hudson/tools/clover/latest/lib/clover.jar
[clover-report] Clover: Open Source License registered to Apache.
[clover-report] Loading coverage database from: '/grid/0/hudson/hudson-slave/workspace/Hadoop-Mapreduce-trunk-Commit/trunk/build/test/clover/db/hadoop_coverage.db'
[clover-report] Writing report to '/grid/0/hudson/hudson-slave/workspace/Hadoop-Mapreduce-trunk-Commit/trunk/build/test/clover/reports/clover.xml'
BUILD SUCCESSFUL
Total time: 28 minutes 12 seconds
[FINDBUGS] Collecting findbugs analysis files...
Publishing Javadoc
Archiving artifacts
Recording test results
Recording fingerprints
Updating MAPREDUCE-1809
Publishing Clover coverage report...
Publishing Clover HTML report...
Publishing Clover XML report...
Publishing Clover coverage results...
Email was triggered for: Unstable
Sending email for trigger: Unstable
###################################################################################
############################## FAILED TESTS (if any) ##############################
All tests passed
Hadoop-Mapreduce-trunk-Commit - Build # 555 - Still Unstable
Posted by Apache Hudson Server <hu...@hudson.apache.org>.
See https://hudson.apache.org/hudson/job/Hadoop-Mapreduce-trunk-Commit/555/
###################################################################################
########################## LAST 60 LINES OF THE CONSOLE ###########################
[...truncated 36276 lines...]
[junit] 2010-11-25 01:03:48,360 INFO jobhistory.JobHistory (JobHistory.java:shutDown(195)) - Interrupting History Cleaner
[junit] 2010-11-25 01:03:48,360 INFO jobhistory.JobHistory (JobHistory.java:run(544)) - History Cleaner thread exiting
[junit] 2010-11-25 01:03:48,360 INFO mapred.JobTracker (JobTracker.java:close(1806)) - stopped all jobtracker services
[junit] Tests run: 1, Failures: 0, Errors: 0, Time elapsed: 132.315 sec
[junit] Running org.apache.hadoop.mapreduce.lib.input.TestFileInputFormat
[junit] 2010-11-25 01:03:49,453 WARN conf.Configuration (Configuration.java:set(582)) - fs.default.name is deprecated. Instead, use fs.defaultFS
[junit] 2010-11-25 01:03:49,662 WARN conf.Configuration (Configuration.java:set(582)) - fs.default.name is deprecated. Instead, use fs.defaultFS
[junit] defaultfs.getUri() = s3://abc:xyz@hostname
[junit] original = file:/foo
[junit] results = [file:/foo]
[junit] original = file:/bar
[junit] results = [file:/bar]
[junit] Tests run: 2, Failures: 0, Errors: 0, Time elapsed: 0.995 sec
[junit] Running org.apache.hadoop.mapreduce.lib.output.TestFileOutputCommitter
[junit] 2010-11-25 01:03:51,164 INFO output.FileOutputCommitter (FileOutputCommitter.java:commitTask(173)) - Saved output of task 'attempt_200707121733_0001_m_000000_0' to /grid/0/hudson/hudson-slave/workspace/Hadoop-Mapreduce-trunk-Commit/trunk/build/test/data/output
[junit] Tests run: 3, Failures: 0, Errors: 0, Time elapsed: 0.508 sec
checkfailure:
clover.check:
clover.setup:
[clover-setup] Clover Version 3.0.2, built on April 13 2010 (build-790)
[clover-setup] Loaded from: /homes/hudson/tools/clover/latest/lib/clover.jar
[clover-setup] Clover: Open Source License registered to Apache.
[clover-setup] Clover is enabled with initstring '/grid/0/hudson/hudson-slave/workspace/Hadoop-Mapreduce-trunk-Commit/trunk/build/test/clover/db/hadoop_coverage.db'
clover.info:
clover:
generate-clover-reports:
[mkdir] Created dir: /grid/0/hudson/hudson-slave/workspace/Hadoop-Mapreduce-trunk-Commit/trunk/build/test/clover/reports
[clover-report] Clover Version 3.0.2, built on April 13 2010 (build-790)
[clover-report] Loaded from: /homes/hudson/tools/clover/latest/lib/clover.jar
[clover-report] Clover: Open Source License registered to Apache.
[clover-report] Loading coverage database from: '/grid/0/hudson/hudson-slave/workspace/Hadoop-Mapreduce-trunk-Commit/trunk/build/test/clover/db/hadoop_coverage.db'
[clover-report] Writing HTML report to '/grid/0/hudson/hudson-slave/workspace/Hadoop-Mapreduce-trunk-Commit/trunk/build/test/clover/reports'
[clover-report] Done. Processed 54 packages in 12803ms (237ms per package).
[clover-report] Clover Version 3.0.2, built on April 13 2010 (build-790)
[clover-report] Loaded from: /homes/hudson/tools/clover/latest/lib/clover.jar
[clover-report] Clover: Open Source License registered to Apache.
[clover-report] Loading coverage database from: '/grid/0/hudson/hudson-slave/workspace/Hadoop-Mapreduce-trunk-Commit/trunk/build/test/clover/db/hadoop_coverage.db'
[clover-report] Writing report to '/grid/0/hudson/hudson-slave/workspace/Hadoop-Mapreduce-trunk-Commit/trunk/build/test/clover/reports/clover.xml'
BUILD SUCCESSFUL
Total time: 25 minutes 17 seconds
[FINDBUGS] Collecting findbugs analysis files...
Publishing Javadoc
Archiving artifacts
Recording test results
Recording fingerprints
Updating MAPREDUCE-2200
Publishing Clover coverage report...
Publishing Clover HTML report...
Publishing Clover XML report...
Publishing Clover coverage results...
Email was triggered for: Unstable
Sending email for trigger: Unstable
###################################################################################
############################## FAILED TESTS (if any) ##############################
All tests passed
Hudson build is unstable: Hadoop-Mapreduce-trunk-Commit #554
Posted by Apache Hudson Server <hu...@hudson.apache.org>.
See <https://hudson.apache.org/hudson/job/Hadoop-Mapreduce-trunk-Commit/554/changes>
Build failed in Hudson: Hadoop-Mapreduce-trunk-Commit #553
Posted by Apache Hudson Server <hu...@hudson.apache.org>.
See <https://hudson.apache.org/hudson/job/Hadoop-Mapreduce-trunk-Commit/553/changes>
Changes:
[schen] MAPREDUCE-2184. Port DistRaid.java to new mapreduce API. (Ramkumar Vadali via
schen)
------------------------------------------
[...truncated 35718 lines...]
[junit] attempt_20101123002333772_0002_r_000000_0: 2010-11-23 00:24:10,324 INFO util.ProcessTree (ProcessTree.java:isSetsidSupported(65)) - setsid exited with exit code 0
[junit] attempt_20101123002333772_0002_r_000000_0: 2010-11-23 00:24:10,338 INFO mapred.Task (Task.java:initialize(523)) - Using ResourceCalculatorPlugin : org.apache.hadoop.mapreduce.util.LinuxResourceCalculatorPlugin@701a27
[junit] attempt_20101123002333772_0002_r_000000_0: 2010-11-23 00:24:10,419 INFO reduce.MergeManager (MergeManager.java:<init>(178)) - MergerManager: memoryLimit=141387360, maxSingleShuffleLimit=35346840, mergeThreshold=93315664, ioSortFactor=10, memToMemMergeOutputsThreshold=10
[junit] attempt_20101123002333772_0002_r_000000_0: 2010-11-23 00:24:10,426 INFO reduce.EventFetcher (EventFetcher.java:run(61)) - attempt_20101123002333772_0002_r_000000_0 Thread started: EventFetcher for fetching Map Completion Events
[junit] attempt_20101123002333772_0002_r_000000_0: 2010-11-23 00:24:10,439 INFO reduce.ShuffleScheduler (ShuffleScheduler.java:getHost(303)) - Assiging localhost:35218 with 1 to fetcher#3
[junit] attempt_20101123002333772_0002_r_000000_0: 2010-11-23 00:24:10,440 INFO reduce.ShuffleScheduler (ShuffleScheduler.java:getMapsForHost(333)) - assigned 1 of 1 to localhost:35218 to fetcher#3
[junit] attempt_20101123002333772_0002_r_000000_0: 2010-11-23 00:24:10,448 INFO reduce.EventFetcher (EventFetcher.java:run(69)) - attempt_20101123002333772_0002_r_000000_0: Got 1 new map-outputs
[junit] attempt_20101123002333772_0002_r_000000_0: 2010-11-23 00:24:10,719 INFO reduce.Fetcher (Fetcher.java:copyFromHost(217)) - for url=35218/mapOutput?job=job_20101123002333772_0002&reduce=0&map=attempt_20101123002333772_0002_m_000000_0 sent hash and receievd reply
[junit] attempt_20101123002333772_0002_r_000000_0: 2010-11-23 00:24:10,722 INFO reduce.Fetcher (Fetcher.java:copyMapOutput(314)) - fetcher#3 about to shuffle output of map attempt_20101123002333772_0002_m_000000_0 decomp: 107 len: 111 to MEMORY
[junit] attempt_20101123002333772_0002_r_000000_0: 2010-11-23 00:24:10,724 INFO reduce.Fetcher (Fetcher.java:shuffleToMemory(479)) - Read 107 bytes from map-output for attempt_20101123002333772_0002_m_000000_0
[junit] attempt_20101123002333772_0002_r_000000_0: 2010-11-23 00:24:10,724 INFO reduce.MergeManager (MergeManager.java:closeInMemoryFile(277)) - closeInMemoryFile -> map-output of size: 107, inMemoryMapOutputs.size() -> 1
[junit] attempt_20101123002333772_0002_r_000000_0: 2010-11-23 00:24:10,726 INFO reduce.ShuffleScheduler (ShuffleScheduler.java:freeHost(345)) - localhost:35218 freed by fetcher#3 in 286s
[junit] attempt_20101123002333772_0002_r_000000_0: 2010-11-23 00:24:10,729 INFO reduce.MergeManager (MergeManager.java:finalMerge(629)) - finalMerge called with 1 in-memory map-outputs and 0 on-disk map-outputs
[junit] attempt_20101123002333772_0002_r_000000_0: 2010-11-23 00:24:10,754 INFO mapred.Merger (Merger.java:merge(549)) - Merging 1 sorted segments
[junit] attempt_20101123002333772_0002_r_000000_0: 2010-11-23 00:24:10,754 INFO mapred.Merger (Merger.java:merge(648)) - Down to the last merge-pass, with 1 segments left of total size: 103 bytes
[junit] attempt_20101123002333772_0002_r_000000_0: 2010-11-23 00:24:10,764 INFO reduce.MergeManager (MergeManager.java:finalMerge(701)) - Merged 1 segments, 107 bytes to disk to satisfy reduce memory limit
[junit] attempt_20101123002333772_0002_r_000000_0: 2010-11-23 00:24:10,765 INFO reduce.MergeManager (MergeManager.java:finalMerge(727)) - Merging 1 files, 111 bytes from disk
[junit] attempt_20101123002333772_0002_r_000000_0: 2010-11-23 00:24:10,766 INFO reduce.MergeManager (MergeManager.java:finalMerge(742)) - Merging 0 segments, 0 bytes from memory into reduce
[junit] attempt_20101123002333772_0002_r_000000_0: 2010-11-23 00:24:10,766 INFO mapred.Merger (Merger.java:merge(549)) - Merging 1 sorted segments
[junit] attempt_20101123002333772_0002_r_000000_0: 2010-11-23 00:24:10,769 INFO mapred.Merger (Merger.java:merge(648)) - Down to the last merge-pass, with 1 segments left of total size: 103 bytes
[junit] attempt_20101123002333772_0002_r_000000_0: 2010-11-23 00:24:10,784 WARN conf.Configuration (Configuration.java:set(582)) - mapred.skip.on is deprecated. Instead, use mapreduce.job.skiprecords
[junit] attempt_20101123002333772_0002_r_000000_0: 2010-11-23 00:24:10,800 INFO mapred.Task (Task.java:done(848)) - Task:attempt_20101123002333772_0002_r_000000_0 is done. And is in the process of commiting
[junit] attempt_20101123002333772_0002_r_000000_0: 2010-11-23 00:24:12,842 INFO mapred.Task (Task.java:commit(1009)) - Task attempt_20101123002333772_0002_r_000000_0 is allowed to commit now
[junit] attempt_20101123002333772_0002_r_000000_0: 2010-11-23 00:24:12,848 INFO output.FileOutputCommitter (FileOutputCommitter.java:commitTask(173)) - Saved output of task 'attempt_20101123002333772_0002_r_000000_0' to <https://hudson.apache.org/hudson/job/Hadoop-Mapreduce-trunk-Commit/ws/trunk/build/test/data/out>
[junit] attempt_20101123002333772_0002_r_000000_0: 2010-11-23 00:24:12,881 INFO mapred.Task (Task.java:sendDone(968)) - Task 'attempt_20101123002333772_0002_r_000000_0' done.
[junit] 2010-11-23 00:24:16,173 INFO mapred.TaskTracker (TaskTracker.java:getTask(3224)) - JVM with ID: jvm_20101123002333772_0002_m_-987686170 given task: attempt_20101123002333772_0002_m_000001_0
[junit] 2010-11-23 00:24:16,487 INFO mapred.TaskTracker (TaskTracker.java:reportProgress(2656)) - attempt_20101123002333772_0002_m_000001_0 0.0%
[junit] 2010-11-23 00:24:16,561 INFO mapred.TaskTracker (TaskTracker.java:reportProgress(2656)) - attempt_20101123002333772_0002_m_000001_0 0.0% cleanup > map
[junit] 2010-11-23 00:24:16,562 INFO mapred.TaskTracker (TaskTracker.java:reportDone(2737)) - Task attempt_20101123002333772_0002_m_000001_0 is done.
[junit] 2010-11-23 00:24:16,562 INFO mapred.TaskTracker (TaskTracker.java:reportDone(2738)) - reported output size for attempt_20101123002333772_0002_m_000001_0 was -1
[junit] 2010-11-23 00:24:16,563 INFO mapred.TaskTracker (TaskTracker.java:addFreeSlots(2223)) - addFreeSlot : current free slots : 2
[junit] 2010-11-23 00:24:16,716 WARN util.ProcessTree (ProcessTree.java:sendSignal(134)) - Error executing shell command org.apache.hadoop.util.Shell$ExitCodeException: kill: No such process
[junit]
[junit] 2010-11-23 00:24:16,716 INFO util.ProcessTree (ProcessTree.java:sendSignal(137)) - Sending signal to all members of process group -17863: SIGTERM. Exit code 1
[junit] 2010-11-23 00:24:17,166 INFO mapreduce.Job (Job.java:monitorAndPrintJob(1099)) - map 100% reduce 100%
[junit] 2010-11-23 00:24:18,053 INFO mapred.JvmManager (JvmManager.java:runChild(472)) - JVM : jvm_20101123002333772_0002_r_532540159 exited with exit code 0. Number of tasks it ran: 1
[junit] 2010-11-23 00:24:18,321 INFO mapred.JobInProgress (JobInProgress.java:completedTask(2636)) - Task 'attempt_20101123002333772_0002_m_000001_0' has completed task_20101123002333772_0002_m_000001 successfully.
[junit] 2010-11-23 00:24:18,323 INFO mapred.JobInProgress (JobInProgress.java:jobComplete(2837)) - Job job_20101123002333772_0002 has completed successfully.
[junit] 2010-11-23 00:24:18,324 INFO mapred.JobInProgress$JobSummary (JobInProgress.java:logJobSummary(3611)) - jobId=job_20101123002333772_0002,submitTime=1290471842004,launchTime=1290471842181,firstMapTaskLaunchTime=1290471846286,firstReduceTaskLaunchTime=1290471849299,firstJobSetupTaskLaunchTime=1290471843276,firstJobCleanupTaskLaunchTime=1290471855315,finishTime=1290471858323,numMaps=1,numSlotsPerMap=1,numReduces=1,numSlotsPerReduce=1,user=hudson,queue=default,status=SUCCEEDED,mapSlotSeconds=3,reduceSlotsSeconds=3,clusterMapCapacity=4,clusterReduceCapacity=4
[junit] 2010-11-23 00:24:18,329 INFO jobhistory.JobHistory (JobHistory.java:moveToDoneNow(354)) - Moving <https://hudson.apache.org/hudson/job/Hadoop-Mapreduce-trunk-Commit/ws/trunk/build/test/logs/history/job_20101123002333772_0002_hudson> to <https://hudson.apache.org/hudson/job/Hadoop-Mapreduce-trunk-Commit/ws/trunk/build/test/logs/history/done/job_20101123002333772_0002_hudson>
[junit] 2010-11-23 00:24:18,330 INFO mapred.JobTracker (JobTracker.java:removeTaskEntry(1863)) - Removing task 'attempt_20101123002333772_0002_m_000000_0'
[junit] 2010-11-23 00:24:18,330 INFO mapred.JobTracker (JobTracker.java:removeTaskEntry(1863)) - Removing task 'attempt_20101123002333772_0002_m_000001_0'
[junit] 2010-11-23 00:24:18,330 INFO mapred.JobTracker (JobTracker.java:removeTaskEntry(1863)) - Removing task 'attempt_20101123002333772_0002_m_000002_0'
[junit] 2010-11-23 00:24:18,331 INFO mapred.JobTracker (JobTracker.java:removeTaskEntry(1863)) - Removing task 'attempt_20101123002333772_0002_r_000000_0'
[junit] 2010-11-23 00:24:18,331 INFO mapred.TaskTracker (TaskTracker.java:purgeJob(1972)) - Received 'KillJobAction' for job: job_20101123002333772_0002
[junit] 2010-11-23 00:24:18,332 INFO mapred.IndexCache (IndexCache.java:removeMap(141)) - Map ID attempt_20101123002333772_0002_m_000001_0 not found in cache
[junit] 2010-11-23 00:24:18,347 INFO mapred.UserLogCleaner (UserLogCleaner.java:markJobLogsForDeletion(174)) - Adding job_20101123002333772_0002 for user-log deletion with retainTimeStamp:1290558258346
[junit] 2010-11-23 00:24:18,387 INFO jobhistory.JobHistory (JobHistory.java:moveToDoneNow(354)) - Moving <https://hudson.apache.org/hudson/job/Hadoop-Mapreduce-trunk-Commit/ws/trunk/build/test/logs/history/job_20101123002333772_0002_conf.xml> to <https://hudson.apache.org/hudson/job/Hadoop-Mapreduce-trunk-Commit/ws/trunk/build/test/logs/history/done/job_20101123002333772_0002_conf.xml>
[junit] 2010-11-23 00:24:18,390 INFO mapred.TaskTracker (TaskTracker.java:purgeJob(1972)) - Received 'KillJobAction' for job: job_20101123002333772_0002
[junit] 2010-11-23 00:24:18,390 WARN mapred.TaskTracker (TaskTracker.java:purgeJob(1979)) - Unknown job job_20101123002333772_0002 being deleted.
[junit] 2010-11-23 00:24:18,435 INFO mapred.JobInProgress (JobInProgress.java:cleanupLocalizedJobConf(3652)) - Deleting localized job conf at <https://hudson.apache.org/hudson/job/Hadoop-Mapreduce-trunk-Commit/ws/trunk/build/test/logs/job_20101123002333772_0002_conf.xml>
[junit] 2010-11-23 00:24:19,173 INFO mapreduce.Job (Job.java:printTaskEvents(1200)) - Task Id : attempt_20101123002333772_0002_m_000001_0, Status : SUCCEEDED
[junit] attempt_20101123002333772_0002_m_000001_0: 2010-11-23 00:24:16,385 INFO jvm.JvmMetrics (JvmMetrics.java:init(76)) - Initializing JVM Metrics with processName=MAP, sessionId=
[junit] attempt_20101123002333772_0002_m_000001_0: 2010-11-23 00:24:16,388 WARN conf.Configuration (Configuration.java:handleDeprecation(313)) - user.name is deprecated. Instead, use mapreduce.job.user.name
[junit] attempt_20101123002333772_0002_m_000001_0: 2010-11-23 00:24:16,418 INFO util.ProcessTree (ProcessTree.java:isSetsidSupported(65)) - setsid exited with exit code 0
[junit] attempt_20101123002333772_0002_m_000001_0: 2010-11-23 00:24:16,431 INFO mapred.Task (Task.java:initialize(523)) - Using ResourceCalculatorPlugin : org.apache.hadoop.mapreduce.util.LinuxResourceCalculatorPlugin@56860b
[junit] attempt_20101123002333772_0002_m_000001_0: 2010-11-23 00:24:16,488 INFO mapred.Task (Task.java:runJobCleanupTask(1057)) - Cleaning up job
[junit] attempt_20101123002333772_0002_m_000001_0: 2010-11-23 00:24:16,488 INFO mapred.Task (Task.java:runJobCleanupTask(1069)) - Committing job
[junit] attempt_20101123002333772_0002_m_000001_0: 2010-11-23 00:24:16,502 INFO mapred.Task (Task.java:done(848)) - Task:attempt_20101123002333772_0002_m_000001_0 is done. And is in the process of commiting
[junit] attempt_20101123002333772_0002_m_000001_0: 2010-11-23 00:24:16,563 INFO mapred.Task (Task.java:sendDone(968)) - Task 'attempt_20101123002333772_0002_m_000001_0' done.
[junit] 2010-11-23 00:24:19,178 INFO mapreduce.Job (Job.java:monitorAndPrintJob(1108)) - Job complete: job_20101123002333772_0002
[junit] 2010-11-23 00:24:19,179 INFO mapred.AuditLogger (AuditLogger.java:logSuccess(84)) - USER=hudson IP=127.0.0.1 OPERATION=VIEW_JOB_COUNTERS TARGET=job_20101123002333772_0002 in queue default RESULT=SUCCESS
[junit] 2010-11-23 00:24:19,184 INFO mapreduce.Job (Job.java:monitorAndPrintJob(1111)) - Counters: 33
[junit] FileSystemCounters
[junit] FILE_BYTES_READ=518
[junit] FILE_BYTES_WRITTEN=331
[junit] Shuffle Errors
[junit] BAD_ID=0
[junit] CONNECTION=0
[junit] IO_ERROR=0
[junit] WRONG_LENGTH=0
[junit] WRONG_MAP=0
[junit] WRONG_REDUCE=0
[junit] Job Counters
[junit] Total time spent by all maps waiting after reserving slots (ms)=0
[junit] Total time spent by all reduces waiting after reserving slots (ms)=0
[junit] Rack-local map tasks=1
[junit] SLOTS_MILLIS_MAPS=3758
[junit] SLOTS_MILLIS_REDUCES=3573
[junit] Launched map tasks=1
[junit] Launched reduce tasks=1
[junit] Map-Reduce Framework
[junit] Combine input records=13
[junit] Combine output records=10
[junit] CPU_MILLISECONDS=1330
[junit] Failed Shuffles=0
[junit] GC time elapsed (ms)=23
[junit] Map input records=4
[junit] Map output bytes=112
[junit] Map output records=13
[junit] Merged Map outputs=1
[junit] PHYSICAL_MEMORY_BYTES=102473728
[junit] Reduce input groups=10
[junit] Reduce input records=10
[junit] Reduce output records=10
[junit] Reduce shuffle bytes=111
[junit] Shuffled Maps =1
[junit] Spilled Records=20
[junit] SPLIT_RAW_BYTES=305
[junit] VIRTUAL_MEMORY_BYTES=742445056
[junit] a 1
[junit] count 1
[junit] file 1
[junit] is 1
[junit] more 1
[junit] multi 1
[junit] of 1
[junit] test 4
[junit] this 1
[junit] word 1
[junit]
[junit] 2010-11-23 00:24:19,190 INFO util.AsyncDiskService (AsyncDiskService.java:shutdown(111)) - Shutting down all AsyncDiskService threads...
[junit] 2010-11-23 00:24:19,191 INFO util.AsyncDiskService (AsyncDiskService.java:awaitTermination(140)) - All AsyncDiskService threads are terminated.
[junit] 2010-11-23 00:24:19,192 INFO mapred.TaskTracker (TaskTracker.java:run(865)) - Shutting down: Map-events fetcher for all reduce tasks on tracker_host0.foo.com:localhost/127.0.0.1:45828
[junit] 2010-11-23 00:24:19,194 ERROR filecache.TrackerDistributedCacheManager (TrackerDistributedCacheManager.java:run(946)) - Exception in DistributedCache CleanupThread.
[junit] java.lang.InterruptedException: sleep interrupted
[junit] at java.lang.Thread.sleep(Native Method)
[junit] at org.apache.hadoop.mapreduce.filecache.TrackerDistributedCacheManager$CleanupThread.run(TrackerDistributedCacheManager.java:943)
[junit] 2010-11-23 00:24:21,733 INFO mapred.JvmManager (JvmManager.java:runChild(472)) - JVM : jvm_20101123002333772_0002_m_-987686170 exited with exit code 0. Number of tasks it ran: 1
[junit] 2010-11-23 00:24:21,733 INFO ipc.Server (Server.java:stop(1601)) - Stopping server on 45828
[junit] 2010-11-23 00:24:21,734 INFO ipc.Server (Server.java:run(1444)) - IPC Server handler 1 on 45828: exiting
[junit] 2010-11-23 00:24:21,734 INFO ipc.Server (Server.java:run(1444)) - IPC Server handler 3 on 45828: exiting
[junit] 2010-11-23 00:24:21,734 INFO ipc.Server (Server.java:run(1444)) - IPC Server handler 0 on 45828: exiting
[junit] 2010-11-23 00:24:21,735 INFO ipc.Server (Server.java:run(675)) - Stopping IPC Server Responder
[junit] 2010-11-23 00:24:21,735 INFO ipc.Server (Server.java:run(475)) - Stopping IPC Server listener on 45828
[junit] 2010-11-23 00:24:21,735 INFO ipc.Server (Server.java:run(1444)) - IPC Server handler 2 on 45828: exiting
[junit] 2010-11-23 00:24:21,735 INFO mapred.TaskTracker (TaskTracker.java:shutdown(1256)) - Shutting down StatusHttpServer
[junit] 2010-11-23 00:24:21,742 ERROR mapred.TaskTracker (TaskTracker.java:offerService(1584)) - Caught exception: java.io.IOException: Call to localhost/127.0.0.1:40237 failed on local exception: java.nio.channels.ClosedByInterruptException
[junit] at org.apache.hadoop.ipc.Client.wrapException(Client.java:1063)
[junit] at org.apache.hadoop.ipc.Client.call(Client.java:1031)
[junit] at org.apache.hadoop.ipc.WritableRpcEngine$Invoker.invoke(WritableRpcEngine.java:198)
[junit] at org.apache.hadoop.mapred.$Proxy1.heartbeat(Unknown Source)
[junit] at org.apache.hadoop.mapred.TaskTracker.transmitHeartBeat(TaskTracker.java:1684)
[junit] at org.apache.hadoop.mapred.TaskTracker.offerService(TaskTracker.java:1515)
[junit] at org.apache.hadoop.mapred.TaskTracker.run(TaskTracker.java:2420)
[junit] at org.apache.hadoop.mapred.MiniMRCluster$TaskTrackerRunner.run(MiniMRCluster.java:228)
[junit] at java.lang.Thread.run(Thread.java:619)
[junit] Caused by: java.nio.channels.ClosedByInterruptException
[junit] at java.nio.channels.spi.AbstractInterruptibleChannel.end(AbstractInterruptibleChannel.java:184)
[junit] at sun.nio.ch.SocketChannelImpl.write(SocketChannelImpl.java:341)
[junit] at org.apache.hadoop.net.SocketOutputStream$Writer.performIO(SocketOutputStream.java:60)
[junit] at org.apache.hadoop.net.SocketIOWithTimeout.doIO(SocketIOWithTimeout.java:142)
[junit] at org.apache.hadoop.net.SocketOutputStream.write(SocketOutputStream.java:151)
[junit] at org.apache.hadoop.net.SocketOutputStream.write(SocketOutputStream.java:112)
[junit] at java.io.BufferedOutputStream.flushBuffer(BufferedOutputStream.java:65)
[junit] at java.io.BufferedOutputStream.flush(BufferedOutputStream.java:123)
[junit] at java.io.DataOutputStream.flush(DataOutputStream.java:106)
[junit] at org.apache.hadoop.ipc.Client$Connection.sendParam(Client.java:739)
[junit] at org.apache.hadoop.ipc.Client.call(Client.java:1009)
[junit] ... 7 more
[junit]
[junit] 2010-11-23 00:24:21,744 INFO util.AsyncDiskService (AsyncDiskService.java:shutdown(111)) - Shutting down all AsyncDiskService threads...
[junit] 2010-11-23 00:24:21,744 INFO util.AsyncDiskService (AsyncDiskService.java:awaitTermination(140)) - All AsyncDiskService threads are terminated.
[junit] 2010-11-23 00:24:21,747 INFO util.AsyncDiskService (AsyncDiskService.java:shutdown(111)) - Shutting down all AsyncDiskService threads...
[junit] 2010-11-23 00:24:21,748 INFO util.AsyncDiskService (AsyncDiskService.java:awaitTermination(140)) - All AsyncDiskService threads are terminated.
[junit] 2010-11-23 00:24:21,748 INFO mapred.TaskTracker (TaskTracker.java:run(865)) - Shutting down: Map-events fetcher for all reduce tasks on tracker_host1.foo.com:localhost/127.0.0.1:48122
[junit] 2010-11-23 00:24:21,749 ERROR filecache.TrackerDistributedCacheManager (TrackerDistributedCacheManager.java:run(946)) - Exception in DistributedCache CleanupThread.
[junit] java.lang.InterruptedException: sleep interrupted
[junit] at java.lang.Thread.sleep(Native Method)
[junit] at org.apache.hadoop.mapreduce.filecache.TrackerDistributedCacheManager$CleanupThread.run(TrackerDistributedCacheManager.java:943)
[junit] 2010-11-23 00:24:21,749 INFO ipc.Server (Server.java:stop(1601)) - Stopping server on 48122
[junit] 2010-11-23 00:24:21,749 INFO ipc.Server (Server.java:run(1444)) - IPC Server handler 0 on 48122: exiting
[junit] 2010-11-23 00:24:21,749 INFO ipc.Server (Server.java:run(1444)) - IPC Server handler 2 on 48122: exiting
[junit] 2010-11-23 00:24:21,749 INFO mapred.TaskTracker (TaskTracker.java:shutdown(1256)) - Shutting down StatusHttpServer
[junit] 2010-11-23 00:24:21,749 INFO ipc.Server (Server.java:run(1444)) - IPC Server handler 1 on 48122: exiting
[junit] 2010-11-23 00:24:21,749 INFO ipc.Server (Server.java:run(675)) - Stopping IPC Server Responder
[junit] 2010-11-23 00:24:21,749 INFO ipc.Server (Server.java:run(475)) - Stopping IPC Server listener on 48122
[junit] 2010-11-23 00:24:21,749 INFO ipc.Server (Server.java:run(1444)) - IPC Server handler 3 on 48122: exiting
[junit] 2010-11-23 00:24:21,751 INFO mapred.TaskTracker (TaskTracker.java:offerService(1564)) - Interrupted. Closing down.
[junit] 2010-11-23 00:24:21,752 INFO util.AsyncDiskService (AsyncDiskService.java:shutdown(111)) - Shutting down all AsyncDiskService threads...
[junit] 2010-11-23 00:24:21,752 INFO util.AsyncDiskService (AsyncDiskService.java:awaitTermination(140)) - All AsyncDiskService threads are terminated.
[junit] 2010-11-23 00:24:21,752 INFO mapred.JobTracker (JobTracker.java:close(1765)) - Stopping infoServer
[junit] 2010-11-23 00:24:21,874 INFO mapred.JobTracker (JobTracker.java:close(1773)) - Stopping interTrackerServer
[junit] 2010-11-23 00:24:21,874 INFO ipc.Server (Server.java:stop(1601)) - Stopping server on 40237
[junit] 2010-11-23 00:24:21,874 INFO ipc.Server (Server.java:run(1444)) - IPC Server handler 0 on 40237: exiting
[junit] 2010-11-23 00:24:21,875 INFO ipc.Server (Server.java:run(1444)) - IPC Server handler 3 on 40237: exiting
[junit] 2010-11-23 00:24:21,875 INFO ipc.Server (Server.java:run(1444)) - IPC Server handler 4 on 40237: exiting
[junit] 2010-11-23 00:24:21,875 INFO ipc.Server (Server.java:run(1444)) - IPC Server handler 8 on 40237: exiting
[junit] 2010-11-23 00:24:21,875 INFO mapred.JobTracker (JobTracker.java:stopExpireTrackersThread(1812)) - Stopping expireTrackers
[junit] 2010-11-23 00:24:21,875 INFO ipc.Server (Server.java:run(1444)) - IPC Server handler 1 on 40237: exiting
[junit] 2010-11-23 00:24:21,875 INFO ipc.Server (Server.java:run(1444)) - IPC Server handler 2 on 40237: exiting
[junit] 2010-11-23 00:24:21,876 INFO mapred.EagerTaskInitializationListener (EagerTaskInitializationListener.java:terminate(108)) - Stopping Job Init Manager thread
[junit] 2010-11-23 00:24:21,876 INFO ipc.Server (Server.java:run(1444)) - IPC Server handler 6 on 40237: exiting
[junit] 2010-11-23 00:24:21,875 INFO mapred.JobTracker (JobTracker.java:offerService(1760)) - Stopped interTrackerServer
[junit] 2010-11-23 00:24:21,875 INFO ipc.Server (Server.java:run(675)) - Stopping IPC Server Responder
[junit] 2010-11-23 00:24:21,875 INFO ipc.Server (Server.java:run(475)) - Stopping IPC Server listener on 40237
[junit] 2010-11-23 00:24:21,875 INFO ipc.Server (Server.java:run(1444)) - IPC Server handler 9 on 40237: exiting
[junit] 2010-11-23 00:24:21,875 INFO ipc.Server (Server.java:run(1444)) - IPC Server handler 7 on 40237: exiting
[junit] 2010-11-23 00:24:21,875 INFO ipc.Server (Server.java:run(1444)) - IPC Server handler 5 on 40237: exiting
[junit] 2010-11-23 00:24:21,876 INFO mapred.EagerTaskInitializationListener (EagerTaskInitializationListener.java:run(61)) - JobInitManagerThread interrupted.
[junit] 2010-11-23 00:24:21,877 INFO mapred.EagerTaskInitializationListener (EagerTaskInitializationListener.java:run(65)) - Shutting down thread pool
[junit] 2010-11-23 00:24:21,878 INFO mapred.JobTracker (JobTracker.java:close(1783)) - Stopping expireLaunchingTasks
[junit] 2010-11-23 00:24:21,878 INFO jobhistory.JobHistory (JobHistory.java:shutDown(195)) - Interrupting History Cleaner
[junit] 2010-11-23 00:24:21,878 INFO jobhistory.JobHistory (JobHistory.java:run(544)) - History Cleaner thread exiting
[junit] 2010-11-23 00:24:21,879 INFO mapred.JobTracker (JobTracker.java:close(1806)) - stopped all jobtracker services
[junit] Tests run: 1, Failures: 0, Errors: 0, Time elapsed: 48.27 sec
[junit] Running org.apache.hadoop.mapreduce.lib.input.TestFileInputFormat
[junit] 2010-11-23 00:24:22,924 WARN conf.Configuration (Configuration.java:set(582)) - fs.default.name is deprecated. Instead, use fs.defaultFS
[junit] 2010-11-23 00:24:23,126 WARN conf.Configuration (Configuration.java:set(582)) - fs.default.name is deprecated. Instead, use fs.defaultFS
[junit] defaultfs.getUri() = s3://abc:xyz@hostname
[junit] original = file:/foo
[junit] results = [file:/foo]
[junit] original = file:/bar
[junit] results = [file:/bar]
[junit] Tests run: 2, Failures: 0, Errors: 0, Time elapsed: 0.996 sec
[junit] Running org.apache.hadoop.mapreduce.lib.output.TestFileOutputCommitter
[junit] 2010-11-23 00:24:24,596 INFO output.FileOutputCommitter (FileOutputCommitter.java:commitTask(173)) - Saved output of task 'attempt_200707121733_0001_m_000000_0' to <https://hudson.apache.org/hudson/job/Hadoop-Mapreduce-trunk-Commit/ws/trunk/build/test/data/output>
[junit] Tests run: 3, Failures: 0, Errors: 0, Time elapsed: 0.502 sec
checkfailure:
clover.check:
clover.setup:
[clover-setup] Clover Version 3.0.2, built on April 13 2010 (build-790)
[clover-setup] Loaded from: /homes/hudson/tools/clover/latest/lib/clover.jar
[clover-setup] Clover: Open Source License registered to Apache.
[clover-setup] Clover is enabled with initstring '<https://hudson.apache.org/hudson/job/Hadoop-Mapreduce-trunk-Commit/ws/trunk/build/test/clover/db/hadoop_coverage.db'>
clover.info:
clover:
generate-clover-reports:
[mkdir] Created dir: <https://hudson.apache.org/hudson/job/Hadoop-Mapreduce-trunk-Commit/ws/trunk/build/test/clover/reports>
[clover-report] Clover Version 3.0.2, built on April 13 2010 (build-790)
[clover-report] Loaded from: /homes/hudson/tools/clover/latest/lib/clover.jar
[clover-report] Clover: Open Source License registered to Apache.
[clover-report] Loading coverage database from: '<https://hudson.apache.org/hudson/job/Hadoop-Mapreduce-trunk-Commit/ws/trunk/build/test/clover/db/hadoop_coverage.db'>
[clover-report] Writing HTML report to '<https://hudson.apache.org/hudson/job/Hadoop-Mapreduce-trunk-Commit/ws/trunk/build/test/clover/reports'>
[clover-report] Done. Processed 54 packages in 12337ms (228ms per package).
[clover-report] Clover Version 3.0.2, built on April 13 2010 (build-790)
[clover-report] Loaded from: /homes/hudson/tools/clover/latest/lib/clover.jar
[clover-report] Clover: Open Source License registered to Apache.
[clover-report] Loading coverage database from: '<https://hudson.apache.org/hudson/job/Hadoop-Mapreduce-trunk-Commit/ws/trunk/build/test/clover/db/hadoop_coverage.db'>
[clover-report] Writing report to '<https://hudson.apache.org/hudson/job/Hadoop-Mapreduce-trunk-Commit/ws/trunk/build/test/clover/reports/clover.xml'>
BUILD SUCCESSFUL
Total time: 26 minutes 18 seconds
[FINDBUGS] Collecting findbugs analysis files...
Publishing Javadoc
ERROR: No javadoc found in <https://hudson.apache.org/hudson/job/Hadoop-Mapreduce-trunk-Commit/ws/trunk/artifacts/api>: '**/*' doesn't match anything: '**' exists but not '**/*'
Archiving artifacts
Recording test results
Recording fingerprints
Publishing Clover coverage report...
Publishing Clover HTML report...
Publishing Clover XML report...
Publishing Clover coverage results...
Build failed in Hudson: Hadoop-Mapreduce-trunk-Commit #552
Posted by Apache Hudson Server <hu...@hudson.apache.org>.
See <https://hudson.apache.org/hudson/job/Hadoop-Mapreduce-trunk-Commit/552/>
------------------------------------------
[...truncated 3417 lines...]
compile-c++-utils:
[exec] depbase=`echo impl/StringUtils.o | sed 's|[^/]*$|.deps/&|;s|\.o$||'`; \
[exec] if g++ -DHAVE_CONFIG_H -I. -I<https://hudson.apache.org/hudson/job/Hadoop-Mapreduce-trunk-Commit/ws/trunk/src/c++/utils> -I./impl -I<https://hudson.apache.org/hudson/job/Hadoop-Mapreduce-trunk-Commit/ws/trunk/src/c++/utils/api> -Wall -g -O2 -MT impl/StringUtils.o -MD -MP -MF "$depbase.Tpo" -c -o impl/StringUtils.o <https://hudson.apache.org/hudson/job/Hadoop-Mapreduce-trunk-Commit/ws/trunk/src/c++/utils/impl/StringUtils.cc;> \
[exec] then mv -f "$depbase.Tpo" "$depbase.Po"; else rm -f "$depbase.Tpo"; exit 1; fi
[exec] depbase=`echo impl/SerialUtils.o | sed 's|[^/]*$|.deps/&|;s|\.o$||'`; \
[exec] if g++ -DHAVE_CONFIG_H -I. -I<https://hudson.apache.org/hudson/job/Hadoop-Mapreduce-trunk-Commit/ws/trunk/src/c++/utils> -I./impl -I<https://hudson.apache.org/hudson/job/Hadoop-Mapreduce-trunk-Commit/ws/trunk/src/c++/utils/api> -Wall -g -O2 -MT impl/SerialUtils.o -MD -MP -MF "$depbase.Tpo" -c -o impl/SerialUtils.o <https://hudson.apache.org/hudson/job/Hadoop-Mapreduce-trunk-Commit/ws/trunk/src/c++/utils/impl/SerialUtils.cc;> \
[exec] then mv -f "$depbase.Tpo" "$depbase.Po"; else rm -f "$depbase.Tpo"; exit 1; fi
[exec] rm -f libhadooputils.a
[exec] ar cru libhadooputils.a impl/StringUtils.o impl/SerialUtils.o
[exec] ranlib libhadooputils.a
[exec] make[1]: Entering directory `<https://hudson.apache.org/hudson/job/Hadoop-Mapreduce-trunk-Commit/ws/trunk/build-fi/system/c++-build/Linux-i386-32/utils'>
[exec] test -z "<https://hudson.apache.org/hudson/job/Hadoop-Mapreduce-trunk-Commit/ws/trunk/build-fi/system/c++/Linux-i386-32/lib"> || mkdir -p -- "<https://hudson.apache.org/hudson/job/Hadoop-Mapreduce-trunk-Commit/ws/trunk/build-fi/system/c++/Linux-i386-32/lib">
[exec] /usr/bin/install -c -m 644 'libhadooputils.a' '<https://hudson.apache.org/hudson/job/Hadoop-Mapreduce-trunk-Commit/ws/trunk/build-fi/system/c++/Linux-i386-32/lib/libhadooputils.a'>
[exec] ranlib '<https://hudson.apache.org/hudson/job/Hadoop-Mapreduce-trunk-Commit/ws/trunk/build-fi/system/c++/Linux-i386-32/lib/libhadooputils.a'>
[exec] test -z "<https://hudson.apache.org/hudson/job/Hadoop-Mapreduce-trunk-Commit/ws/trunk/build-fi/system/c++/Linux-i386-32/include/hadoop"> || mkdir -p -- "<https://hudson.apache.org/hudson/job/Hadoop-Mapreduce-trunk-Commit/ws/trunk/build-fi/system/c++/Linux-i386-32/include/hadoop">
[exec] /usr/bin/install -c -m 644 '<https://hudson.apache.org/hudson/job/Hadoop-Mapreduce-trunk-Commit/ws/trunk/src/c++/utils/api/hadoop/StringUtils.hh'> '<https://hudson.apache.org/hudson/job/Hadoop-Mapreduce-trunk-Commit/ws/trunk/build-fi/system/c++/Linux-i386-32/include/hadoop/StringUtils.hh'>
[exec] /usr/bin/install -c -m 644 '<https://hudson.apache.org/hudson/job/Hadoop-Mapreduce-trunk-Commit/ws/trunk/src/c++/utils/api/hadoop/SerialUtils.hh'> '<https://hudson.apache.org/hudson/job/Hadoop-Mapreduce-trunk-Commit/ws/trunk/build-fi/system/c++/Linux-i386-32/include/hadoop/SerialUtils.hh'>
[exec] make[1]: Leaving directory `<https://hudson.apache.org/hudson/job/Hadoop-Mapreduce-trunk-Commit/ws/trunk/build-fi/system/c++-build/Linux-i386-32/utils'>
compile-c++-pipes:
[exec] depbase=`echo impl/HadoopPipes.o | sed 's|[^/]*$|.deps/&|;s|\.o$||'`; \
[exec] if g++ -DHAVE_CONFIG_H -I. -I<https://hudson.apache.org/hudson/job/Hadoop-Mapreduce-trunk-Commit/ws/trunk/src/c++/pipes> -I./impl -I<https://hudson.apache.org/hudson/job/Hadoop-Mapreduce-trunk-Commit/ws/trunk/src/c++/pipes/api> -Wall -I<https://hudson.apache.org/hudson/job/Hadoop-Mapreduce-trunk-Commit/ws/trunk/build-fi/system/c++/Linux-i386-32/include> -g -O2 -MT impl/HadoopPipes.o -MD -MP -MF "$depbase.Tpo" -c -o impl/HadoopPipes.o <https://hudson.apache.org/hudson/job/Hadoop-Mapreduce-trunk-Commit/ws/trunk/src/c++/pipes/impl/HadoopPipes.cc;> \
[exec] then mv -f "$depbase.Tpo" "$depbase.Po"; else rm -f "$depbase.Tpo"; exit 1; fi
[exec] <https://hudson.apache.org/hudson/job/Hadoop-Mapreduce-trunk-Commit/ws/trunk/src/c++/pipes/impl/HadoopPipes.cc>: In member function 'void HadoopPipes::TextUpwardProtocol::writeBuffer(const std::string&)':
[exec] <https://hudson.apache.org/hudson/job/Hadoop-Mapreduce-trunk-Commit/ws/trunk/src/c++/pipes/impl/HadoopPipes.cc>:129: warning: format not a string literal and no format arguments
[exec] <https://hudson.apache.org/hudson/job/Hadoop-Mapreduce-trunk-Commit/ws/trunk/src/c++/pipes/impl/HadoopPipes.cc>: In member function 'std::string HadoopPipes::BinaryProtocol::createDigest(std::string&, std::string&)':
[exec] <https://hudson.apache.org/hudson/job/Hadoop-Mapreduce-trunk-Commit/ws/trunk/src/c++/pipes/impl/HadoopPipes.cc>:439: warning: value computed is not used
[exec] rm -f libhadooppipes.a
[exec] ar cru libhadooppipes.a impl/HadoopPipes.o
[exec] ranlib libhadooppipes.a
[exec] make[1]: Entering directory `<https://hudson.apache.org/hudson/job/Hadoop-Mapreduce-trunk-Commit/ws/trunk/build-fi/system/c++-build/Linux-i386-32/pipes'>
[exec] test -z "<https://hudson.apache.org/hudson/job/Hadoop-Mapreduce-trunk-Commit/ws/trunk/build-fi/system/c++/Linux-i386-32/lib"> || mkdir -p -- "<https://hudson.apache.org/hudson/job/Hadoop-Mapreduce-trunk-Commit/ws/trunk/build-fi/system/c++/Linux-i386-32/lib">
[exec] /usr/bin/install -c -m 644 'libhadooppipes.a' '<https://hudson.apache.org/hudson/job/Hadoop-Mapreduce-trunk-Commit/ws/trunk/build-fi/system/c++/Linux-i386-32/lib/libhadooppipes.a'>
[exec] ranlib '<https://hudson.apache.org/hudson/job/Hadoop-Mapreduce-trunk-Commit/ws/trunk/build-fi/system/c++/Linux-i386-32/lib/libhadooppipes.a'>
[exec] test -z "<https://hudson.apache.org/hudson/job/Hadoop-Mapreduce-trunk-Commit/ws/trunk/build-fi/system/c++/Linux-i386-32/include/hadoop"> || mkdir -p -- "<https://hudson.apache.org/hudson/job/Hadoop-Mapreduce-trunk-Commit/ws/trunk/build-fi/system/c++/Linux-i386-32/include/hadoop">
[exec] /usr/bin/install -c -m 644 '<https://hudson.apache.org/hudson/job/Hadoop-Mapreduce-trunk-Commit/ws/trunk/src/c++/pipes/api/hadoop/Pipes.hh'> '<https://hudson.apache.org/hudson/job/Hadoop-Mapreduce-trunk-Commit/ws/trunk/build-fi/system/c++/Linux-i386-32/include/hadoop/Pipes.hh'>
[exec] /usr/bin/install -c -m 644 '<https://hudson.apache.org/hudson/job/Hadoop-Mapreduce-trunk-Commit/ws/trunk/src/c++/pipes/api/hadoop/TemplateFactory.hh'> '<https://hudson.apache.org/hudson/job/Hadoop-Mapreduce-trunk-Commit/ws/trunk/build-fi/system/c++/Linux-i386-32/include/hadoop/TemplateFactory.hh'>
[exec] make[1]: Leaving directory `<https://hudson.apache.org/hudson/job/Hadoop-Mapreduce-trunk-Commit/ws/trunk/build-fi/system/c++-build/Linux-i386-32/pipes'>
compile-c++:
compile-core:
compile-tools:
[javac] Compiling 71 source files to <https://hudson.apache.org/hudson/job/Hadoop-Mapreduce-trunk-Commit/ws/trunk/build-fi/system/tools>
[javac] Note: Some input files use or override a deprecated API.
[javac] Note: Recompile with -Xlint:deprecation for details.
[copy] Copying 1 file to <https://hudson.apache.org/hudson/job/Hadoop-Mapreduce-trunk-Commit/ws/trunk/build-fi/system/tools>
create-c++-examples-pipes-makefile:
[mkdir] Created dir: <https://hudson.apache.org/hudson/job/Hadoop-Mapreduce-trunk-Commit/ws/trunk/build-fi/system/c++-build/Linux-i386-32/examples/pipes>
[exec] checking for a BSD-compatible install... /usr/bin/install -c
[exec] checking whether build environment is sane... yes
[exec] checking for gawk... no
[exec] checking for mawk... mawk
[exec] checking whether make sets $(MAKE)... yes
[exec] checking for style of include used by make... GNU
[exec] checking for gcc... gcc
[exec] checking for C compiler default output file name... a.out
[exec] checking whether the C compiler works... yes
[exec] checking whether we are cross compiling... no
[exec] checking for suffix of executables...
[exec] checking for suffix of object files... o
[exec] checking whether we are using the GNU C compiler... yes
[exec] checking whether gcc accepts -g... yes
[exec] checking for gcc option to accept ANSI C... none needed
[exec] checking dependency style of gcc... gcc3
[exec] checking for special C compiler options needed for large files... no
[exec] checking for _FILE_OFFSET_BITS value needed for large files... no
[exec] checking for _LARGE_FILES value needed for large files... no
[exec] checking how to run the C preprocessor... gcc -E
[exec] checking for egrep... grep -E
[exec] checking for ANSI C header files... yes
[exec] checking for sys/types.h... yes
[exec] checking for sys/stat.h... yes
[exec] checking for stdlib.h... yes
[exec] checking for string.h... yes
[exec] checking for memory.h... yes
[exec] checking for strings.h... yes
[exec] checking for inttypes.h... yes
[exec] checking for stdint.h... yes
[exec] checking for unistd.h... yes
[exec] checking pthread.h usability... yes
[exec] checking pthread.h presence... yes
[exec] checking for pthread.h... yes
[exec] checking for pthread_create in -lpthread... yes
[exec] checking for HMAC_Init in -lssl... yes
[exec] checking for g++... g++
[exec] checking whether we are using the GNU C++ compiler... yes
[exec] checking whether g++ accepts -g... yes
[exec] checking dependency style of g++... gcc3
[exec] checking for a BSD-compatible install... /usr/bin/install -c
[exec] checking build system type... x86_64-unknown-linux-gnu
[exec] checking host system type... x86_64-unknown-linux-gnu
[exec] checking for a sed that does not truncate output... /bin/sed
[exec] checking for ld used by gcc... /usr/bin/ld
[exec] checking if the linker (/usr/bin/ld) is GNU ld... yes
[exec] checking for /usr/bin/ld option to reload object files... -r
[exec] checking for BSD-compatible nm... /usr/bin/nm -B
[exec] checking whether ln -s works... yes
[exec] checking how to recognise dependent libraries... pass_all
[exec] checking dlfcn.h usability... yes
[exec] checking dlfcn.h presence... yes
[exec] checking for dlfcn.h... yes
[exec] checking how to run the C++ preprocessor... g++ -E
[exec] checking for g77... no
[exec] checking for f77... no
[exec] checking for xlf... no
[exec] checking for frt... no
[exec] checking for pgf77... no
[exec] checking for fort77... no
[exec] checking for fl32... no
[exec] checking for af77... no
[exec] checking for f90... no
[exec] checking for xlf90... no
[exec] checking for pgf90... no
[exec] checking for epcf90... no
[exec] checking for f95... no
[exec] checking for fort... no
[exec] checking for xlf95... no
[exec] checking for ifc... no
[exec] checking for efc... no
[exec] checking for pgf95... no
[exec] checking for lf95... no
[exec] checking for gfortran... no
[exec] checking whether we are using the GNU Fortran 77 compiler... no
[exec] checking whether accepts -g... no
[exec] checking the maximum length of command line arguments... 32768
[exec] checking command to parse /usr/bin/nm -B output from gcc object... ok
[exec] checking for objdir... .libs
[exec] checking for ar... ar
[exec] checking for ranlib... ranlib
[exec] checking for strip... strip
[exec] checking if gcc static flag works... yes
[exec] checking if gcc supports -fno-rtti -fno-exceptions... no
[exec] checking for gcc option to produce PIC... -fPIC
[exec] checking if gcc PIC flag -fPIC works... yes
[exec] checking if gcc supports -c -o file.o... yes
[exec] checking whether the gcc linker (/usr/bin/ld -m elf_x86_64) supports shared libraries... yes
[exec] checking whether -lc should be explicitly linked in... no
[exec] checking dynamic linker characteristics... GNU/Linux ld.so
[exec] checking how to hardcode library paths into programs... immediate
[exec] checking whether stripping libraries is possible... yes
[exec] checking if libtool supports shared libraries... yes
[exec] checking whether to build shared libraries... yes
[exec] checking whether to build static libraries... yes
[exec] configure: creating libtool
[exec] appending configuration tag "CXX" to libtool
[exec] checking for ld used by g++... /usr/bin/ld -m elf_x86_64
[exec] checking if the linker (/usr/bin/ld -m elf_x86_64) is GNU ld... yes
[exec] checking whether the g++ linker (/usr/bin/ld -m elf_x86_64) supports shared libraries... yes
[exec] checking for g++ option to produce PIC... -fPIC
[exec] checking if g++ PIC flag -fPIC works... yes
[exec] checking if g++ supports -c -o file.o... yes
[exec] checking whether the g++ linker (/usr/bin/ld -m elf_x86_64) supports shared libraries... yes
[exec] checking dynamic linker characteristics... GNU/Linux ld.so
[exec] checking how to hardcode library paths into programs... immediate
[exec] checking whether stripping libraries is possible... yes
[exec] appending configuration tag "F77" to libtool
[exec] checking for unistd.h... (cached) yes
[exec] checking for stdbool.h that conforms to C99... yes
[exec] checking for _Bool... no
[exec] checking for an ANSI C-conforming const... yes
[exec] checking for off_t... yes
[exec] checking for size_t... yes
[exec] checking whether strerror_r is declared... yes
[exec] checking for strerror_r... yes
[exec] checking whether strerror_r returns char *... yes
[exec] checking for mkdir... yes
[exec] checking for uname... yes
[exec] checking for shutdown in -lsocket... no
[exec] checking for xdr_float in -lnsl... yes
[exec] configure: creating ./config.status
[exec] config.status: creating Makefile
[exec] config.status: creating impl/config.h
[exec] config.status: executing depfiles commands
compile-c++-examples-pipes:
[exec] depbase=`echo impl/wordcount-simple.o | sed 's|[^/]*$|.deps/&|;s|\.o$||'`; \
[exec] if g++ -DHAVE_CONFIG_H -I. -I<https://hudson.apache.org/hudson/job/Hadoop-Mapreduce-trunk-Commit/ws/trunk/src/examples/pipes> -I./impl -Wall -I<https://hudson.apache.org/hudson/job/Hadoop-Mapreduce-trunk-Commit/ws/trunk/build-fi/system/c++/Linux-i386-32/include> -I<https://hudson.apache.org/hudson/job/Hadoop-Mapreduce-trunk-Commit/ws/trunk/build-fi/system/c++/Linux-i386-32/include> -g -O2 -MT impl/wordcount-simple.o -MD -MP -MF "$depbase.Tpo" -c -o impl/wordcount-simple.o <https://hudson.apache.org/hudson/job/Hadoop-Mapreduce-trunk-Commit/ws/trunk/src/examples/pipes/impl/wordcount-simple.cc;> \
[exec] then mv -f "$depbase.Tpo" "$depbase.Po"; else rm -f "$depbase.Tpo"; exit 1; fi
[exec] /bin/bash ./libtool --mode=link --tag=CXX g++ -Wall -I<https://hudson.apache.org/hudson/job/Hadoop-Mapreduce-trunk-Commit/ws/trunk/build-fi/system/c++/Linux-i386-32/include> -I<https://hudson.apache.org/hudson/job/Hadoop-Mapreduce-trunk-Commit/ws/trunk/build-fi/system/c++/Linux-i386-32/include> -g -O2 -o wordcount-simple impl/wordcount-simple.o -L<https://hudson.apache.org/hudson/job/Hadoop-Mapreduce-trunk-Commit/ws/trunk/build-fi/system/c++/Linux-i386-32/lib> -L<https://hudson.apache.org/hudson/job/Hadoop-Mapreduce-trunk-Commit/ws/trunk/build-fi/system/c++/Linux-i386-32/lib> -lhadooppipes -lhadooputils -lnsl -lssl -lpthread
[exec] mkdir .libs
[exec] g++ -Wall -I<https://hudson.apache.org/hudson/job/Hadoop-Mapreduce-trunk-Commit/ws/trunk/build-fi/system/c++/Linux-i386-32/include> -I<https://hudson.apache.org/hudson/job/Hadoop-Mapreduce-trunk-Commit/ws/trunk/build-fi/system/c++/Linux-i386-32/include> -g -O2 -o wordcount-simple impl/wordcount-simple.o -L<https://hudson.apache.org/hudson/job/Hadoop-Mapreduce-trunk-Commit/ws/trunk/build-fi/system/c++/Linux-i386-32/lib> -lhadooppipes -lhadooputils -lnsl -lssl -lpthread
[exec] depbase=`echo impl/wordcount-part.o | sed 's|[^/]*$|.deps/&|;s|\.o$||'`; \
[exec] if g++ -DHAVE_CONFIG_H -I. -I<https://hudson.apache.org/hudson/job/Hadoop-Mapreduce-trunk-Commit/ws/trunk/src/examples/pipes> -I./impl -Wall -I<https://hudson.apache.org/hudson/job/Hadoop-Mapreduce-trunk-Commit/ws/trunk/build-fi/system/c++/Linux-i386-32/include> -I<https://hudson.apache.org/hudson/job/Hadoop-Mapreduce-trunk-Commit/ws/trunk/build-fi/system/c++/Linux-i386-32/include> -g -O2 -MT impl/wordcount-part.o -MD -MP -MF "$depbase.Tpo" -c -o impl/wordcount-part.o <https://hudson.apache.org/hudson/job/Hadoop-Mapreduce-trunk-Commit/ws/trunk/src/examples/pipes/impl/wordcount-part.cc;> \
[exec] then mv -f "$depbase.Tpo" "$depbase.Po"; else rm -f "$depbase.Tpo"; exit 1; fi
[exec] /bin/bash ./libtool --mode=link --tag=CXX g++ -Wall -I<https://hudson.apache.org/hudson/job/Hadoop-Mapreduce-trunk-Commit/ws/trunk/build-fi/system/c++/Linux-i386-32/include> -I<https://hudson.apache.org/hudson/job/Hadoop-Mapreduce-trunk-Commit/ws/trunk/build-fi/system/c++/Linux-i386-32/include> -g -O2 -o wordcount-part impl/wordcount-part.o -L<https://hudson.apache.org/hudson/job/Hadoop-Mapreduce-trunk-Commit/ws/trunk/build-fi/system/c++/Linux-i386-32/lib> -L<https://hudson.apache.org/hudson/job/Hadoop-Mapreduce-trunk-Commit/ws/trunk/build-fi/system/c++/Linux-i386-32/lib> -lhadooppipes -lhadooputils -lnsl -lssl -lpthread
[exec] g++ -Wall -I<https://hudson.apache.org/hudson/job/Hadoop-Mapreduce-trunk-Commit/ws/trunk/build-fi/system/c++/Linux-i386-32/include> -I<https://hudson.apache.org/hudson/job/Hadoop-Mapreduce-trunk-Commit/ws/trunk/build-fi/system/c++/Linux-i386-32/include> -g -O2 -o wordcount-part impl/wordcount-part.o -L<https://hudson.apache.org/hudson/job/Hadoop-Mapreduce-trunk-Commit/ws/trunk/build-fi/system/c++/Linux-i386-32/lib> -lhadooppipes -lhadooputils -lnsl -lssl -lpthread
[exec] depbase=`echo impl/wordcount-nopipe.o | sed 's|[^/]*$|.deps/&|;s|\.o$||'`; \
[exec] if g++ -DHAVE_CONFIG_H -I. -I<https://hudson.apache.org/hudson/job/Hadoop-Mapreduce-trunk-Commit/ws/trunk/src/examples/pipes> -I./impl -Wall -I<https://hudson.apache.org/hudson/job/Hadoop-Mapreduce-trunk-Commit/ws/trunk/build-fi/system/c++/Linux-i386-32/include> -I<https://hudson.apache.org/hudson/job/Hadoop-Mapreduce-trunk-Commit/ws/trunk/build-fi/system/c++/Linux-i386-32/include> -g -O2 -MT impl/wordcount-nopipe.o -MD -MP -MF "$depbase.Tpo" -c -o impl/wordcount-nopipe.o <https://hudson.apache.org/hudson/job/Hadoop-Mapreduce-trunk-Commit/ws/trunk/src/examples/pipes/impl/wordcount-nopipe.cc;> \
[exec] then mv -f "$depbase.Tpo" "$depbase.Po"; else rm -f "$depbase.Tpo"; exit 1; fi
[exec] /bin/bash ./libtool --mode=link --tag=CXX g++ -Wall -I<https://hudson.apache.org/hudson/job/Hadoop-Mapreduce-trunk-Commit/ws/trunk/build-fi/system/c++/Linux-i386-32/include> -I<https://hudson.apache.org/hudson/job/Hadoop-Mapreduce-trunk-Commit/ws/trunk/build-fi/system/c++/Linux-i386-32/include> -g -O2 -o wordcount-nopipe impl/wordcount-nopipe.o -L<https://hudson.apache.org/hudson/job/Hadoop-Mapreduce-trunk-Commit/ws/trunk/build-fi/system/c++/Linux-i386-32/lib> -L<https://hudson.apache.org/hudson/job/Hadoop-Mapreduce-trunk-Commit/ws/trunk/build-fi/system/c++/Linux-i386-32/lib> -lhadooppipes -lhadooputils -lnsl -lssl -lpthread
[exec] g++ -Wall -I<https://hudson.apache.org/hudson/job/Hadoop-Mapreduce-trunk-Commit/ws/trunk/build-fi/system/c++/Linux-i386-32/include> -I<https://hudson.apache.org/hudson/job/Hadoop-Mapreduce-trunk-Commit/ws/trunk/build-fi/system/c++/Linux-i386-32/include> -g -O2 -o wordcount-nopipe impl/wordcount-nopipe.o -L<https://hudson.apache.org/hudson/job/Hadoop-Mapreduce-trunk-Commit/ws/trunk/build-fi/system/c++/Linux-i386-32/lib> -lhadooppipes -lhadooputils -lnsl -lssl -lpthread
[exec] depbase=`echo impl/sort.o | sed 's|[^/]*$|.deps/&|;s|\.o$||'`; \
[exec] if g++ -DHAVE_CONFIG_H -I. -I<https://hudson.apache.org/hudson/job/Hadoop-Mapreduce-trunk-Commit/ws/trunk/src/examples/pipes> -I./impl -Wall -I<https://hudson.apache.org/hudson/job/Hadoop-Mapreduce-trunk-Commit/ws/trunk/build-fi/system/c++/Linux-i386-32/include> -I<https://hudson.apache.org/hudson/job/Hadoop-Mapreduce-trunk-Commit/ws/trunk/build-fi/system/c++/Linux-i386-32/include> -g -O2 -MT impl/sort.o -MD -MP -MF "$depbase.Tpo" -c -o impl/sort.o <https://hudson.apache.org/hudson/job/Hadoop-Mapreduce-trunk-Commit/ws/trunk/src/examples/pipes/impl/sort.cc;> \
[exec] then mv -f "$depbase.Tpo" "$depbase.Po"; else rm -f "$depbase.Tpo"; exit 1; fi
[exec] /bin/bash ./libtool --mode=link --tag=CXX g++ -Wall -I<https://hudson.apache.org/hudson/job/Hadoop-Mapreduce-trunk-Commit/ws/trunk/build-fi/system/c++/Linux-i386-32/include> -I<https://hudson.apache.org/hudson/job/Hadoop-Mapreduce-trunk-Commit/ws/trunk/build-fi/system/c++/Linux-i386-32/include> -g -O2 -o pipes-sort impl/sort.o -L<https://hudson.apache.org/hudson/job/Hadoop-Mapreduce-trunk-Commit/ws/trunk/build-fi/system/c++/Linux-i386-32/lib> -L<https://hudson.apache.org/hudson/job/Hadoop-Mapreduce-trunk-Commit/ws/trunk/build-fi/system/c++/Linux-i386-32/lib> -lhadooppipes -lhadooputils -lnsl -lssl -lpthread
[exec] g++ -Wall -I<https://hudson.apache.org/hudson/job/Hadoop-Mapreduce-trunk-Commit/ws/trunk/build-fi/system/c++/Linux-i386-32/include> -I<https://hudson.apache.org/hudson/job/Hadoop-Mapreduce-trunk-Commit/ws/trunk/build-fi/system/c++/Linux-i386-32/include> -g -O2 -o pipes-sort impl/sort.o -L<https://hudson.apache.org/hudson/job/Hadoop-Mapreduce-trunk-Commit/ws/trunk/build-fi/system/c++/Linux-i386-32/lib> -lhadooppipes -lhadooputils -lnsl -lssl -lpthread
[exec] make[1]: Entering directory `<https://hudson.apache.org/hudson/job/Hadoop-Mapreduce-trunk-Commit/ws/trunk/build-fi/system/c++-build/Linux-i386-32/examples/pipes'>
[exec] test -z "<https://hudson.apache.org/hudson/job/Hadoop-Mapreduce-trunk-Commit/ws/trunk/build-fi/system/c++-examples/Linux-i386-32/bin"> || mkdir -p -- "<https://hudson.apache.org/hudson/job/Hadoop-Mapreduce-trunk-Commit/ws/trunk/build-fi/system/c++-examples/Linux-i386-32/bin">
[exec] /bin/bash ./libtool --mode=install /usr/bin/install -c 'wordcount-simple' '<https://hudson.apache.org/hudson/job/Hadoop-Mapreduce-trunk-Commit/ws/trunk/build-fi/system/c++-examples/Linux-i386-32/bin/wordcount-simple'>
[exec] /usr/bin/install -c wordcount-simple <https://hudson.apache.org/hudson/job/Hadoop-Mapreduce-trunk-Commit/ws/trunk/build-fi/system/c++-examples/Linux-i386-32/bin/wordcount-simple>
[exec] /bin/bash ./libtool --mode=install /usr/bin/install -c 'wordcount-part' '<https://hudson.apache.org/hudson/job/Hadoop-Mapreduce-trunk-Commit/ws/trunk/build-fi/system/c++-examples/Linux-i386-32/bin/wordcount-part'>
[exec] /usr/bin/install -c wordcount-part <https://hudson.apache.org/hudson/job/Hadoop-Mapreduce-trunk-Commit/ws/trunk/build-fi/system/c++-examples/Linux-i386-32/bin/wordcount-part>
[exec] /bin/bash ./libtool --mode=install /usr/bin/install -c 'wordcount-nopipe' '<https://hudson.apache.org/hudson/job/Hadoop-Mapreduce-trunk-Commit/ws/trunk/build-fi/system/c++-examples/Linux-i386-32/bin/wordcount-nopipe'>
[exec] /usr/bin/install -c wordcount-nopipe <https://hudson.apache.org/hudson/job/Hadoop-Mapreduce-trunk-Commit/ws/trunk/build-fi/system/c++-examples/Linux-i386-32/bin/wordcount-nopipe>
[exec] /bin/bash ./libtool --mode=install /usr/bin/install -c 'pipes-sort' '<https://hudson.apache.org/hudson/job/Hadoop-Mapreduce-trunk-Commit/ws/trunk/build-fi/system/c++-examples/Linux-i386-32/bin/pipes-sort'>
[exec] /usr/bin/install -c pipes-sort <https://hudson.apache.org/hudson/job/Hadoop-Mapreduce-trunk-Commit/ws/trunk/build-fi/system/c++-examples/Linux-i386-32/bin/pipes-sort>
[exec] make[1]: Nothing to be done for `install-data-am'.
[exec] make[1]: Leaving directory `<https://hudson.apache.org/hudson/job/Hadoop-Mapreduce-trunk-Commit/ws/trunk/build-fi/system/c++-build/Linux-i386-32/examples/pipes'>
compile-c++-examples:
compile-examples:
[javac] Compiling 43 source files to <https://hudson.apache.org/hudson/job/Hadoop-Mapreduce-trunk-Commit/ws/trunk/build-fi/system/examples>
[javac] <https://hudson.apache.org/hudson/job/Hadoop-Mapreduce-trunk-Commit/ws/trunk/src/examples/org/apache/hadoop/examples/AggregateWordCount.java>:26: cannot access org.apache.hadoop.io.Text
[javac] bad class file: org/apache/hadoop/io/Text.class(org/apache/hadoop/io:Text.class)
[javac] unable to access file: /homes/hudson/.ivy2/cache/org.apache.hadoop/hadoop-common/jars/hadoop-common-0.22.0-SNAPSHOT.jar (No such file or directory)
[javac] Please remove or make sure it appears in the correct subdirectory of the classpath.
[javac] import org.apache.hadoop.io.Text;
[javac] ^
BUILD FAILED
<https://hudson.apache.org/hudson/job/Hadoop-Mapreduce-trunk-Commit/ws/trunk/src/test/aop/build/aop.xml>:233: The following error occurred while executing this line:
<https://hudson.apache.org/hudson/job/Hadoop-Mapreduce-trunk-Commit/ws/trunk/src/test/aop/build/aop.xml>:214: The following error occurred while executing this line:
<https://hudson.apache.org/hudson/job/Hadoop-Mapreduce-trunk-Commit/ws/trunk/build.xml>:447: Compile failed; see the compiler error output for details.
Total time: 1 minute 29 seconds
======================================================================
======================================================================
STORE: saving artifacts
======================================================================
======================================================================
mv: cannot stat `build/*.tar.gz': No such file or directory
mv: cannot stat `build/test/findbugs': No such file or directory
mv: cannot stat `build/docs/api': No such file or directory
Build Failed
[FINDBUGS] Skipping publisher since build result is FAILURE
Publishing Javadoc
Archiving artifacts
Recording test results
Recording fingerprints
Publishing Clover coverage report...
No Clover report will be published due to a Build Failure
Build failed in Hudson: Hadoop-Mapreduce-trunk-Commit #551
Posted by Apache Hudson Server <hu...@hudson.apache.org>.
See <https://hudson.apache.org/hudson/job/Hadoop-Mapreduce-trunk-Commit/551/>
------------------------------------------
[...truncated 11217 lines...]
[clover] Elapsed time = 1.852 secs. (173.326 files/sec, 40,606.371 srclines/sec)
[javac] /tmp/clover4095881467918772705.tmp/org/apache/hadoop/mapred/TestTextOutputFormat.java:73: warning: [unchecked] unchecked call to write(K,V) as a member of the raw type org.apache.hadoop.mapred.RecordWriter
[javac] __CLR3_0_21fz91fz9ggq60tp8.R.inc(67389);theRecordWriter.write(key1, val1);
[javac] ^
[javac] /tmp/clover4095881467918772705.tmp/org/apache/hadoop/mapred/TestTextOutputFormat.java:74: warning: [unchecked] unchecked call to write(K,V) as a member of the raw type org.apache.hadoop.mapred.RecordWriter
[javac] __CLR3_0_21fz91fz9ggq60tp8.R.inc(67390);theRecordWriter.write(null, nullWritable);
[javac] ^
[javac] /tmp/clover4095881467918772705.tmp/org/apache/hadoop/mapred/TestTextOutputFormat.java:75: warning: [unchecked] unchecked call to write(K,V) as a member of the raw type org.apache.hadoop.mapred.RecordWriter
[javac] __CLR3_0_21fz91fz9ggq60tp8.R.inc(67391);theRecordWriter.write(null, val1);
[javac] ^
[javac] /tmp/clover4095881467918772705.tmp/org/apache/hadoop/mapred/TestTextOutputFormat.java:76: warning: [unchecked] unchecked call to write(K,V) as a member of the raw type org.apache.hadoop.mapred.RecordWriter
[javac] __CLR3_0_21fz91fz9ggq60tp8.R.inc(67392);theRecordWriter.write(nullWritable, val2);
[javac] ^
[javac] /tmp/clover4095881467918772705.tmp/org/apache/hadoop/mapred/TestTextOutputFormat.java:77: warning: [unchecked] unchecked call to write(K,V) as a member of the raw type org.apache.hadoop.mapred.RecordWriter
[javac] __CLR3_0_21fz91fz9ggq60tp8.R.inc(67393);theRecordWriter.write(key2, nullWritable);
[javac] ^
[javac] /tmp/clover4095881467918772705.tmp/org/apache/hadoop/mapred/TestTextOutputFormat.java:78: warning: [unchecked] unchecked call to write(K,V) as a member of the raw type org.apache.hadoop.mapred.RecordWriter
[javac] __CLR3_0_21fz91fz9ggq60tp8.R.inc(67394);theRecordWriter.write(key1, null);
[javac] ^
[javac] /tmp/clover4095881467918772705.tmp/org/apache/hadoop/mapred/TestTextOutputFormat.java:79: warning: [unchecked] unchecked call to write(K,V) as a member of the raw type org.apache.hadoop.mapred.RecordWriter
[javac] __CLR3_0_21fz91fz9ggq60tp8.R.inc(67395);theRecordWriter.write(null, null);
[javac] ^
[javac] /tmp/clover4095881467918772705.tmp/org/apache/hadoop/mapred/TestTextOutputFormat.java:80: warning: [unchecked] unchecked call to write(K,V) as a member of the raw type org.apache.hadoop.mapred.RecordWriter
[javac] __CLR3_0_21fz91fz9ggq60tp8.R.inc(67396);theRecordWriter.write(key2, val2);
[javac] ^
[javac] /tmp/clover4095881467918772705.tmp/org/apache/hadoop/mapred/TestTextOutputFormat.java:126: warning: [unchecked] unchecked call to write(K,V) as a member of the raw type org.apache.hadoop.mapred.RecordWriter
[javac] __CLR3_0_21fz91fz9ggq60tp8.R.inc(67430);theRecordWriter.write(key1, val1);
[javac] ^
[javac] /tmp/clover4095881467918772705.tmp/org/apache/hadoop/mapred/TestTextOutputFormat.java:127: warning: [unchecked] unchecked call to write(K,V) as a member of the raw type org.apache.hadoop.mapred.RecordWriter
[javac] __CLR3_0_21fz91fz9ggq60tp8.R.inc(67431);theRecordWriter.write(null, nullWritable);
[javac] ^
[javac] /tmp/clover4095881467918772705.tmp/org/apache/hadoop/mapred/TestTextOutputFormat.java:128: warning: [unchecked] unchecked call to write(K,V) as a member of the raw type org.apache.hadoop.mapred.RecordWriter
[javac] __CLR3_0_21fz91fz9ggq60tp8.R.inc(67432);theRecordWriter.write(null, val1);
[javac] ^
[javac] /tmp/clover4095881467918772705.tmp/org/apache/hadoop/mapred/TestTextOutputFormat.java:129: warning: [unchecked] unchecked call to write(K,V) as a member of the raw type org.apache.hadoop.mapred.RecordWriter
[javac] __CLR3_0_21fz91fz9ggq60tp8.R.inc(67433);theRecordWriter.write(nullWritable, val2);
[javac] ^
[javac] /tmp/clover4095881467918772705.tmp/org/apache/hadoop/mapred/TestTextOutputFormat.java:130: warning: [unchecked] unchecked call to write(K,V) as a member of the raw type org.apache.hadoop.mapred.RecordWriter
[javac] __CLR3_0_21fz91fz9ggq60tp8.R.inc(67434);theRecordWriter.write(key2, nullWritable);
[javac] ^
[javac] /tmp/clover4095881467918772705.tmp/org/apache/hadoop/mapred/TestTextOutputFormat.java:131: warning: [unchecked] unchecked call to write(K,V) as a member of the raw type org.apache.hadoop.mapred.RecordWriter
[javac] __CLR3_0_21fz91fz9ggq60tp8.R.inc(67435);theRecordWriter.write(key1, null);
[javac] ^
[javac] /tmp/clover4095881467918772705.tmp/org/apache/hadoop/mapred/TestTextOutputFormat.java:132: warning: [unchecked] unchecked call to write(K,V) as a member of the raw type org.apache.hadoop.mapred.RecordWriter
[javac] __CLR3_0_21fz91fz9ggq60tp8.R.inc(67436);theRecordWriter.write(null, null);
[javac] ^
[javac] /tmp/clover4095881467918772705.tmp/org/apache/hadoop/mapred/TestTextOutputFormat.java:133: warning: [unchecked] unchecked call to write(K,V) as a member of the raw type org.apache.hadoop.mapred.RecordWriter
[javac] __CLR3_0_21fz91fz9ggq60tp8.R.inc(67437);theRecordWriter.write(key2, val2);
[javac] ^
[javac] /tmp/clover4095881467918772705.tmp/org/apache/hadoop/mapreduce/lib/partition/TestInputSampler.java:115: warning: [unchecked] unchecked conversion
[javac] found : org.apache.hadoop.io.IntWritable.Comparator
[javac] required: java.util.Comparator<? super java.lang.Object>
[javac] __CLR3_0_21mfi1mfiggq60u04.R.inc(75773);Arrays.sort(samples, new IntWritable.Comparator());
[javac] ^
[javac] /tmp/clover4095881467918772705.tmp/org/apache/hadoop/mapreduce/lib/partition/TestInputSampler.java:115: warning: [unchecked] unchecked method invocation: <T>sort(T[],java.util.Comparator<? super T>) in java.util.Arrays is applied to (java.lang.Object[],org.apache.hadoop.io.IntWritable.Comparator)
[javac] __CLR3_0_21mfi1mfiggq60u04.R.inc(75773);Arrays.sort(samples, new IntWritable.Comparator());
[javac] ^
[javac] /tmp/clover4095881467918772705.tmp/org/apache/hadoop/mapreduce/lib/partition/TestInputSampler.java:143: warning: [unchecked] unchecked conversion
[javac] found : org.apache.hadoop.io.IntWritable.Comparator
[javac] required: java.util.Comparator<? super java.lang.Object>
[javac] __CLR3_0_21mfi1mfiggq60u04.R.inc(75792);Arrays.sort(samples, new IntWritable.Comparator());
[javac] ^
[javac] /tmp/clover4095881467918772705.tmp/org/apache/hadoop/mapreduce/lib/partition/TestInputSampler.java:143: warning: [unchecked] unchecked method invocation: <T>sort(T[],java.util.Comparator<? super T>) in java.util.Arrays is applied to (java.lang.Object[],org.apache.hadoop.io.IntWritable.Comparator)
[javac] __CLR3_0_21mfi1mfiggq60u04.R.inc(75792);Arrays.sort(samples, new IntWritable.Comparator());
[javac] ^
[javac] /tmp/clover4095881467918772705.tmp/org/apache/hadoop/mapreduce/lib/input/TestDelegatingInputFormat.java:65: warning: [unchecked] unchecked cast
[javac] found : java.util.List
[javac] required: java.util.List<org.apache.hadoop.mapreduce.InputSplit>
[javac] __CLR3_0_21hyw1hywggq60tsg.R.inc(69962);for (InputSplit split : (List<InputSplit>)inFormat.getSplits(job)) {{
[javac] ^
[javac] Note: Some input files use or override a deprecated API.
[javac] Note: Recompile with -Xlint:deprecation for details.
[javac] 21 warnings
[javac] Compiling 9 source files to <https://hudson.apache.org/hudson/job/Hadoop-Mapreduce-trunk-Commit/ws/trunk/build/test/mapred/testjar>
[clover] Clover Version 3.0.2, built on April 13 2010 (build-790)
[clover] Loaded from: /homes/hudson/tools/clover/latest/lib/clover.jar
[clover] Clover: Open Source License registered to Apache.
[clover] Updating existing database at '<https://hudson.apache.org/hudson/job/Hadoop-Mapreduce-trunk-Commit/ws/trunk/build/test/clover/db/hadoop_coverage.db'.>
[clover] Processing files at 1.6 source level.
[clover] Clover all over. Instrumented 9 files (2 packages).
[clover] Elapsed time = 0.016 secs. (562.5 files/sec, 35,875 srclines/sec)
[javac] Note: Some input files use or override a deprecated API.
[javac] Note: Recompile with -Xlint:deprecation for details.
[jar] Building jar: <https://hudson.apache.org/hudson/job/Hadoop-Mapreduce-trunk-Commit/ws/trunk/build/test/mapred/testjar/testjob.jar>
[javac] Compiling 1 source file to <https://hudson.apache.org/hudson/job/Hadoop-Mapreduce-trunk-Commit/ws/trunk/build/test/mapred/testshell>
[clover] Clover Version 3.0.2, built on April 13 2010 (build-790)
[clover] Loaded from: /homes/hudson/tools/clover/latest/lib/clover.jar
[clover] Clover: Open Source License registered to Apache.
[clover] Updating existing database at '<https://hudson.apache.org/hudson/job/Hadoop-Mapreduce-trunk-Commit/ws/trunk/build/test/clover/db/hadoop_coverage.db'.>
[clover] Processing files at 1.6 source level.
[clover] Clover all over. Instrumented 1 file (1 package).
[clover] Elapsed time = 0.003 secs. (333.333 files/sec, 47,000 srclines/sec)
[javac] Note: /tmp/clover8252872841746122819.tmp/testshell/ExternalMapReduce.java uses or overrides a deprecated API.
[javac] Note: Recompile with -Xlint:deprecation for details.
[jar] Building jar: <https://hudson.apache.org/hudson/job/Hadoop-Mapreduce-trunk-Commit/ws/trunk/build/test/mapred/testshell/testshell.jar>
[mkdir] Created dir: <https://hudson.apache.org/hudson/job/Hadoop-Mapreduce-trunk-Commit/ws/trunk/build/test/cache>
[mkdir] Created dir: <https://hudson.apache.org/hudson/job/Hadoop-Mapreduce-trunk-Commit/ws/trunk/build/test/debug>
[copy] Copying 1 file to <https://hudson.apache.org/hudson/job/Hadoop-Mapreduce-trunk-Commit/ws/trunk/build/test/debug>
[copy] Copying 1 file to <https://hudson.apache.org/hudson/job/Hadoop-Mapreduce-trunk-Commit/ws/trunk/build/test/cache>
[copy] Copying 1 file to <https://hudson.apache.org/hudson/job/Hadoop-Mapreduce-trunk-Commit/ws/trunk/build/test/cache>
[copy] Copying 1 file to <https://hudson.apache.org/hudson/job/Hadoop-Mapreduce-trunk-Commit/ws/trunk/build/test/cache>
[copy] Copying 1 file to <https://hudson.apache.org/hudson/job/Hadoop-Mapreduce-trunk-Commit/ws/trunk/build/test/cache>
[copy] Copying 1 file to <https://hudson.apache.org/hudson/job/Hadoop-Mapreduce-trunk-Commit/ws/trunk/build/test/cache>
[copy] Copying 1 file to <https://hudson.apache.org/hudson/job/Hadoop-Mapreduce-trunk-Commit/ws/trunk/build/test/cache>
[copy] Copying 1 file to <https://hudson.apache.org/hudson/job/Hadoop-Mapreduce-trunk-Commit/ws/trunk/build/test/cache>
[copy] Copying 1 file to <https://hudson.apache.org/hudson/job/Hadoop-Mapreduce-trunk-Commit/ws/trunk/build/test/cache>
run-commit-test:
[mkdir] Created dir: <https://hudson.apache.org/hudson/job/Hadoop-Mapreduce-trunk-Commit/ws/trunk/build/test/data>
[mkdir] Created dir: <https://hudson.apache.org/hudson/job/Hadoop-Mapreduce-trunk-Commit/ws/trunk/build/test/logs>
[copy] Copying 1 file to <https://hudson.apache.org/hudson/job/Hadoop-Mapreduce-trunk-Commit/ws/trunk/build/test/extraconf>
[copy] Copying 1 file to <https://hudson.apache.org/hudson/job/Hadoop-Mapreduce-trunk-Commit/ws/trunk/build/test/extraconf>
[junit] WARNING: multiple versions of ant detected in path for junit
[junit] jar:file:/homes/hudson/tools/ant/latest/lib/ant.jar!/org/apache/tools/ant/Project.class
[junit] and jar:file:/homes/hudson/.ivy2/cache/ant/ant/jars/ant-1.6.5.jar!/org/apache/tools/ant/Project.class
[junit] Running org.apache.hadoop.mapred.TestCollect
[junit] Tests run: 1, Failures: 0, Errors: 0, Time elapsed: 2.965 sec
[junit] Running org.apache.hadoop.mapred.TestCommandLineJobSubmission
[junit] Tests run: 1, Failures: 0, Errors: 0, Time elapsed: 88.923 sec
[junit] Running org.apache.hadoop.mapred.TestComparators
[junit] Tests run: 5, Failures: 0, Errors: 0, Time elapsed: 5.349 sec
[junit] Running org.apache.hadoop.mapred.TestCounters
[junit] Tests run: 1, Failures: 0, Errors: 0, Time elapsed: 0.272 sec
[junit] Running org.apache.hadoop.mapred.TestFileInputFormat
[junit] Tests run: 3, Failures: 0, Errors: 0, Time elapsed: 35.373 sec
[junit] Running org.apache.hadoop.mapred.TestFileInputFormatPathFilter
[junit] Tests run: 4, Failures: 0, Errors: 0, Time elapsed: 0.526 sec
[junit] Running org.apache.hadoop.mapred.TestFileOutputCommitter
[junit] Tests run: 3, Failures: 0, Errors: 0, Time elapsed: 0.511 sec
[junit] Running org.apache.hadoop.mapred.TestFileOutputFormat
[junit] Tests run: 1, Failures: 0, Errors: 0, Time elapsed: 1.315 sec
[junit] Running org.apache.hadoop.mapred.TestGetSplitHosts
[junit] Tests run: 1, Failures: 0, Errors: 0, Time elapsed: 0.25 sec
[junit] Running org.apache.hadoop.mapred.TestIFileStreams
[junit] Tests run: 3, Failures: 0, Errors: 0, Time elapsed: 0.176 sec
[junit] Running org.apache.hadoop.mapred.TestIndexCache
[junit] Tests run: 2, Failures: 0, Errors: 0, Time elapsed: 0.703 sec
[junit] Running org.apache.hadoop.mapred.TestJavaSerialization
[junit] Tests run: 2, Failures: 0, Errors: 0, Time elapsed: 3.261 sec
[junit] Running org.apache.hadoop.mapred.TestJobHistoryParsing
[junit] Tests run: 1, Failures: 0, Errors: 0, Time elapsed: 4.721 sec
[junit] Running org.apache.hadoop.mapred.TestJobInProgress
[junit] Tests run: 3, Failures: 0, Errors: 0, Time elapsed: 76.54 sec
[junit] Running org.apache.hadoop.mapred.TestJobQueueTaskScheduler
[junit] Tests run: 3, Failures: 0, Errors: 0, Time elapsed: 1.171 sec
[junit] Running org.apache.hadoop.mapred.TestKillCompletedJob
[junit] Tests run: 1, Failures: 0, Errors: 0, Time elapsed: 116.903 sec
[junit] Running org.apache.hadoop.mapred.TestLostTracker
[junit] Tests run: 3, Failures: 0, Errors: 0, Time elapsed: 120.07 sec
[junit] Running org.apache.hadoop.mapred.TestMapOutputType
[junit] Tests run: 3, Failures: 0, Errors: 0, Time elapsed: 4.176 sec
[junit] Running org.apache.hadoop.mapred.TestMapRed
[junit] Tests run: 5, Failures: 0, Errors: 0, Time elapsed: 24.674 sec
[junit] Running org.apache.hadoop.mapred.TestMiniMRDFSCaching
[junit] Tests run: 1, Failures: 0, Errors: 0, Time elapsed: 140.195 sec
[junit] Running org.apache.hadoop.mapred.TestQueueAclsForCurrentUser
[junit] Tests run: 3, Failures: 0, Errors: 0, Time elapsed: 0.576 sec
[junit] Running org.apache.hadoop.mapred.TestRackAwareTaskPlacement
[junit] Tests run: 1, Failures: 0, Errors: 0, Time elapsed: 41.389 sec
[junit] Running org.apache.hadoop.mapred.TestReduceFetchFromPartialMem
[junit] Tests run: 1, Failures: 0, Errors: 0, Time elapsed: 201.085 sec
[junit] Running org.apache.hadoop.mapred.TestReduceTask
[junit] Tests run: 2, Failures: 0, Errors: 0, Time elapsed: 0.576 sec
[junit] Running org.apache.hadoop.mapred.TestSequenceFileAsBinaryInputFormat
[junit] Tests run: 1, Failures: 0, Errors: 0, Time elapsed: 0.867 sec
[junit] Running org.apache.hadoop.mapred.TestSequenceFileAsBinaryOutputFormat
[junit] Tests run: 3, Failures: 0, Errors: 0, Time elapsed: 1.037 sec
[junit] Running org.apache.hadoop.mapred.TestSequenceFileInputFormat
[junit] Tests run: 1, Failures: 0, Errors: 0, Time elapsed: 5.672 sec
[junit] Running org.apache.hadoop.mapred.TestSeveral
[junit] Tests run: 3, Failures: 0, Errors: 0, Time elapsed: 61.86 sec
[junit] Running org.apache.hadoop.mapred.TestSpeculativeExecution
[junit] Tests run: 5, Failures: 0, Errors: 0, Time elapsed: 31.866 sec
[junit] Running org.apache.hadoop.mapred.TestTaskLimits
[junit] Tests run: 3, Failures: 0, Errors: 0, Time elapsed: 98.967 sec
[junit] Running org.apache.hadoop.mapred.TestTaskTrackerBlacklisting
[junit] Tests run: 7, Failures: 0, Errors: 0, Time elapsed: 96.757 sec
[junit] Running org.apache.hadoop.mapred.TestTextInputFormat
[junit] Tests run: 8, Failures: 0, Errors: 0, Time elapsed: 89.156 sec
[junit] Running org.apache.hadoop.mapred.TestTextOutputFormat
[junit] Tests run: 2, Failures: 0, Errors: 0, Time elapsed: 0.232 sec
[junit] Running org.apache.hadoop.mapred.TestTrackerBlacklistAcrossJobs
[junit] Tests run: 1, Failures: 0, Errors: 0, Time elapsed: 77.083 sec
[junit] Running org.apache.hadoop.mapreduce.TestCounters
[junit] Tests run: 1, Failures: 0, Errors: 0, Time elapsed: 0.163 sec
[junit] Running org.apache.hadoop.mapreduce.TestMapCollection
[junit] Tests run: 11, Failures: 0, Errors: 0, Time elapsed: 30.586 sec
[junit] Running org.apache.hadoop.mapreduce.TestMapReduceLocal
[junit] Tests run: 1, Failures: 0, Errors: 0, Time elapsed: 79.319 sec
[junit] Running org.apache.hadoop.mapreduce.lib.input.TestFileInputFormat
[junit] Tests run: 2, Failures: 0, Errors: 0, Time elapsed: 0.977 sec
[junit] Running org.apache.hadoop.mapreduce.lib.output.TestFileOutputCommitter
[junit] Tests run: 3, Failures: 0, Errors: 0, Time elapsed: 0.501 sec
checkfailure:
clover.check:
clover.setup:
[clover-setup] Clover Version 3.0.2, built on April 13 2010 (build-790)
[clover-setup] Loaded from: /homes/hudson/tools/clover/latest/lib/clover.jar
[clover-setup] Clover: Open Source License registered to Apache.
[clover-setup] Clover is enabled with initstring '<https://hudson.apache.org/hudson/job/Hadoop-Mapreduce-trunk-Commit/ws/trunk/build/test/clover/db/hadoop_coverage.db'>
clover.info:
clover:
generate-clover-reports:
[mkdir] Created dir: <https://hudson.apache.org/hudson/job/Hadoop-Mapreduce-trunk-Commit/ws/trunk/build/test/clover/reports>
[clover-report] Clover Version 3.0.2, built on April 13 2010 (build-790)
[clover-report] Loaded from: /homes/hudson/tools/clover/latest/lib/clover.jar
[clover-report] Clover: Open Source License registered to Apache.
[clover-report] Loading coverage database from: '<https://hudson.apache.org/hudson/job/Hadoop-Mapreduce-trunk-Commit/ws/trunk/build/test/clover/db/hadoop_coverage.db'>
[clover-report] Writing HTML report to '<https://hudson.apache.org/hudson/job/Hadoop-Mapreduce-trunk-Commit/ws/trunk/build/test/clover/reports'>
[clover-report] Done. Processed 54 packages in 14232ms (263ms per package).
[clover-report] Clover Version 3.0.2, built on April 13 2010 (build-790)
[clover-report] Loaded from: /homes/hudson/tools/clover/latest/lib/clover.jar
[clover-report] Clover: Open Source License registered to Apache.
[clover-report] Loading coverage database from: '<https://hudson.apache.org/hudson/job/Hadoop-Mapreduce-trunk-Commit/ws/trunk/build/test/clover/db/hadoop_coverage.db'>
[clover-report] Writing report to '<https://hudson.apache.org/hudson/job/Hadoop-Mapreduce-trunk-Commit/ws/trunk/build/test/clover/reports/clover.xml'>
BUILD SUCCESSFUL
Total time: 25 minutes 49 seconds
[FINDBUGS] Collecting findbugs analysis files...
Publishing Javadoc
ERROR: Publisher hudson.tasks.JavadocArchiver aborted due to exception
<https://hudson.apache.org/hudson/job/Hadoop-Mapreduce-trunk-Commit/ws/trunk/api> does not exist.
at org.apache.tools.ant.types.AbstractFileSet.getDirectoryScanner(AbstractFileSet.java:474)
at hudson.FilePath$34.hasMatch(FilePath.java:1715)
at hudson.FilePath$34.invoke(FilePath.java:1624)
at hudson.FilePath$34.invoke(FilePath.java:1615)
at hudson.FilePath$FileCallableWrapper.call(FilePath.java:1899)
at hudson.remoting.UserRequest.perform(UserRequest.java:114)
at hudson.remoting.UserRequest.perform(UserRequest.java:48)
at hudson.remoting.Request$2.run(Request.java:270)
at java.util.concurrent.Executors$RunnableAdapter.call(Executors.java:441)
at java.util.concurrent.FutureTask$Sync.innerRun(FutureTask.java:303)
at java.util.concurrent.FutureTask.run(FutureTask.java:138)
at java.util.concurrent.ThreadPoolExecutor$Worker.runTask(ThreadPoolExecutor.java:886)
at java.util.concurrent.ThreadPoolExecutor$Worker.run(ThreadPoolExecutor.java:908)
at java.lang.Thread.run(Thread.java:619)
Archiving artifacts
Recording test results
Recording fingerprints
Publishing Clover coverage report...
Publishing Clover HTML report...
Publishing Clover XML report...
Publishing Clover coverage results...