You are viewing a plain text version of this content. The canonical link for it is here.
Posted to commits@hudi.apache.org by "liujinhui (Jira)" <ji...@apache.org> on 2021/09/15 03:15:00 UTC

[jira] [Resolved] (HUDI-2425) TestHoodieMultiTableDeltaStreamer CI failed due to exception

     [ https://issues.apache.org/jira/browse/HUDI-2425?page=com.atlassian.jira.plugin.system.issuetabpanels:all-tabpanel ]

liujinhui resolved HUDI-2425.
-----------------------------
    Resolution: Fixed

> TestHoodieMultiTableDeltaStreamer CI failed due to exception
> ------------------------------------------------------------
>
>                 Key: HUDI-2425
>                 URL: https://issues.apache.org/jira/browse/HUDI-2425
>             Project: Apache Hudi
>          Issue Type: Bug
>            Reporter: liujinhui
>            Assignee: liujinhui
>            Priority: Blocker
>              Labels: pull-request-available
>             Fix For: 0.10.0
>
>
> CI . ERROR
> [ERROR] Failures:
> [ERROR] TestHoodieMultiTableDeltaStreamer.testInvalidHiveSyncProps:82 expected: but was:
> [INFO]
> [ERROR] Tests run: 167, Failures: 1, Errors: 0, Skipped: 1



--
This message was sent by Atlassian Jira
(v8.3.4#803005)