You are viewing a plain text version of this content. The canonical link for it is here.
Posted to builds@beam.apache.org by Apache Jenkins Server <je...@builds.apache.org> on 2022/04/18 22:20:52 UTC

Build failed in Jenkins: beam_PostCommit_Python36 #5209

See <https://ci-beam.apache.org/job/beam_PostCommit_Python36/5209/display/redirect?page=changes>

Changes:

[rarokni] [BEAM-14307] Fix Slow Side input pattern bug in sample

[noreply] [BEAM-14316] Introducing KafkaIO.Read implementation compatibility


------------------------------------------
[...truncated 149.14 KB...]
  nanos: 969057559
}
message: "Closing all cached gRPC state handlers."
log_location: "/usr/local/lib/python3.6/site-packages/apache_beam/runners/worker/sdk_worker.py:859"
thread: "MainThread"

INFO:root:severity: INFO
timestamp {
  seconds: 1650315474
  nanos: 969306230
}
message: "Done consuming work."
log_location: "/usr/local/lib/python3.6/site-packages/apache_beam/runners/worker/sdk_worker.py:257"
thread: "MainThread"

INFO:root:severity: INFO
timestamp {
  seconds: 1650315474
  nanos: 969428062
}
message: "Python sdk harness exiting."
log_location: "/usr/local/lib/python3.6/site-packages/apache_beam/runners/worker/sdk_worker_main.py:181"
thread: "MainThread"

INFO:apache_beam.runners.portability.local_job_service:Completed job in 9.097687721252441 seconds with state DONE.
INFO:root:Completed job in 9.097687721252441 seconds with state DONE.
INFO:apache_beam.runners.portability.portable_runner:Job state changed to DONE

> Task :sdks:python:test-suites:portable:py36:portableWordCountSparkRunnerBatch
INFO:apache_beam.runners.worker.worker_pool_main:Listening for workers at localhost:39637
WARNING:root:Make sure that locally built Python SDK docker image has Python 3.6 interpreter.
INFO:root:Default Python SDK image for environment is apache/beam_python3.6_sdk:2.39.0.dev
INFO:apache_beam.runners.portability.fn_api_runner.translations:==================== <function pack_combiners at 0x7faaff69f7b8> ====================
INFO:apache_beam.runners.portability.fn_api_runner.translations:==================== <function lift_combiners at 0x7faaff69f840> ====================
INFO:apache_beam.runners.portability.fn_api_runner.translations:==================== <function sort_stages at 0x7faaff69ff28> ====================
INFO:apache_beam.utils.subprocess_server:Starting service with ['java' '-jar' '<https://ci-beam.apache.org/job/beam_PostCommit_Python36/ws/src/runners/spark/2/job-server/build/libs/beam-runners-spark-job-server-2.39.0-SNAPSHOT.jar'> '--spark-master-url' 'local[4]' '--artifacts-dir' '/tmp/beam-tempiqkez8gk/artifactsb1mc0e81' '--job-port' '45385' '--artifact-port' '0' '--expansion-port' '0']
E0418 20:57:58.310514795 3495726 fork_posix.cc:70]           Fork support is only compatible with the epoll1 and poll polling strategies
INFO:apache_beam.utils.subprocess_server:b'22/04/18 20:57:59 WARN software.amazon.awssdk.regions.internal.util.EC2MetadataUtils: Unable to retrieve the requested metadata.'
INFO:apache_beam.utils.subprocess_server:b'22/04/18 20:58:00 INFO org.apache.beam.runners.jobsubmission.JobServerDriver: ArtifactStagingService started on localhost:35819'
INFO:apache_beam.utils.subprocess_server:b'22/04/18 20:58:00 INFO org.apache.beam.runners.jobsubmission.JobServerDriver: Java ExpansionService started on localhost:44481'
INFO:apache_beam.utils.subprocess_server:b'22/04/18 20:58:00 INFO org.apache.beam.runners.jobsubmission.JobServerDriver: JobService started on localhost:45385'
INFO:apache_beam.utils.subprocess_server:b'22/04/18 20:58:00 INFO org.apache.beam.runners.jobsubmission.JobServerDriver: Job server now running, terminate with Ctrl+C'
WARNING:apache_beam.options.pipeline_options:Discarding unparseable args: ['--parallelism=2']
INFO:apache_beam.utils.subprocess_server:b'22/04/18 20:58:00 INFO org.apache.beam.runners.fnexecution.artifact.ArtifactStagingService: Staging artifacts for job_75900cb0-a9fb-4528-b54c-a1391ee79fcd.'
INFO:apache_beam.utils.subprocess_server:b'22/04/18 20:58:00 INFO org.apache.beam.runners.fnexecution.artifact.ArtifactStagingService: Resolving artifacts for job_75900cb0-a9fb-4528-b54c-a1391ee79fcd.ref_Environment_default_environment_1.'
INFO:apache_beam.utils.subprocess_server:b'22/04/18 20:58:00 INFO org.apache.beam.runners.fnexecution.artifact.ArtifactStagingService: Getting 1 artifacts for job_75900cb0-a9fb-4528-b54c-a1391ee79fcd.null.'
INFO:apache_beam.utils.subprocess_server:b'22/04/18 20:58:01 INFO org.apache.beam.runners.fnexecution.artifact.ArtifactStagingService: Artifacts fully staged for job_75900cb0-a9fb-4528-b54c-a1391ee79fcd.'
INFO:apache_beam.utils.subprocess_server:b'22/04/18 20:58:01 INFO org.apache.beam.runners.spark.SparkJobInvoker: Invoking job BeamApp-jenkins-0418205801-1672bb2c_791f51f2-415e-4076-b008-cf252b05a7a7'
INFO:apache_beam.utils.subprocess_server:b'22/04/18 20:58:01 INFO org.apache.beam.runners.jobsubmission.JobInvocation: Starting job invocation BeamApp-jenkins-0418205801-1672bb2c_791f51f2-415e-4076-b008-cf252b05a7a7'
INFO:apache_beam.runners.portability.portable_runner:Environment "LOOPBACK" has started a component necessary for the execution. Be sure to run the pipeline using
  with Pipeline() as p:
    p.apply(..)
This ensures that the pipeline finishes before this program exits.
INFO:apache_beam.runners.portability.portable_runner:Job state changed to STOPPED
INFO:apache_beam.runners.portability.portable_runner:Job state changed to STARTING
INFO:apache_beam.runners.portability.portable_runner:Job state changed to RUNNING
INFO:apache_beam.utils.subprocess_server:b'22/04/18 20:58:01 INFO org.apache.beam.runners.spark.translation.SparkContextFactory: Creating a brand new Spark Context.'
INFO:apache_beam.utils.subprocess_server:b'22/04/18 20:58:01 WARN org.apache.hadoop.util.NativeCodeLoader: Unable to load native-hadoop library for your platform... using builtin-java classes where applicable'
INFO:apache_beam.utils.subprocess_server:b'22/04/18 20:58:02 INFO org.apache.beam.runners.spark.aggregators.AggregatorsAccumulator: Instantiated aggregators accumulator:'
INFO:apache_beam.utils.subprocess_server:b'22/04/18 20:58:02 INFO org.apache.beam.runners.spark.metrics.MetricsAccumulator: Instantiated metrics accumulator: MetricQueryResults()'
INFO:apache_beam.utils.subprocess_server:b'22/04/18 20:58:02 WARN software.amazon.awssdk.regions.internal.util.EC2MetadataUtils: Unable to retrieve the requested metadata.'
INFO:apache_beam.utils.subprocess_server:b'22/04/18 20:58:02 INFO org.apache.beam.runners.spark.SparkPipelineRunner: Running job BeamApp-jenkins-0418205801-1672bb2c_791f51f2-415e-4076-b008-cf252b05a7a7 on Spark master local[4]'
INFO:apache_beam.utils.subprocess_server:b'22/04/18 20:58:03 WARN software.amazon.awssdk.regions.internal.util.EC2MetadataUtils: Unable to retrieve the requested metadata.'
INFO:apache_beam.utils.subprocess_server:b'22/04/18 20:58:03 WARN software.amazon.awssdk.regions.internal.util.EC2MetadataUtils: Unable to retrieve the requested metadata.'
INFO:apache_beam.utils.subprocess_server:b'22/04/18 20:58:03 WARN software.amazon.awssdk.regions.internal.util.EC2MetadataUtils: Unable to retrieve the requested metadata.'
INFO:apache_beam.utils.subprocess_server:b'22/04/18 20:58:03 WARN software.amazon.awssdk.regions.internal.util.EC2MetadataUtils: Unable to retrieve the requested metadata.'
INFO:apache_beam.runners.worker.statecache:Creating state cache with size 0
INFO:apache_beam.runners.worker.sdk_worker:Creating insecure control channel for localhost:46613.
INFO:apache_beam.runners.worker.sdk_worker:Control channel established.
INFO:apache_beam.runners.worker.sdk_worker:Initializing SDKHarness with unbounded number of workers.
INFO:apache_beam.utils.subprocess_server:b'22/04/18 20:58:03 INFO org.apache.beam.runners.fnexecution.control.FnApiControlClientPoolService: Beam Fn Control client connected with id 1-1'
INFO:apache_beam.utils.subprocess_server:b'22/04/18 20:58:03 INFO org.apache.beam.runners.fnexecution.control.FnApiControlClientPoolService: getProcessBundleDescriptor request with id 1-2'
INFO:apache_beam.runners.worker.sdk_worker:Creating insecure state channel for localhost:37553.
INFO:apache_beam.runners.worker.sdk_worker:State channel established.
INFO:apache_beam.runners.worker.data_plane:Creating client data channel for localhost:38113
INFO:apache_beam.utils.subprocess_server:b'22/04/18 20:58:03 INFO org.apache.beam.runners.fnexecution.data.GrpcDataService: Beam Fn Data client connected.'
INFO:apache_beam.utils.subprocess_server:b'22/04/18 20:58:03 INFO org.apache.beam.runners.fnexecution.control.FnApiControlClientPoolService: getProcessBundleDescriptor request with id 1-3'
INFO:apache_beam.utils.subprocess_server:b'22/04/18 20:58:03 WARN software.amazon.awssdk.regions.internal.util.EC2MetadataUtils: Unable to retrieve the requested metadata.'
INFO:apache_beam.utils.subprocess_server:b'22/04/18 20:58:03 WARN software.amazon.awssdk.regions.internal.util.EC2MetadataUtils: Unable to retrieve the requested metadata.'
INFO:apache_beam.utils.subprocess_server:b'22/04/18 20:58:03 WARN software.amazon.awssdk.regions.internal.util.EC2MetadataUtils: Unable to retrieve the requested metadata.'
INFO:apache_beam.utils.subprocess_server:b'22/04/18 20:58:03 WARN software.amazon.awssdk.regions.internal.util.EC2MetadataUtils: Unable to retrieve the requested metadata.'
INFO:apache_beam.utils.subprocess_server:b'22/04/18 20:58:03 INFO org.apache.beam.runners.fnexecution.control.FnApiControlClientPoolService: getProcessBundleDescriptor request with id 1-4'
INFO:apache_beam.utils.subprocess_server:b'22/04/18 20:58:04 INFO org.apache.beam.runners.fnexecution.control.FnApiControlClientPoolService: getProcessBundleDescriptor request with id 1-5'
INFO:apache_beam.utils.subprocess_server:b'22/04/18 20:58:04 WARN software.amazon.awssdk.regions.internal.util.EC2MetadataUtils: Unable to retrieve the requested metadata.'
INFO:apache_beam.utils.subprocess_server:b'22/04/18 20:58:04 WARN software.amazon.awssdk.regions.internal.util.EC2MetadataUtils: Unable to retrieve the requested metadata.'
INFO:apache_beam.utils.subprocess_server:b'22/04/18 20:58:04 WARN software.amazon.awssdk.regions.internal.util.EC2MetadataUtils: Unable to retrieve the requested metadata.'
INFO:apache_beam.utils.subprocess_server:b'22/04/18 20:58:04 WARN software.amazon.awssdk.regions.internal.util.EC2MetadataUtils: Unable to retrieve the requested metadata.'
INFO:apache_beam.utils.subprocess_server:b'22/04/18 20:58:04 INFO org.apache.beam.runners.fnexecution.control.FnApiControlClientPoolService: getProcessBundleDescriptor request with id 1-7'
INFO:apache_beam.utils.subprocess_server:b'22/04/18 20:58:04 INFO org.apache.beam.runners.fnexecution.control.FnApiControlClientPoolService: getProcessBundleDescriptor request with id 1-6'
INFO:apache_beam.utils.subprocess_server:b'22/04/18 20:58:04 INFO org.apache.beam.runners.fnexecution.control.FnApiControlClientPoolService: getProcessBundleDescriptor request with id 1-9'
INFO:apache_beam.utils.subprocess_server:b'22/04/18 20:58:04 INFO org.apache.beam.runners.fnexecution.control.FnApiControlClientPoolService: getProcessBundleDescriptor request with id 1-8'
INFO:apache_beam.utils.subprocess_server:b'22/04/18 20:58:04 INFO org.apache.beam.runners.fnexecution.control.FnApiControlClientPoolService: getProcessBundleDescriptor request with id 1-10'
INFO:apache_beam.utils.subprocess_server:b'22/04/18 20:58:04 INFO org.apache.beam.runners.fnexecution.control.FnApiControlClientPoolService: getProcessBundleDescriptor request with id 1-12'
INFO:apache_beam.utils.subprocess_server:b'22/04/18 20:58:04 INFO org.apache.beam.runners.fnexecution.control.FnApiControlClientPoolService: getProcessBundleDescriptor request with id 1-11'
INFO:apache_beam.utils.subprocess_server:b'22/04/18 20:58:04 INFO org.apache.beam.runners.fnexecution.control.FnApiControlClientPoolService: getProcessBundleDescriptor request with id 1-13'
INFO:apache_beam.utils.subprocess_server:b'22/04/18 20:58:04 WARN software.amazon.awssdk.regions.internal.util.EC2MetadataUtils: Unable to retrieve the requested metadata.'
INFO:apache_beam.utils.subprocess_server:b'22/04/18 20:58:04 WARN software.amazon.awssdk.regions.internal.util.EC2MetadataUtils: Unable to retrieve the requested metadata.'
INFO:apache_beam.utils.subprocess_server:b'22/04/18 20:58:04 WARN software.amazon.awssdk.regions.internal.util.EC2MetadataUtils: Unable to retrieve the requested metadata.'
INFO:apache_beam.utils.subprocess_server:b'22/04/18 20:58:04 WARN software.amazon.awssdk.regions.internal.util.EC2MetadataUtils: Unable to retrieve the requested metadata.'
INFO:apache_beam.utils.subprocess_server:b'22/04/18 20:58:04 INFO org.apache.beam.runners.fnexecution.control.FnApiControlClientPoolService: getProcessBundleDescriptor request with id 1-14'
INFO:apache_beam.utils.subprocess_server:b'22/04/18 20:58:04 WARN software.amazon.awssdk.regions.internal.util.EC2MetadataUtils: Unable to retrieve the requested metadata.'
INFO:apache_beam.utils.subprocess_server:b'22/04/18 20:58:04 WARN software.amazon.awssdk.regions.internal.util.EC2MetadataUtils: Unable to retrieve the requested metadata.'
INFO:apache_beam.utils.subprocess_server:b'22/04/18 20:58:04 WARN software.amazon.awssdk.regions.internal.util.EC2MetadataUtils: Unable to retrieve the requested metadata.'
INFO:apache_beam.utils.subprocess_server:b'22/04/18 20:58:04 WARN software.amazon.awssdk.regions.internal.util.EC2MetadataUtils: Unable to retrieve the requested metadata.'
INFO:apache_beam.utils.subprocess_server:b'22/04/18 20:58:04 INFO org.apache.beam.runners.fnexecution.control.FnApiControlClientPoolService: getProcessBundleDescriptor request with id 1-15'
INFO:apache_beam.utils.subprocess_server:b'22/04/18 20:58:04 INFO org.apache.beam.runners.spark.SparkPipelineRunner: Job BeamApp-jenkins-0418205801-1672bb2c_791f51f2-415e-4076-b008-cf252b05a7a7: Pipeline translated successfully. Computing outputs'
INFO:apache_beam.utils.subprocess_server:b'22/04/18 20:58:04 WARN software.amazon.awssdk.regions.internal.util.EC2MetadataUtils: Unable to retrieve the requested metadata.'
INFO:apache_beam.utils.subprocess_server:b'22/04/18 20:58:04 WARN software.amazon.awssdk.regions.internal.util.EC2MetadataUtils: Unable to retrieve the requested metadata.'
INFO:apache_beam.utils.subprocess_server:b'22/04/18 20:58:04 WARN software.amazon.awssdk.regions.internal.util.EC2MetadataUtils: Unable to retrieve the requested metadata.'
INFO:apache_beam.utils.subprocess_server:b'22/04/18 20:58:04 WARN software.amazon.awssdk.regions.internal.util.EC2MetadataUtils: Unable to retrieve the requested metadata.'
INFO:apache_beam.utils.subprocess_server:b'22/04/18 20:58:04 INFO org.apache.beam.runners.fnexecution.control.FnApiControlClientPoolService: getProcessBundleDescriptor request with id 1-16'
INFO:apache_beam.io.filebasedsink:Starting finalize_write threads with num_shards: 4 (skipped: 0), batches: 4, num_threads: 4
INFO:apache_beam.io.filebasedsink:Renamed 4 shards in 0.10 seconds.
INFO:apache_beam.utils.subprocess_server:b'22/04/18 20:58:04 INFO org.apache.beam.runners.spark.SparkPipelineRunner: Job BeamApp-jenkins-0418205801-1672bb2c_791f51f2-415e-4076-b008-cf252b05a7a7 finished.'
INFO:apache_beam.runners.portability.portable_runner:Job state changed to DONE
ERROR:apache_beam.runners.worker.data_plane:Failed to read inputs in the data plane.
Traceback (most recent call last):
  File "<https://ci-beam.apache.org/job/beam_PostCommit_Python36/ws/src/sdks/python/apache_beam/runners/worker/data_plane.py",> line 634, in _read_inputs
    for elements in elements_iterator:
  File "<https://ci-beam.apache.org/job/beam_PostCommit_Python36/ws/src/build/gradleenv/2022703440/lib/python3.6/site-packages/grpc/_channel.py",> line 426, in __next__
    return self._next()
  File "<https://ci-beam.apache.org/job/beam_PostCommit_Python36/ws/src/build/gradleenv/2022703440/lib/python3.6/site-packages/grpc/_channel.py",> line 826, in _next
    raise self
grpc._channel._MultiThreadedRendezvous: <_MultiThreadedRendezvous of RPC that terminated with:
	status = StatusCode.UNAVAILABLE
	details = "Socket closed"
	debug_error_string = "{"created":"@1650315485.224636749","description":"Error received from peer ipv6:[::1]:38113","file":"src/core/lib/surface/call.cc","file_line":903,"grpc_message":"Socket closed","grpc_status":14}"
>
Exception in thread read_grpc_client_inputs:
Traceback (most recent call last):
  File "/usr/lib/python3.6/threading.py", line 916, in _bootstrap_inner
    self.run()
  File "/usr/lib/python3.6/threading.py", line 864, in run
    self._target(*self._args, **self._kwargs)
  File "<https://ci-beam.apache.org/job/beam_PostCommit_Python36/ws/src/sdks/python/apache_beam/runners/worker/data_plane.py",> line 651, in <lambda>
    target=lambda: self._read_inputs(elements_iterator),
  File "<https://ci-beam.apache.org/job/beam_PostCommit_Python36/ws/src/sdks/python/apache_beam/runners/worker/data_plane.py",> line 634, in _read_inputs
    for elements in elements_iterator:
  File "<https://ci-beam.apache.org/job/beam_PostCommit_Python36/ws/src/build/gradleenv/2022703440/lib/python3.6/site-packages/grpc/_channel.py",> line 426, in __next__
    return self._next()
  File "<https://ci-beam.apache.org/job/beam_PostCommit_Python36/ws/src/build/gradleenv/2022703440/lib/python3.6/site-packages/grpc/_channel.py",> line 826, in _next
    raise self
grpc._channel._MultiThreadedRendezvous: <_MultiThreadedRendezvous of RPC that terminated with:
	status = StatusCode.UNAVAILABLE
	details = "Socket closed"
	debug_error_string = "{"created":"@1650315485.224636749","description":"Error received from peer ipv6:[::1]:38113","file":"src/core/lib/surface/call.cc","file_line":903,"grpc_message":"Socket closed","grpc_status":14}"
>

Exception in thread read_state:
Traceback (most recent call last):
  File "/usr/lib/python3.6/threading.py", line 916, in _bootstrap_inner
    self.run()
  File "/usr/lib/python3.6/threading.py", line 864, in run
    self._target(*self._args, **self._kwargs)
  File "<https://ci-beam.apache.org/job/beam_PostCommit_Python36/ws/src/sdks/python/apache_beam/runners/worker/sdk_worker.py",> line 990, in pull_responses
    for response in responses:
  File "<https://ci-beam.apache.org/job/beam_PostCommit_Python36/ws/src/build/gradleenv/2022703440/lib/python3.6/site-packages/grpc/_channel.py",> line 426, in __next__
    return self._next()
  File "<https://ci-beam.apache.org/job/beam_PostCommit_Python36/ws/src/build/gradleenv/2022703440/lib/python3.6/site-packages/grpc/_channel.py",> line 826, in _next
    raise self
grpc._channel._MultiThreadedRendezvous: <_MultiThreadedRendezvous of RPC that terminated with:
	status = StatusCode.UNAVAILABLE
	details = "Socket closed"
	debug_error_string = "{"created":"@1650315485.224669421","description":"Error received from peer ipv6:[::1]:37553","file":"src/core/lib/surface/call.cc","file_line":903,"grpc_message":"Socket closed","grpc_status":14}"
>

Exception in thread run_worker_1-1:
Traceback (most recent call last):
  File "/usr/lib/python3.6/threading.py", line 916, in _bootstrap_inner
    self.run()
  File "/usr/lib/python3.6/threading.py", line 864, in run
    self._target(*self._args, **self._kwargs)
  File "<https://ci-beam.apache.org/job/beam_PostCommit_Python36/ws/src/sdks/python/apache_beam/runners/worker/sdk_worker.py",> line 234, in run
    for work_request in self._control_stub.Control(get_responses()):
  File "<https://ci-beam.apache.org/job/beam_PostCommit_Python36/ws/src/build/gradleenv/2022703440/lib/python3.6/site-packages/grpc/_channel.py",> line 426, in __next__
    return self._next()
  File "<https://ci-beam.apache.org/job/beam_PostCommit_Python36/ws/src/build/gradleenv/2022703440/lib/python3.6/site-packages/grpc/_channel.py",> line 826, in _next
    raise self
grpc._channel._MultiThreadedRendezvous: <_MultiThreadedRendezvous of RPC that terminated with:
	status = StatusCode.UNAVAILABLE
	details = "Socket closed"
	debug_error_string = "{"created":"@1650315485.224683851","description":"Error received from peer ipv6:[::1]:46613","file":"src/core/lib/surface/call.cc","file_line":903,"grpc_message":"Socket closed","grpc_status":14}"
>


> Task :sdks:python:test-suites:portable:py36:postCommitPy36

> Task :sdks:python:test-suites:dataflow:py36:postCommitIT
E0418 20:58:12.881383025 3468708 fork_posix.cc:70]           Fork support is only compatible with the epoll1 and poll polling strategies
E0418 20:59:20.983863809 3469090 fork_posix.cc:70]           Fork support is only compatible with the epoll1 and poll polling strategies
E0418 21:00:55.710906226 3468878 fork_posix.cc:70]           Fork support is only compatible with the epoll1 and poll polling strategies
E0418 21:02:45.651167889 3468921 fork_posix.cc:70]           Fork support is only compatible with the epoll1 and poll polling strategies
E0418 21:06:34.224429362 3468708 fork_posix.cc:70]           Fork support is only compatible with the epoll1 and poll polling strategies
E0418 21:07:37.661791547 3469090 fork_posix.cc:70]           Fork support is only compatible with the epoll1 and poll polling strategies
E0418 21:10:21.593031700 3468921 fork_posix.cc:70]           Fork support is only compatible with the epoll1 and poll polling strategies
E0418 21:13:04.050870664 3468708 fork_posix.cc:70]           Fork support is only compatible with the epoll1 and poll polling strategies
E0418 21:15:16.953906373 3469090 fork_posix.cc:70]           Fork support is only compatible with the epoll1 and poll polling strategies
E0418 21:19:52.865593667 3468921 fork_posix.cc:70]           Fork support is only compatible with the epoll1 and poll polling strategies
E0418 21:19:55.759397882 3468708 fork_posix.cc:70]           Fork support is only compatible with the epoll1 and poll polling strategies
E0418 21:22:27.570066276 3469090 fork_posix.cc:70]           Fork support is only compatible with the epoll1 and poll polling strategies
E0418 21:24:35.691522043 3468763 fork_posix.cc:70]           Fork support is only compatible with the epoll1 and poll polling strategies
E0418 21:28:24.258672633 3468921 fork_posix.cc:70]           Fork support is only compatible with the epoll1 and poll polling strategies
E0418 21:30:17.691106815 3469090 fork_posix.cc:70]           Fork support is only compatible with the epoll1 and poll polling strategies
E0418 21:36:18.588595305 3468921 fork_posix.cc:70]           Fork support is only compatible with the epoll1 and poll polling strategies
E0418 21:41:28.502928242 3468763 fork_posix.cc:70]           Fork support is only compatible with the epoll1 and poll polling strategies
E0418 21:43:52.995827288 3468921 fork_posix.cc:70]           Fork support is only compatible with the epoll1 and poll polling strategies
E0418 21:50:22.203684329 3468921 fork_posix.cc:70]           Fork support is only compatible with the epoll1 and poll polling strategies
E0418 21:56:52.013575293 3468921 fork_posix.cc:70]           Fork support is only compatible with the epoll1 and poll polling strategies
E0418 21:58:17.936486961 3468763 fork_posix.cc:70]           Fork support is only compatible with the epoll1 and poll polling strategies
E0418 21:59:46.939975173 3469001 fork_posix.cc:70]           Fork support is only compatible with the epoll1 and poll polling strategies
E0418 22:04:08.679867026 3468921 fork_posix.cc:70]           Fork support is only compatible with the epoll1 and poll polling strategies
E0418 22:10:27.208961823 3468921 fork_posix.cc:70]           Fork support is only compatible with the epoll1 and poll polling strategies
E0418 22:10:34.786709220 3469001 fork_posix.cc:70]           Fork support is only compatible with the epoll1 and poll polling strategies

> Task :sdks:python:test-suites:dataflow:py36:postCommitIT FAILED

FAILURE: Build failed with an exception.

* Where:
Script '<https://ci-beam.apache.org/job/beam_PostCommit_Python36/ws/src/sdks/python/test-suites/dataflow/common.gradle'> line: 121

* What went wrong:
Execution failed for task ':sdks:python:test-suites:dataflow:py36:postCommitIT'.
> Process 'command 'sh'' finished with non-zero exit value 1

* Try:
> Run with --stacktrace option to get the stack trace.
> Run with --info or --debug option to get more log output.
> Run with --scan to get full insights.

* Get more help at https://help.gradle.org

Deprecated Gradle features were used in this build, making it incompatible with Gradle 8.0.

You can use '--warning-mode all' to show the individual deprecation warnings and determine if they come from your own scripts or plugins.

See https://docs.gradle.org/7.4/userguide/command_line_interface.html#sec:command_line_warnings

Execution optimizations have been disabled for 1 invalid unit(s) of work during this build to ensure correctness.
Please consult deprecation warnings for more details.

BUILD FAILED in 1h 36m 27s
218 actionable tasks: 153 executed, 59 from cache, 6 up-to-date

Publishing build scan...
https://gradle.com/s/afs3aznmb42jo

Build step 'Invoke Gradle script' changed build result to FAILURE
Build step 'Invoke Gradle script' marked build as failure

---------------------------------------------------------------------
To unsubscribe, e-mail: builds-unsubscribe@beam.apache.org
For additional commands, e-mail: builds-help@beam.apache.org


Jenkins build is back to normal : beam_PostCommit_Python36 #5220

Posted by Apache Jenkins Server <je...@builds.apache.org>.
See <https://ci-beam.apache.org/job/beam_PostCommit_Python36/5220/display/redirect?page=changes>


---------------------------------------------------------------------
To unsubscribe, e-mail: builds-unsubscribe@beam.apache.org
For additional commands, e-mail: builds-help@beam.apache.org


Build failed in Jenkins: beam_PostCommit_Python36 #5219

Posted by Apache Jenkins Server <je...@builds.apache.org>.
See <https://ci-beam.apache.org/job/beam_PostCommit_Python36/5219/display/redirect?page=changes>

Changes:

[Andrew Pilloud] [BEAM-14253] Disable broken test pending Dataflow fix

[yiru] fix: BigQuery Storage Connector trace id population missing bracket

[noreply] [BEAM-14330] Temporarily disable the clusters auto-cleanup (#17400)

[noreply] Update Beam website to release 2.38.0 (#17378)

[noreply] [BEAM-14213] Add API and construction time validation for Batched DoFns


------------------------------------------
[...truncated 569.54 KB...]
apache_beam/io/gcp/bigquery.py:2158
apache_beam/io/gcp/bigquery.py:2158
apache_beam/io/gcp/bigquery.py:2158
apache_beam/io/gcp/bigquery.py:2158
apache_beam/io/gcp/bigquery.py:2158
  <https://ci-beam.apache.org/job/beam_PostCommit_Python36/ws/src/sdks/python/apache_beam/io/gcp/bigquery.py>:2158: BeamDeprecationWarning: options is deprecated since First stable release. References to <pipeline>.options will not be supported
    experiments = p.options.view_as(DebugOptions).experiments or []

apache_beam/io/gcp/bigquery.py:2452
apache_beam/io/gcp/bigquery.py:2452
apache_beam/io/gcp/bigquery.py:2452
apache_beam/io/gcp/bigquery.py:2452
apache_beam/io/gcp/bigquery.py:2452
apache_beam/io/gcp/bigquery.py:2452
apache_beam/io/gcp/bigquery.py:2452
apache_beam/io/gcp/bigquery.py:2452
apache_beam/io/gcp/bigquery.py:2452
apache_beam/io/gcp/bigquery.py:2452
apache_beam/io/gcp/bigquery.py:2452
apache_beam/io/gcp/bigquery.py:2452
apache_beam/io/gcp/bigquery.py:2452
apache_beam/io/gcp/bigquery.py:2452
  <https://ci-beam.apache.org/job/beam_PostCommit_Python36/ws/src/sdks/python/apache_beam/io/gcp/bigquery.py>:2452: BeamDeprecationWarning: options is deprecated since First stable release. References to <pipeline>.options will not be supported
    temp_location = pcoll.pipeline.options.view_as(

apache_beam/io/gcp/bigquery.py:2454
apache_beam/io/gcp/bigquery.py:2454
apache_beam/io/gcp/bigquery.py:2454
apache_beam/io/gcp/bigquery.py:2454
apache_beam/io/gcp/bigquery.py:2454
apache_beam/io/gcp/bigquery.py:2454
apache_beam/io/gcp/bigquery.py:2454
apache_beam/io/gcp/bigquery.py:2454
apache_beam/io/gcp/bigquery.py:2454
apache_beam/io/gcp/bigquery.py:2454
apache_beam/io/gcp/bigquery.py:2454
apache_beam/io/gcp/bigquery.py:2454
apache_beam/io/gcp/bigquery.py:2454
apache_beam/io/gcp/bigquery.py:2454
  <https://ci-beam.apache.org/job/beam_PostCommit_Python36/ws/src/sdks/python/apache_beam/io/gcp/bigquery.py>:2454: BeamDeprecationWarning: options is deprecated since First stable release. References to <pipeline>.options will not be supported
    job_name = pcoll.pipeline.options.view_as(GoogleCloudOptions).job_name

apache_beam/io/gcp/bigquery.py:2485
apache_beam/io/gcp/bigquery.py:2485
apache_beam/io/gcp/bigquery.py:2485
apache_beam/io/gcp/bigquery.py:2485
apache_beam/io/gcp/bigquery.py:2485
apache_beam/io/gcp/bigquery.py:2485
apache_beam/io/gcp/bigquery.py:2485
apache_beam/io/gcp/bigquery.py:2485
apache_beam/io/gcp/bigquery.py:2485
apache_beam/io/gcp/bigquery.py:2485
apache_beam/io/gcp/bigquery.py:2485
apache_beam/io/gcp/bigquery.py:2485
apache_beam/io/gcp/bigquery.py:2485
apache_beam/io/gcp/bigquery.py:2485
  <https://ci-beam.apache.org/job/beam_PostCommit_Python36/ws/src/sdks/python/apache_beam/io/gcp/bigquery.py>:2485: BeamDeprecationWarning: options is deprecated since First stable release. References to <pipeline>.options will not be supported
    | _PassThroughThenCleanup(files_to_remove_pcoll))

apache_beam/io/gcp/bigquery.py:2148
apache_beam/io/gcp/bigquery.py:2148
apache_beam/io/gcp/bigquery.py:2148
apache_beam/io/gcp/bigquery.py:2148
apache_beam/io/gcp/bigquery.py:2148
apache_beam/io/gcp/bigquery.py:2148
apache_beam/io/gcp/bigquery.py:2148
apache_beam/io/gcp/bigquery.py:2148
apache_beam/io/gcp/bigquery.py:2148
apache_beam/io/gcp/bigquery.py:2148
apache_beam/io/gcp/bigquery.py:2148
apache_beam/io/gcp/bigquery.py:2148
  <https://ci-beam.apache.org/job/beam_PostCommit_Python36/ws/src/sdks/python/apache_beam/io/gcp/bigquery.py>:2148: BeamDeprecationWarning: options is deprecated since First stable release. References to <pipeline>.options will not be supported
    self.table_reference.projectId = pcoll.pipeline.options.view_as(

apache_beam/io/gcp/bigquery_file_loads.py:1128
apache_beam/io/gcp/bigquery_file_loads.py:1128
apache_beam/io/gcp/bigquery_file_loads.py:1128
apache_beam/io/gcp/bigquery_file_loads.py:1128
apache_beam/io/gcp/bigquery_file_loads.py:1128
apache_beam/io/gcp/bigquery_file_loads.py:1128
apache_beam/io/gcp/bigquery_file_loads.py:1128
apache_beam/io/gcp/bigquery_file_loads.py:1128
apache_beam/io/gcp/bigquery_file_loads.py:1128
apache_beam/io/gcp/bigquery_file_loads.py:1128
apache_beam/io/gcp/bigquery_file_loads.py:1128
apache_beam/io/gcp/bigquery_file_loads.py:1128
apache_beam/io/gcp/bigquery_file_loads.py:1128
apache_beam/io/gcp/bigquery_file_loads.py:1128
apache_beam/io/gcp/bigquery_file_loads.py:1128
apache_beam/io/gcp/bigquery_file_loads.py:1128
apache_beam/io/gcp/bigquery_file_loads.py:1128
  <https://ci-beam.apache.org/job/beam_PostCommit_Python36/ws/src/sdks/python/apache_beam/io/gcp/bigquery_file_loads.py>:1128: BeamDeprecationWarning: options is deprecated since First stable release. References to <pipeline>.options will not be supported
    temp_location = p.options.view_as(GoogleCloudOptions).temp_location

apache_beam/io/gcp/bigquery_file_loads.py:1130
apache_beam/io/gcp/bigquery_file_loads.py:1130
apache_beam/io/gcp/bigquery_file_loads.py:1130
apache_beam/io/gcp/bigquery_file_loads.py:1130
apache_beam/io/gcp/bigquery_file_loads.py:1130
apache_beam/io/gcp/bigquery_file_loads.py:1130
apache_beam/io/gcp/bigquery_file_loads.py:1130
apache_beam/io/gcp/bigquery_file_loads.py:1130
apache_beam/io/gcp/bigquery_file_loads.py:1130
apache_beam/io/gcp/bigquery_file_loads.py:1130
apache_beam/io/gcp/bigquery_file_loads.py:1130
apache_beam/io/gcp/bigquery_file_loads.py:1130
apache_beam/io/gcp/bigquery_file_loads.py:1130
apache_beam/io/gcp/bigquery_file_loads.py:1130
apache_beam/io/gcp/bigquery_file_loads.py:1130
apache_beam/io/gcp/bigquery_file_loads.py:1130
apache_beam/io/gcp/bigquery_file_loads.py:1130
  <https://ci-beam.apache.org/job/beam_PostCommit_Python36/ws/src/sdks/python/apache_beam/io/gcp/bigquery_file_loads.py>:1130: BeamDeprecationWarning: options is deprecated since First stable release. References to <pipeline>.options will not be supported
    p.options.view_as(GoogleCloudOptions).job_name or 'AUTOMATIC_JOB_NAME')

apache_beam/io/gcp/tests/utils.py:100
  <https://ci-beam.apache.org/job/beam_PostCommit_Python36/ws/src/sdks/python/apache_beam/io/gcp/tests/utils.py>:100: PendingDeprecationWarning: Client.dataset is deprecated and will be removed in a future version. Use a string like 'my_project.my_dataset' or a cloud.google.bigquery.DatasetReference object, instead.
    table_ref = client.dataset(dataset_id).table(table_id)

apache_beam/io/gcp/bigquery_test.py:1183
  <https://ci-beam.apache.org/job/beam_PostCommit_Python36/ws/src/sdks/python/apache_beam/io/gcp/bigquery_test.py>:1183: BeamDeprecationWarning: options is deprecated since First stable release. References to <pipeline>.options will not be supported
    streaming = self.test_pipeline.options.view_as(StandardOptions).streaming

apache_beam/dataframe/io.py:632
apache_beam/dataframe/io.py:632
  <https://ci-beam.apache.org/job/beam_PostCommit_Python36/ws/src/sdks/python/apache_beam/dataframe/io.py>:632: FutureWarning: WriteToFiles is experimental.
    sink=lambda _: _WriteToPandasFileSink(

apache_beam/io/fileio.py:550
apache_beam/io/fileio.py:550
  <https://ci-beam.apache.org/job/beam_PostCommit_Python36/ws/src/sdks/python/apache_beam/io/fileio.py>:550: BeamDeprecationWarning: options is deprecated since First stable release. References to <pipeline>.options will not be supported
    p.options.view_as(GoogleCloudOptions).temp_location or

apache_beam/io/gcp/bigquery_read_it_test.py:169
  <https://ci-beam.apache.org/job/beam_PostCommit_Python36/ws/src/sdks/python/apache_beam/io/gcp/bigquery_read_it_test.py>:169: BeamDeprecationWarning: BigQuerySource is deprecated since 2.25.0. Use ReadFromBigQuery instead.
    beam.io.BigQuerySource(query=self.query, use_standard_sql=True)))

apache_beam/ml/gcp/cloud_dlp_it_test.py:77
  <https://ci-beam.apache.org/job/beam_PostCommit_Python36/ws/src/sdks/python/apache_beam/ml/gcp/cloud_dlp_it_test.py>:77: FutureWarning: MaskDetectedDetails is experimental.
    inspection_config=INSPECT_CONFIG))

apache_beam/io/gcp/big_query_query_to_table_pipeline.py:84
apache_beam/io/gcp/big_query_query_to_table_pipeline.py:84
  <https://ci-beam.apache.org/job/beam_PostCommit_Python36/ws/src/sdks/python/apache_beam/io/gcp/big_query_query_to_table_pipeline.py>:84: BeamDeprecationWarning: BigQuerySource is deprecated since 2.25.0. Use ReadFromBigQuery instead.
    kms_key=kms_key))

apache_beam/runners/dataflow/ptransform_overrides.py:323
apache_beam/runners/dataflow/ptransform_overrides.py:323
  <https://ci-beam.apache.org/job/beam_PostCommit_Python36/ws/src/sdks/python/apache_beam/runners/dataflow/ptransform_overrides.py>:323: BeamDeprecationWarning: BigQuerySink is deprecated since 2.11.0. Use WriteToBigQuery instead.
    kms_key=self.kms_key))

apache_beam/ml/gcp/cloud_dlp_it_test.py:87
  <https://ci-beam.apache.org/job/beam_PostCommit_Python36/ws/src/sdks/python/apache_beam/ml/gcp/cloud_dlp_it_test.py>:87: FutureWarning: InspectForDetails is experimental.
    | beam.ParDo(extract_inspection_results).with_outputs(

apache_beam/io/gcp/bigquery_read_it_test.py:558
  <https://ci-beam.apache.org/job/beam_PostCommit_Python36/ws/src/sdks/python/apache_beam/io/gcp/bigquery_read_it_test.py>:558: BeamDeprecationWarning: BigQuerySource is deprecated since 2.25.0. Use ReadFromBigQuery instead.
    beam.io.BigQuerySource(query=self.query, use_standard_sql=True)))

apache_beam/io/gcp/bigquery_read_it_test.py:672
  <https://ci-beam.apache.org/job/beam_PostCommit_Python36/ws/src/sdks/python/apache_beam/io/gcp/bigquery_read_it_test.py>:672: FutureWarning: ReadAllFromBigQuery is experimental.
    | beam.io.ReadAllFromBigQuery())

apache_beam/io/gcp/bigquery.py:2626
  <https://ci-beam.apache.org/job/beam_PostCommit_Python36/ws/src/sdks/python/apache_beam/io/gcp/bigquery.py>:2626: BeamDeprecationWarning: options is deprecated since First stable release. References to <pipeline>.options will not be supported
    job_name = pcoll.pipeline.options.view_as(GoogleCloudOptions).job_name

apache_beam/io/gcp/bigquery.py:2627
  <https://ci-beam.apache.org/job/beam_PostCommit_Python36/ws/src/sdks/python/apache_beam/io/gcp/bigquery.py>:2627: BeamDeprecationWarning: options is deprecated since First stable release. References to <pipeline>.options will not be supported
    project = pcoll.pipeline.options.view_as(GoogleCloudOptions).project

apache_beam/io/gcp/bigquery.py:2640
  <https://ci-beam.apache.org/job/beam_PostCommit_Python36/ws/src/sdks/python/apache_beam/io/gcp/bigquery.py>:2640: BeamDeprecationWarning: options is deprecated since First stable release. References to <pipeline>.options will not be supported
    options=pcoll.pipeline.options,

apache_beam/runners/interactive/interactive_environment.py:400
  <https://ci-beam.apache.org/job/beam_PostCommit_Python36/ws/src/sdks/python/apache_beam/runners/interactive/interactive_environment.py>:400: BeamDeprecationWarning: options is deprecated since First stable release. References to <pipeline>.options will not be supported
    staging_location = pipeline.options.get_all_options(

apache_beam/runners/interactive/recording_manager.py:410
  <https://ci-beam.apache.org/job/beam_PostCommit_Python36/ws/src/sdks/python/apache_beam/runners/interactive/recording_manager.py>:410: BeamDeprecationWarning: options is deprecated since First stable release. References to <pipeline>.options will not be supported
    options=self.user_pipeline.options,

-- Docs: https://docs.pytest.org/en/latest/warnings.html
- generated xml file: <https://ci-beam.apache.org/job/beam_PostCommit_Python36/ws/src/sdks/python/pytest_postCommitIT-df-py36.xml> -
============ 61 passed, 9 skipped, 165 warnings in 6919.81 seconds =============

FAILURE: Build completed with 3 failures.

1: Task failed with an exception.
-----------
* What went wrong:
Execution failed for task ':sdks:python:test-suites:portable:py36:installGcpTest'.
> Process 'command 'sh'' finished with non-zero exit value 1

* Try:
> Run with --stacktrace option to get the stack trace.
> Run with --info or --debug option to get more log output.
> Run with --scan to get full insights.
==============================================================================

2: Task failed with an exception.
-----------
* Where:
Script '<https://ci-beam.apache.org/job/beam_PostCommit_Python36/ws/src/sdks/python/test-suites/portable/common.gradle'> line: 85

* What went wrong:
Execution failed for task ':sdks:python:test-suites:portable:py36:portableLocalRunnerJuliaSetWithSetupPy'.
> Process 'command 'sh'' finished with non-zero exit value 1

* Try:
> Run with --stacktrace option to get the stack trace.
> Run with --info or --debug option to get more log output.
> Run with --scan to get full insights.
==============================================================================

3: Task failed with an exception.
-----------
* Where:
Script '<https://ci-beam.apache.org/job/beam_PostCommit_Python36/ws/src/sdks/python/test-suites/portable/common.gradle'> line: 130

* What went wrong:
Execution failed for task ':sdks:python:test-suites:portable:py36:portableLocalRunnerTestWithRequirementsFile'.
> Process 'command 'sh'' finished with non-zero exit value 1

* Try:
> Run with --stacktrace option to get the stack trace.
> Run with --info or --debug option to get more log output.
> Run with --scan to get full insights.
==============================================================================

* Get more help at https://help.gradle.org

Deprecated Gradle features were used in this build, making it incompatible with Gradle 8.0.

You can use '--warning-mode all' to show the individual deprecation warnings and determine if they come from your own scripts or plugins.

See https://docs.gradle.org/7.4/userguide/command_line_interface.html#sec:command_line_warnings

Execution optimizations have been disabled for 1 invalid unit(s) of work during this build to ensure correctness.
Please consult deprecation warnings for more details.

BUILD FAILED in 2h 5m 16s
217 actionable tasks: 157 executed, 54 from cache, 6 up-to-date

Publishing build scan...
https://gradle.com/s/jcohry3tp7rau

Build step 'Invoke Gradle script' changed build result to FAILURE
Build step 'Invoke Gradle script' marked build as failure

---------------------------------------------------------------------
To unsubscribe, e-mail: builds-unsubscribe@beam.apache.org
For additional commands, e-mail: builds-help@beam.apache.org


Build failed in Jenkins: beam_PostCommit_Python36 #5218

Posted by Apache Jenkins Server <je...@builds.apache.org>.
See <https://ci-beam.apache.org/job/beam_PostCommit_Python36/5218/display/redirect?page=changes>

Changes:

[bulat.safiullin] [BEAM-14247] [Website] add image

[bulat.safiullin] [BEAM-14247] [Website] center image

[mattcasters] BEAM-1857 : CHANGES.md entry for 2.38.0

[noreply] Update .asf.yaml (#17409)

[noreply] [BEAM-14336] Sickbay flight delays test - dataset seems to be missing

[noreply] [BEAM-14338] Update watermark unit tests to use time.Time.Equals()

[noreply] [BEAM-14328] Tweaks to "Differences from pandas" page (#17413)


------------------------------------------
[...truncated 23.72 MB...]
  nanos: 31465291
}
message: "Closing all cached gRPC state handlers."
log_location: "/usr/local/lib/python3.6/site-packages/apache_beam/runners/worker/sdk_worker.py:859"
thread: "MainThread"

INFO:root:severity: INFO
timestamp {
  seconds: 1650488197
  nanos: 31761407
}
message: "Done consuming work."
log_location: "/usr/local/lib/python3.6/site-packages/apache_beam/runners/worker/sdk_worker.py:257"
thread: "MainThread"

INFO:root:severity: INFO
timestamp {
  seconds: 1650488197
  nanos: 31845331
}
message: "Python sdk harness exiting."
log_location: "/usr/local/lib/python3.6/site-packages/apache_beam/runners/worker/sdk_worker_main.py:181"
thread: "MainThread"

INFO:apache_beam.runners.portability.local_job_service:Completed job in 9.1467924118042 seconds with state DONE.
INFO:root:Completed job in 9.1467924118042 seconds with state DONE.
INFO:apache_beam.runners.portability.portable_runner:Job state changed to DONE

> Task :sdks:python:test-suites:portable:py36:portableWordCountSparkRunnerBatch
INFO:apache_beam.runners.worker.worker_pool_main:Listening for workers at localhost:34291
WARNING:root:Make sure that locally built Python SDK docker image has Python 3.6 interpreter.
INFO:root:Default Python SDK image for environment is apache/beam_python3.6_sdk:2.39.0.dev
INFO:apache_beam.runners.portability.fn_api_runner.translations:==================== <function pack_combiners at 0x7fbc749339d8> ====================
INFO:apache_beam.runners.portability.fn_api_runner.translations:==================== <function lift_combiners at 0x7fbc74933a60> ====================
INFO:apache_beam.runners.portability.fn_api_runner.translations:==================== <function sort_stages at 0x7fbc749361e0> ====================
INFO:apache_beam.utils.subprocess_server:Starting service with ['java' '-jar' '<https://ci-beam.apache.org/job/beam_PostCommit_Python36/ws/src/runners/spark/2/job-server/build/libs/beam-runners-spark-job-server-2.39.0-SNAPSHOT.jar'> '--spark-master-url' 'local[4]' '--artifacts-dir' '/tmp/beam-tempp3vti98i/artifactscvgdjw80' '--job-port' '50147' '--artifact-port' '0' '--expansion-port' '0']
E0420 20:56:40.466344054 1742036 fork_posix.cc:70]           Fork support is only compatible with the epoll1 and poll polling strategies
INFO:apache_beam.utils.subprocess_server:b'22/04/20 20:56:42 WARN software.amazon.awssdk.regions.internal.util.EC2MetadataUtils: Unable to retrieve the requested metadata.'
INFO:apache_beam.utils.subprocess_server:b'22/04/20 20:56:42 INFO org.apache.beam.runners.jobsubmission.JobServerDriver: ArtifactStagingService started on localhost:43855'
INFO:apache_beam.utils.subprocess_server:b'22/04/20 20:56:42 INFO org.apache.beam.runners.jobsubmission.JobServerDriver: Java ExpansionService started on localhost:33293'
INFO:apache_beam.utils.subprocess_server:b'22/04/20 20:56:42 INFO org.apache.beam.runners.jobsubmission.JobServerDriver: JobService started on localhost:50147'
INFO:apache_beam.utils.subprocess_server:b'22/04/20 20:56:42 INFO org.apache.beam.runners.jobsubmission.JobServerDriver: Job server now running, terminate with Ctrl+C'
WARNING:apache_beam.options.pipeline_options:Discarding unparseable args: ['--parallelism=2']
INFO:apache_beam.utils.subprocess_server:b'22/04/20 20:56:43 INFO org.apache.beam.runners.fnexecution.artifact.ArtifactStagingService: Staging artifacts for job_26ba495f-707c-4f01-8740-091cbe476438.'
INFO:apache_beam.utils.subprocess_server:b'22/04/20 20:56:43 INFO org.apache.beam.runners.fnexecution.artifact.ArtifactStagingService: Resolving artifacts for job_26ba495f-707c-4f01-8740-091cbe476438.ref_Environment_default_environment_1.'
INFO:apache_beam.utils.subprocess_server:b'22/04/20 20:56:43 INFO org.apache.beam.runners.fnexecution.artifact.ArtifactStagingService: Getting 1 artifacts for job_26ba495f-707c-4f01-8740-091cbe476438.null.'
INFO:apache_beam.utils.subprocess_server:b'22/04/20 20:56:43 INFO org.apache.beam.runners.fnexecution.artifact.ArtifactStagingService: Artifacts fully staged for job_26ba495f-707c-4f01-8740-091cbe476438.'
INFO:apache_beam.utils.subprocess_server:b'22/04/20 20:56:43 INFO org.apache.beam.runners.spark.SparkJobInvoker: Invoking job BeamApp-jenkins-0420205643-cc0409ce_3de8ab18-5878-4af0-becb-eac3b2fa3716'
INFO:apache_beam.utils.subprocess_server:b'22/04/20 20:56:43 INFO org.apache.beam.runners.jobsubmission.JobInvocation: Starting job invocation BeamApp-jenkins-0420205643-cc0409ce_3de8ab18-5878-4af0-becb-eac3b2fa3716'
INFO:apache_beam.runners.portability.portable_runner:Environment "LOOPBACK" has started a component necessary for the execution. Be sure to run the pipeline using
  with Pipeline() as p:
    p.apply(..)
This ensures that the pipeline finishes before this program exits.
INFO:apache_beam.runners.portability.portable_runner:Job state changed to STOPPED
INFO:apache_beam.runners.portability.portable_runner:Job state changed to STARTING
INFO:apache_beam.runners.portability.portable_runner:Job state changed to RUNNING
INFO:apache_beam.utils.subprocess_server:b'22/04/20 20:56:43 INFO org.apache.beam.runners.spark.translation.SparkContextFactory: Creating a brand new Spark Context.'
INFO:apache_beam.utils.subprocess_server:b'22/04/20 20:56:44 WARN org.apache.hadoop.util.NativeCodeLoader: Unable to load native-hadoop library for your platform... using builtin-java classes where applicable'
INFO:apache_beam.utils.subprocess_server:b'22/04/20 20:56:45 INFO org.apache.beam.runners.spark.aggregators.AggregatorsAccumulator: Instantiated aggregators accumulator:'
INFO:apache_beam.utils.subprocess_server:b'22/04/20 20:56:45 INFO org.apache.beam.runners.spark.metrics.MetricsAccumulator: Instantiated metrics accumulator: MetricQueryResults()'
INFO:apache_beam.utils.subprocess_server:b'22/04/20 20:56:45 WARN software.amazon.awssdk.regions.internal.util.EC2MetadataUtils: Unable to retrieve the requested metadata.'
INFO:apache_beam.utils.subprocess_server:b'22/04/20 20:56:45 INFO org.apache.beam.runners.spark.SparkPipelineRunner: Running job BeamApp-jenkins-0420205643-cc0409ce_3de8ab18-5878-4af0-becb-eac3b2fa3716 on Spark master local[4]'
INFO:apache_beam.utils.subprocess_server:b'22/04/20 20:56:46 WARN software.amazon.awssdk.regions.internal.util.EC2MetadataUtils: Unable to retrieve the requested metadata.'
INFO:apache_beam.utils.subprocess_server:b'22/04/20 20:56:46 WARN software.amazon.awssdk.regions.internal.util.EC2MetadataUtils: Unable to retrieve the requested metadata.'
INFO:apache_beam.utils.subprocess_server:b'22/04/20 20:56:46 WARN software.amazon.awssdk.regions.internal.util.EC2MetadataUtils: Unable to retrieve the requested metadata.'
INFO:apache_beam.utils.subprocess_server:b'22/04/20 20:56:46 WARN software.amazon.awssdk.regions.internal.util.EC2MetadataUtils: Unable to retrieve the requested metadata.'
INFO:apache_beam.runners.worker.statecache:Creating state cache with size 0
INFO:apache_beam.runners.worker.sdk_worker:Creating insecure control channel for localhost:45977.
INFO:apache_beam.runners.worker.sdk_worker:Control channel established.
INFO:apache_beam.runners.worker.sdk_worker:Initializing SDKHarness with unbounded number of workers.
INFO:apache_beam.utils.subprocess_server:b'22/04/20 20:56:46 INFO org.apache.beam.runners.fnexecution.control.FnApiControlClientPoolService: Beam Fn Control client connected with id 1-1'
INFO:apache_beam.utils.subprocess_server:b'22/04/20 20:56:46 INFO org.apache.beam.runners.fnexecution.control.FnApiControlClientPoolService: getProcessBundleDescriptor request with id 1-2'
INFO:apache_beam.runners.worker.sdk_worker:Creating insecure state channel for localhost:34243.
INFO:apache_beam.runners.worker.sdk_worker:State channel established.
INFO:apache_beam.runners.worker.data_plane:Creating client data channel for localhost:38585
INFO:apache_beam.utils.subprocess_server:b'22/04/20 20:56:46 INFO org.apache.beam.runners.fnexecution.data.GrpcDataService: Beam Fn Data client connected.'
INFO:apache_beam.utils.subprocess_server:b'22/04/20 20:56:46 INFO org.apache.beam.runners.fnexecution.control.FnApiControlClientPoolService: getProcessBundleDescriptor request with id 1-3'
INFO:apache_beam.utils.subprocess_server:b'22/04/20 20:56:46 WARN software.amazon.awssdk.regions.internal.util.EC2MetadataUtils: Unable to retrieve the requested metadata.'
INFO:apache_beam.utils.subprocess_server:b'22/04/20 20:56:46 WARN software.amazon.awssdk.regions.internal.util.EC2MetadataUtils: Unable to retrieve the requested metadata.'
INFO:apache_beam.utils.subprocess_server:b'22/04/20 20:56:46 WARN software.amazon.awssdk.regions.internal.util.EC2MetadataUtils: Unable to retrieve the requested metadata.'
INFO:apache_beam.utils.subprocess_server:b'22/04/20 20:56:46 WARN software.amazon.awssdk.regions.internal.util.EC2MetadataUtils: Unable to retrieve the requested metadata.'
INFO:apache_beam.utils.subprocess_server:b'22/04/20 20:56:46 INFO org.apache.beam.runners.fnexecution.control.FnApiControlClientPoolService: getProcessBundleDescriptor request with id 1-4'
INFO:apache_beam.utils.subprocess_server:b'22/04/20 20:56:46 INFO org.apache.beam.runners.fnexecution.control.FnApiControlClientPoolService: getProcessBundleDescriptor request with id 1-5'
INFO:apache_beam.utils.subprocess_server:b'22/04/20 20:56:46 WARN software.amazon.awssdk.regions.internal.util.EC2MetadataUtils: Unable to retrieve the requested metadata.'
INFO:apache_beam.utils.subprocess_server:b'22/04/20 20:56:46 WARN software.amazon.awssdk.regions.internal.util.EC2MetadataUtils: Unable to retrieve the requested metadata.'
INFO:apache_beam.utils.subprocess_server:b'22/04/20 20:56:46 WARN software.amazon.awssdk.regions.internal.util.EC2MetadataUtils: Unable to retrieve the requested metadata.'
INFO:apache_beam.utils.subprocess_server:b'22/04/20 20:56:46 WARN software.amazon.awssdk.regions.internal.util.EC2MetadataUtils: Unable to retrieve the requested metadata.'
INFO:apache_beam.utils.subprocess_server:b'22/04/20 20:56:46 INFO org.apache.beam.runners.fnexecution.control.FnApiControlClientPoolService: getProcessBundleDescriptor request with id 1-7'
INFO:apache_beam.utils.subprocess_server:b'22/04/20 20:56:46 INFO org.apache.beam.runners.fnexecution.control.FnApiControlClientPoolService: getProcessBundleDescriptor request with id 1-6'
INFO:apache_beam.utils.subprocess_server:b'22/04/20 20:56:46 INFO org.apache.beam.runners.fnexecution.control.FnApiControlClientPoolService: getProcessBundleDescriptor request with id 1-8'
INFO:apache_beam.utils.subprocess_server:b'22/04/20 20:56:46 INFO org.apache.beam.runners.fnexecution.control.FnApiControlClientPoolService: getProcessBundleDescriptor request with id 1-9'
INFO:apache_beam.utils.subprocess_server:b'22/04/20 20:56:46 INFO org.apache.beam.runners.fnexecution.control.FnApiControlClientPoolService: getProcessBundleDescriptor request with id 1-10'
INFO:apache_beam.utils.subprocess_server:b'22/04/20 20:56:46 INFO org.apache.beam.runners.fnexecution.control.FnApiControlClientPoolService: getProcessBundleDescriptor request with id 1-11'
INFO:apache_beam.utils.subprocess_server:b'22/04/20 20:56:47 INFO org.apache.beam.runners.fnexecution.control.FnApiControlClientPoolService: getProcessBundleDescriptor request with id 1-12'
INFO:apache_beam.utils.subprocess_server:b'22/04/20 20:56:47 INFO org.apache.beam.runners.fnexecution.control.FnApiControlClientPoolService: getProcessBundleDescriptor request with id 1-13'
INFO:apache_beam.utils.subprocess_server:b'22/04/20 20:56:47 WARN software.amazon.awssdk.regions.internal.util.EC2MetadataUtils: Unable to retrieve the requested metadata.'
INFO:apache_beam.utils.subprocess_server:b'22/04/20 20:56:47 WARN software.amazon.awssdk.regions.internal.util.EC2MetadataUtils: Unable to retrieve the requested metadata.'
INFO:apache_beam.utils.subprocess_server:b'22/04/20 20:56:47 WARN software.amazon.awssdk.regions.internal.util.EC2MetadataUtils: Unable to retrieve the requested metadata.'
INFO:apache_beam.utils.subprocess_server:b'22/04/20 20:56:47 WARN software.amazon.awssdk.regions.internal.util.EC2MetadataUtils: Unable to retrieve the requested metadata.'
INFO:apache_beam.utils.subprocess_server:b'22/04/20 20:56:47 INFO org.apache.beam.runners.fnexecution.control.FnApiControlClientPoolService: getProcessBundleDescriptor request with id 1-14'
INFO:apache_beam.utils.subprocess_server:b'22/04/20 20:56:47 WARN software.amazon.awssdk.regions.internal.util.EC2MetadataUtils: Unable to retrieve the requested metadata.'
INFO:apache_beam.utils.subprocess_server:b'22/04/20 20:56:47 WARN software.amazon.awssdk.regions.internal.util.EC2MetadataUtils: Unable to retrieve the requested metadata.'
INFO:apache_beam.utils.subprocess_server:b'22/04/20 20:56:47 WARN software.amazon.awssdk.regions.internal.util.EC2MetadataUtils: Unable to retrieve the requested metadata.'
INFO:apache_beam.utils.subprocess_server:b'22/04/20 20:56:47 WARN software.amazon.awssdk.regions.internal.util.EC2MetadataUtils: Unable to retrieve the requested metadata.'
INFO:apache_beam.utils.subprocess_server:b'22/04/20 20:56:47 INFO org.apache.beam.runners.fnexecution.control.FnApiControlClientPoolService: getProcessBundleDescriptor request with id 1-15'
INFO:apache_beam.utils.subprocess_server:b'22/04/20 20:56:47 INFO org.apache.beam.runners.spark.SparkPipelineRunner: Job BeamApp-jenkins-0420205643-cc0409ce_3de8ab18-5878-4af0-becb-eac3b2fa3716: Pipeline translated successfully. Computing outputs'
INFO:apache_beam.utils.subprocess_server:b'22/04/20 20:56:47 WARN software.amazon.awssdk.regions.internal.util.EC2MetadataUtils: Unable to retrieve the requested metadata.'
INFO:apache_beam.utils.subprocess_server:b'22/04/20 20:56:47 WARN software.amazon.awssdk.regions.internal.util.EC2MetadataUtils: Unable to retrieve the requested metadata.'
INFO:apache_beam.utils.subprocess_server:b'22/04/20 20:56:47 WARN software.amazon.awssdk.regions.internal.util.EC2MetadataUtils: Unable to retrieve the requested metadata.'
INFO:apache_beam.utils.subprocess_server:b'22/04/20 20:56:47 WARN software.amazon.awssdk.regions.internal.util.EC2MetadataUtils: Unable to retrieve the requested metadata.'
INFO:apache_beam.utils.subprocess_server:b'22/04/20 20:56:47 INFO org.apache.beam.runners.fnexecution.control.FnApiControlClientPoolService: getProcessBundleDescriptor request with id 1-16'
INFO:apache_beam.io.filebasedsink:Starting finalize_write threads with num_shards: 4 (skipped: 0), batches: 4, num_threads: 4
INFO:apache_beam.io.filebasedsink:Renamed 4 shards in 0.10 seconds.
INFO:apache_beam.utils.subprocess_server:b'22/04/20 20:56:47 INFO org.apache.beam.runners.spark.SparkPipelineRunner: Job BeamApp-jenkins-0420205643-cc0409ce_3de8ab18-5878-4af0-becb-eac3b2fa3716 finished.'
INFO:apache_beam.runners.portability.portable_runner:Job state changed to DONE
Exception in thread read_state:
Traceback (most recent call last):
  File "/usr/lib/python3.6/threading.py", line 916, in _bootstrap_inner
    self.run()
  File "/usr/lib/python3.6/threading.py", line 864, in run
    self._target(*self._args, **self._kwargs)
  File "<https://ci-beam.apache.org/job/beam_PostCommit_Python36/ws/src/sdks/python/apache_beam/runners/worker/sdk_worker.py",> line 990, in pull_responses
    for response in responses:
  File "<https://ci-beam.apache.org/job/beam_PostCommit_Python36/ws/src/build/gradleenv/2022703440/lib/python3.6/site-packages/grpc/_channel.py",> line 426, in __next__
    return self._next()
  File "<https://ci-beam.apache.org/job/beam_PostCommit_Python36/ws/src/build/gradleenv/2022703440/lib/python3.6/site-packages/grpc/_channel.py",> line 826, in _next
    raise self
grpc._channel._MultiThreadedRendezvous: <_MultiThreadedRendezvous of RPC that terminated with:
	status = StatusCode.UNAVAILABLE
	details = "Socket closed"
	debug_error_string = "{"created":"@1650488207.955759435","description":"Error received from peer ipv6:[::1]:34243","file":"src/core/lib/surface/call.cc","file_line":903,"grpc_message":"Socket closed","grpc_status":14}"
>

Exception in thread run_worker_1-1:
Traceback (most recent call last):
  File "/usr/lib/python3.6/threading.py", line 916, in _bootstrap_inner
    self.run()
  File "/usr/lib/python3.6/threading.py", line 864, in run
    self._target(*self._args, **self._kwargs)
  File "<https://ci-beam.apache.org/job/beam_PostCommit_Python36/ws/src/sdks/python/apache_beam/runners/worker/sdk_worker.py",> line 234, in run
    for work_request in self._control_stub.Control(get_responses()):
  File "<https://ci-beam.apache.org/job/beam_PostCommit_Python36/ws/src/build/gradleenv/2022703440/lib/python3.6/site-packages/grpc/_channel.py",> line 426, in __next__
    return self._next()
  File "<https://ci-beam.apache.org/job/beam_PostCommit_Python36/ws/src/build/gradleenv/2022703440/lib/python3.6/site-packages/grpc/_channel.py",> line 826, in _next
    raise self
grpc._channel._MultiThreadedRendezvous: <_MultiThreadedRendezvous of RPC that terminated with:
	status = StatusCode.UNAVAILABLE
	details = "Connection reset by peer"
	debug_error_string = "{"created":"@1650488207.955753932","description":"Error received from peer ipv6:[::1]:45977","file":"src/core/lib/surface/call.cc","file_line":903,"grpc_message":"Connection reset by peer","grpc_status":14}"
>

ERROR:apache_beam.runners.worker.data_plane:Failed to read inputs in the data plane.
Traceback (most recent call last):
  File "<https://ci-beam.apache.org/job/beam_PostCommit_Python36/ws/src/sdks/python/apache_beam/runners/worker/data_plane.py",> line 634, in _read_inputs
    for elements in elements_iterator:
  File "<https://ci-beam.apache.org/job/beam_PostCommit_Python36/ws/src/build/gradleenv/2022703440/lib/python3.6/site-packages/grpc/_channel.py",> line 426, in __next__
    return self._next()
  File "<https://ci-beam.apache.org/job/beam_PostCommit_Python36/ws/src/build/gradleenv/2022703440/lib/python3.6/site-packages/grpc/_channel.py",> line 826, in _next
    raise self
grpc._channel._MultiThreadedRendezvous: <_MultiThreadedRendezvous of RPC that terminated with:
	status = StatusCode.UNAVAILABLE
	details = "Socket closed"
	debug_error_string = "{"created":"@1650488207.955698616","description":"Error received from peer ipv6:[::1]:38585","file":"src/core/lib/surface/call.cc","file_line":903,"grpc_message":"Socket closed","grpc_status":14}"
>
Exception in thread read_grpc_client_inputs:
Traceback (most recent call last):
  File "/usr/lib/python3.6/threading.py", line 916, in _bootstrap_inner
    self.run()
  File "/usr/lib/python3.6/threading.py", line 864, in run
    self._target(*self._args, **self._kwargs)
  File "<https://ci-beam.apache.org/job/beam_PostCommit_Python36/ws/src/sdks/python/apache_beam/runners/worker/data_plane.py",> line 651, in <lambda>
    target=lambda: self._read_inputs(elements_iterator),
  File "<https://ci-beam.apache.org/job/beam_PostCommit_Python36/ws/src/sdks/python/apache_beam/runners/worker/data_plane.py",> line 634, in _read_inputs
    for elements in elements_iterator:
  File "<https://ci-beam.apache.org/job/beam_PostCommit_Python36/ws/src/build/gradleenv/2022703440/lib/python3.6/site-packages/grpc/_channel.py",> line 426, in __next__
    return self._next()
  File "<https://ci-beam.apache.org/job/beam_PostCommit_Python36/ws/src/build/gradleenv/2022703440/lib/python3.6/site-packages/grpc/_channel.py",> line 826, in _next
    raise self
grpc._channel._MultiThreadedRendezvous: <_MultiThreadedRendezvous of RPC that terminated with:
	status = StatusCode.UNAVAILABLE
	details = "Socket closed"
	debug_error_string = "{"created":"@1650488207.955698616","description":"Error received from peer ipv6:[::1]:38585","file":"src/core/lib/surface/call.cc","file_line":903,"grpc_message":"Socket closed","grpc_status":14}"
>


> Task :sdks:python:test-suites:portable:py36:postCommitPy36

> Task :sdks:python:test-suites:dataflow:py36:postCommitIT
E0420 20:59:29.901991029 1718804 fork_posix.cc:70]           Fork support is only compatible with the epoll1 and poll polling strategies
E0420 21:01:30.393841620 1718755 fork_posix.cc:70]           Fork support is only compatible with the epoll1 and poll polling strategies
E0420 21:04:27.228478778 1718766 fork_posix.cc:70]           Fork support is only compatible with the epoll1 and poll polling strategies
E0420 21:04:37.519352794 1718740 fork_posix.cc:70]           Fork support is only compatible with the epoll1 and poll polling strategies
E0420 21:06:38.447619548 1718804 fork_posix.cc:70]           Fork support is only compatible with the epoll1 and poll polling strategies
E0420 21:08:40.489582161 1718755 fork_posix.cc:70]           Fork support is only compatible with the epoll1 and poll polling strategies
E0420 21:10:46.867804554 1718766 fork_posix.cc:70]           Fork support is only compatible with the epoll1 and poll polling strategies
E0420 21:14:47.335764719 1718804 fork_posix.cc:70]           Fork support is only compatible with the epoll1 and poll polling strategies
E0420 21:16:51.666891839 1718755 fork_posix.cc:70]           Fork support is only compatible with the epoll1 and poll polling strategies
E0420 21:17:19.695461946 1718766 fork_posix.cc:70]           Fork support is only compatible with the epoll1 and poll polling strategies
E0420 21:23:01.498772535 1718804 fork_posix.cc:70]           Fork support is only compatible with the epoll1 and poll polling strategies
E0420 21:23:15.359734479 1718728 fork_posix.cc:70]           Fork support is only compatible with the epoll1 and poll polling strategies
E0420 21:25:12.934473960 1718766 fork_posix.cc:70]           Fork support is only compatible with the epoll1 and poll polling strategies
E0420 21:30:54.537386659 1718804 fork_posix.cc:70]           Fork support is only compatible with the epoll1 and poll polling strategies
E0420 21:31:42.939878242 1718766 fork_posix.cc:70]           Fork support is only compatible with the epoll1 and poll polling strategies
E0420 21:39:37.007601334 1718766 fork_posix.cc:70]           Fork support is only compatible with the epoll1 and poll polling strategies
E0420 21:40:20.705302855 1718728 fork_posix.cc:70]           Fork support is only compatible with the epoll1 and poll polling strategies
E0420 21:46:39.217823814 1718766 fork_posix.cc:70]           Fork support is only compatible with the epoll1 and poll polling strategies
E0420 21:53:01.436917084 1718766 fork_posix.cc:70]           Fork support is only compatible with the epoll1 and poll polling strategies
E0420 21:54:27.328538238 1718843 fork_posix.cc:70]           Fork support is only compatible with the epoll1 and poll polling strategies
E0420 21:57:09.374743124 1718728 fork_posix.cc:70]           Fork support is only compatible with the epoll1 and poll polling strategies
E0420 22:00:49.226116708 1718766 fork_posix.cc:70]           Fork support is only compatible with the epoll1 and poll polling strategies
E0420 22:08:36.125013857 1718766 fork_posix.cc:70]           Fork support is only compatible with the epoll1 and poll polling strategies
E0420 22:13:45.253970722 1718843 fork_posix.cc:70]           Fork support is only compatible with the epoll1 and poll polling strategies
E0420 22:16:27.758788576 1718766 fork_posix.cc:70]           Fork support is only compatible with the epoll1 and poll polling strategies

> Task :sdks:python:test-suites:dataflow:py36:postCommitIT FAILED

FAILURE: Build failed with an exception.

* Where:
Script '<https://ci-beam.apache.org/job/beam_PostCommit_Python36/ws/src/sdks/python/test-suites/dataflow/common.gradle'> line: 121

* What went wrong:
Execution failed for task ':sdks:python:test-suites:dataflow:py36:postCommitIT'.
> Process 'command 'sh'' finished with non-zero exit value 1

* Try:
> Run with --stacktrace option to get the stack trace.
> Run with --info or --debug option to get more log output.
> Run with --scan to get full insights.

* Get more help at https://help.gradle.org

Deprecated Gradle features were used in this build, making it incompatible with Gradle 8.0.

You can use '--warning-mode all' to show the individual deprecation warnings and determine if they come from your own scripts or plugins.

See https://docs.gradle.org/7.4/userguide/command_line_interface.html#sec:command_line_warnings

Execution optimizations have been disabled for 1 invalid unit(s) of work during this build to ensure correctness.
Please consult deprecation warnings for more details.

BUILD FAILED in 1h 39m 34s
219 actionable tasks: 149 executed, 64 from cache, 6 up-to-date

Publishing build scan...
https://gradle.com/s/iqg5xgxb5usck

Build step 'Invoke Gradle script' changed build result to FAILURE
Build step 'Invoke Gradle script' marked build as failure

---------------------------------------------------------------------
To unsubscribe, e-mail: builds-unsubscribe@beam.apache.org
For additional commands, e-mail: builds-help@beam.apache.org


Build failed in Jenkins: beam_PostCommit_Python36 #5217

Posted by Apache Jenkins Server <je...@builds.apache.org>.
See <https://ci-beam.apache.org/job/beam_PostCommit_Python36/5217/display/redirect?page=changes>

Changes:

[noreply] [BEAM-14112] Fixed ReadFromBigQuery with Interactive Beam (#17306)


------------------------------------------
[...truncated 36.36 MB...]
apache_beam/io/gcp/bigquery.py:2152
  <https://ci-beam.apache.org/job/beam_PostCommit_Python36/ws/src/sdks/python/apache_beam/io/gcp/bigquery.py>:2152: BeamDeprecationWarning: options is deprecated since First stable release. References to <pipeline>.options will not be supported
    is_streaming_pipeline = p.options.view_as(StandardOptions).streaming

apache_beam/io/gcp/bigquery.py:2158
apache_beam/io/gcp/bigquery.py:2158
apache_beam/io/gcp/bigquery.py:2158
apache_beam/io/gcp/bigquery.py:2158
apache_beam/io/gcp/bigquery.py:2158
apache_beam/io/gcp/bigquery.py:2158
apache_beam/io/gcp/bigquery.py:2158
apache_beam/io/gcp/bigquery.py:2158
apache_beam/io/gcp/bigquery.py:2158
apache_beam/io/gcp/bigquery.py:2158
apache_beam/io/gcp/bigquery.py:2158
apache_beam/io/gcp/bigquery.py:2158
apache_beam/io/gcp/bigquery.py:2158
apache_beam/io/gcp/bigquery.py:2158
apache_beam/io/gcp/bigquery.py:2158
apache_beam/io/gcp/bigquery.py:2158
apache_beam/io/gcp/bigquery.py:2158
apache_beam/io/gcp/bigquery.py:2158
apache_beam/io/gcp/bigquery.py:2158
apache_beam/io/gcp/bigquery.py:2158
apache_beam/io/gcp/bigquery.py:2158
apache_beam/io/gcp/bigquery.py:2158
apache_beam/io/gcp/bigquery.py:2158
apache_beam/io/gcp/bigquery.py:2158
  <https://ci-beam.apache.org/job/beam_PostCommit_Python36/ws/src/sdks/python/apache_beam/io/gcp/bigquery.py>:2158: BeamDeprecationWarning: options is deprecated since First stable release. References to <pipeline>.options will not be supported
    experiments = p.options.view_as(DebugOptions).experiments or []

apache_beam/io/gcp/bigquery.py:2452
apache_beam/io/gcp/bigquery.py:2452
apache_beam/io/gcp/bigquery.py:2452
apache_beam/io/gcp/bigquery.py:2452
apache_beam/io/gcp/bigquery.py:2452
apache_beam/io/gcp/bigquery.py:2452
apache_beam/io/gcp/bigquery.py:2452
apache_beam/io/gcp/bigquery.py:2452
apache_beam/io/gcp/bigquery.py:2452
apache_beam/io/gcp/bigquery.py:2452
apache_beam/io/gcp/bigquery.py:2452
apache_beam/io/gcp/bigquery.py:2452
apache_beam/io/gcp/bigquery.py:2452
apache_beam/io/gcp/bigquery.py:2452
apache_beam/io/gcp/bigquery.py:2452
  <https://ci-beam.apache.org/job/beam_PostCommit_Python36/ws/src/sdks/python/apache_beam/io/gcp/bigquery.py>:2452: BeamDeprecationWarning: options is deprecated since First stable release. References to <pipeline>.options will not be supported
    temp_location = pcoll.pipeline.options.view_as(

apache_beam/io/gcp/bigquery.py:2454
apache_beam/io/gcp/bigquery.py:2454
apache_beam/io/gcp/bigquery.py:2454
apache_beam/io/gcp/bigquery.py:2454
apache_beam/io/gcp/bigquery.py:2454
apache_beam/io/gcp/bigquery.py:2454
apache_beam/io/gcp/bigquery.py:2454
apache_beam/io/gcp/bigquery.py:2454
apache_beam/io/gcp/bigquery.py:2454
apache_beam/io/gcp/bigquery.py:2454
apache_beam/io/gcp/bigquery.py:2454
apache_beam/io/gcp/bigquery.py:2454
apache_beam/io/gcp/bigquery.py:2454
apache_beam/io/gcp/bigquery.py:2454
apache_beam/io/gcp/bigquery.py:2454
  <https://ci-beam.apache.org/job/beam_PostCommit_Python36/ws/src/sdks/python/apache_beam/io/gcp/bigquery.py>:2454: BeamDeprecationWarning: options is deprecated since First stable release. References to <pipeline>.options will not be supported
    job_name = pcoll.pipeline.options.view_as(GoogleCloudOptions).job_name

apache_beam/io/gcp/bigquery.py:2485
apache_beam/io/gcp/bigquery.py:2485
apache_beam/io/gcp/bigquery.py:2485
apache_beam/io/gcp/bigquery.py:2485
apache_beam/io/gcp/bigquery.py:2485
apache_beam/io/gcp/bigquery.py:2485
apache_beam/io/gcp/bigquery.py:2485
apache_beam/io/gcp/bigquery.py:2485
apache_beam/io/gcp/bigquery.py:2485
apache_beam/io/gcp/bigquery.py:2485
apache_beam/io/gcp/bigquery.py:2485
apache_beam/io/gcp/bigquery.py:2485
apache_beam/io/gcp/bigquery.py:2485
apache_beam/io/gcp/bigquery.py:2485
apache_beam/io/gcp/bigquery.py:2485
  <https://ci-beam.apache.org/job/beam_PostCommit_Python36/ws/src/sdks/python/apache_beam/io/gcp/bigquery.py>:2485: BeamDeprecationWarning: options is deprecated since First stable release. References to <pipeline>.options will not be supported
    | _PassThroughThenCleanup(files_to_remove_pcoll))

apache_beam/io/gcp/bigquery.py:2148
apache_beam/io/gcp/bigquery.py:2148
apache_beam/io/gcp/bigquery.py:2148
apache_beam/io/gcp/bigquery.py:2148
apache_beam/io/gcp/bigquery.py:2148
apache_beam/io/gcp/bigquery.py:2148
apache_beam/io/gcp/bigquery.py:2148
apache_beam/io/gcp/bigquery.py:2148
apache_beam/io/gcp/bigquery.py:2148
apache_beam/io/gcp/bigquery.py:2148
apache_beam/io/gcp/bigquery.py:2148
apache_beam/io/gcp/bigquery.py:2148
  <https://ci-beam.apache.org/job/beam_PostCommit_Python36/ws/src/sdks/python/apache_beam/io/gcp/bigquery.py>:2148: BeamDeprecationWarning: options is deprecated since First stable release. References to <pipeline>.options will not be supported
    self.table_reference.projectId = pcoll.pipeline.options.view_as(

apache_beam/io/gcp/bigquery_file_loads.py:1128
apache_beam/io/gcp/bigquery_file_loads.py:1128
apache_beam/io/gcp/bigquery_file_loads.py:1128
apache_beam/io/gcp/bigquery_file_loads.py:1128
apache_beam/io/gcp/bigquery_file_loads.py:1128
apache_beam/io/gcp/bigquery_file_loads.py:1128
apache_beam/io/gcp/bigquery_file_loads.py:1128
apache_beam/io/gcp/bigquery_file_loads.py:1128
apache_beam/io/gcp/bigquery_file_loads.py:1128
apache_beam/io/gcp/bigquery_file_loads.py:1128
apache_beam/io/gcp/bigquery_file_loads.py:1128
apache_beam/io/gcp/bigquery_file_loads.py:1128
apache_beam/io/gcp/bigquery_file_loads.py:1128
apache_beam/io/gcp/bigquery_file_loads.py:1128
apache_beam/io/gcp/bigquery_file_loads.py:1128
apache_beam/io/gcp/bigquery_file_loads.py:1128
apache_beam/io/gcp/bigquery_file_loads.py:1128
  <https://ci-beam.apache.org/job/beam_PostCommit_Python36/ws/src/sdks/python/apache_beam/io/gcp/bigquery_file_loads.py>:1128: BeamDeprecationWarning: options is deprecated since First stable release. References to <pipeline>.options will not be supported
    temp_location = p.options.view_as(GoogleCloudOptions).temp_location

apache_beam/io/gcp/bigquery_file_loads.py:1130
apache_beam/io/gcp/bigquery_file_loads.py:1130
apache_beam/io/gcp/bigquery_file_loads.py:1130
apache_beam/io/gcp/bigquery_file_loads.py:1130
apache_beam/io/gcp/bigquery_file_loads.py:1130
apache_beam/io/gcp/bigquery_file_loads.py:1130
apache_beam/io/gcp/bigquery_file_loads.py:1130
apache_beam/io/gcp/bigquery_file_loads.py:1130
apache_beam/io/gcp/bigquery_file_loads.py:1130
apache_beam/io/gcp/bigquery_file_loads.py:1130
apache_beam/io/gcp/bigquery_file_loads.py:1130
apache_beam/io/gcp/bigquery_file_loads.py:1130
apache_beam/io/gcp/bigquery_file_loads.py:1130
apache_beam/io/gcp/bigquery_file_loads.py:1130
apache_beam/io/gcp/bigquery_file_loads.py:1130
apache_beam/io/gcp/bigquery_file_loads.py:1130
apache_beam/io/gcp/bigquery_file_loads.py:1130
  <https://ci-beam.apache.org/job/beam_PostCommit_Python36/ws/src/sdks/python/apache_beam/io/gcp/bigquery_file_loads.py>:1130: BeamDeprecationWarning: options is deprecated since First stable release. References to <pipeline>.options will not be supported
    p.options.view_as(GoogleCloudOptions).job_name or 'AUTOMATIC_JOB_NAME')

apache_beam/io/gcp/tests/utils.py:100
  <https://ci-beam.apache.org/job/beam_PostCommit_Python36/ws/src/sdks/python/apache_beam/io/gcp/tests/utils.py>:100: PendingDeprecationWarning: Client.dataset is deprecated and will be removed in a future version. Use a string like 'my_project.my_dataset' or a cloud.google.bigquery.DatasetReference object, instead.
    table_ref = client.dataset(dataset_id).table(table_id)

apache_beam/dataframe/io.py:632
apache_beam/dataframe/io.py:632
apache_beam/dataframe/io.py:632
  <https://ci-beam.apache.org/job/beam_PostCommit_Python36/ws/src/sdks/python/apache_beam/dataframe/io.py>:632: FutureWarning: WriteToFiles is experimental.
    sink=lambda _: _WriteToPandasFileSink(

apache_beam/io/fileio.py:550
apache_beam/io/fileio.py:550
apache_beam/io/fileio.py:550
  <https://ci-beam.apache.org/job/beam_PostCommit_Python36/ws/src/sdks/python/apache_beam/io/fileio.py>:550: BeamDeprecationWarning: options is deprecated since First stable release. References to <pipeline>.options will not be supported
    p.options.view_as(GoogleCloudOptions).temp_location or

apache_beam/io/gcp/bigquery_test.py:1183
  <https://ci-beam.apache.org/job/beam_PostCommit_Python36/ws/src/sdks/python/apache_beam/io/gcp/bigquery_test.py>:1183: BeamDeprecationWarning: options is deprecated since First stable release. References to <pipeline>.options will not be supported
    streaming = self.test_pipeline.options.view_as(StandardOptions).streaming

apache_beam/io/gcp/bigquery_read_it_test.py:169
  <https://ci-beam.apache.org/job/beam_PostCommit_Python36/ws/src/sdks/python/apache_beam/io/gcp/bigquery_read_it_test.py>:169: BeamDeprecationWarning: BigQuerySource is deprecated since 2.25.0. Use ReadFromBigQuery instead.
    beam.io.BigQuerySource(query=self.query, use_standard_sql=True)))

apache_beam/io/gcp/bigquery_read_it_test.py:558
  <https://ci-beam.apache.org/job/beam_PostCommit_Python36/ws/src/sdks/python/apache_beam/io/gcp/bigquery_read_it_test.py>:558: BeamDeprecationWarning: BigQuerySource is deprecated since 2.25.0. Use ReadFromBigQuery instead.
    beam.io.BigQuerySource(query=self.query, use_standard_sql=True)))

apache_beam/io/gcp/big_query_query_to_table_pipeline.py:84
apache_beam/io/gcp/big_query_query_to_table_pipeline.py:84
  <https://ci-beam.apache.org/job/beam_PostCommit_Python36/ws/src/sdks/python/apache_beam/io/gcp/big_query_query_to_table_pipeline.py>:84: BeamDeprecationWarning: BigQuerySource is deprecated since 2.25.0. Use ReadFromBigQuery instead.
    kms_key=kms_key))

apache_beam/runners/dataflow/ptransform_overrides.py:323
apache_beam/runners/dataflow/ptransform_overrides.py:323
  <https://ci-beam.apache.org/job/beam_PostCommit_Python36/ws/src/sdks/python/apache_beam/runners/dataflow/ptransform_overrides.py>:323: BeamDeprecationWarning: BigQuerySink is deprecated since 2.11.0. Use WriteToBigQuery instead.
    kms_key=self.kms_key))

apache_beam/io/gcp/bigquery_read_it_test.py:672
  <https://ci-beam.apache.org/job/beam_PostCommit_Python36/ws/src/sdks/python/apache_beam/io/gcp/bigquery_read_it_test.py>:672: FutureWarning: ReadAllFromBigQuery is experimental.
    | beam.io.ReadAllFromBigQuery())

apache_beam/io/gcp/bigquery.py:2626
  <https://ci-beam.apache.org/job/beam_PostCommit_Python36/ws/src/sdks/python/apache_beam/io/gcp/bigquery.py>:2626: BeamDeprecationWarning: options is deprecated since First stable release. References to <pipeline>.options will not be supported
    job_name = pcoll.pipeline.options.view_as(GoogleCloudOptions).job_name

apache_beam/io/gcp/bigquery.py:2627
  <https://ci-beam.apache.org/job/beam_PostCommit_Python36/ws/src/sdks/python/apache_beam/io/gcp/bigquery.py>:2627: BeamDeprecationWarning: options is deprecated since First stable release. References to <pipeline>.options will not be supported
    project = pcoll.pipeline.options.view_as(GoogleCloudOptions).project

apache_beam/io/gcp/bigquery.py:2640
  <https://ci-beam.apache.org/job/beam_PostCommit_Python36/ws/src/sdks/python/apache_beam/io/gcp/bigquery.py>:2640: BeamDeprecationWarning: options is deprecated since First stable release. References to <pipeline>.options will not be supported
    options=pcoll.pipeline.options,

apache_beam/runners/interactive/interactive_environment.py:399
  <https://ci-beam.apache.org/job/beam_PostCommit_Python36/ws/src/sdks/python/apache_beam/runners/interactive/interactive_environment.py>:399: BeamDeprecationWarning: options is deprecated since First stable release. References to <pipeline>.options will not be supported
    staging_location = pipeline.options.get_all_options(

apache_beam/runners/interactive/recording_manager.py:410
  <https://ci-beam.apache.org/job/beam_PostCommit_Python36/ws/src/sdks/python/apache_beam/runners/interactive/recording_manager.py>:410: BeamDeprecationWarning: options is deprecated since First stable release. References to <pipeline>.options will not be supported
    options=self.user_pipeline.options,

apache_beam/ml/gcp/cloud_dlp_it_test.py:77
  <https://ci-beam.apache.org/job/beam_PostCommit_Python36/ws/src/sdks/python/apache_beam/ml/gcp/cloud_dlp_it_test.py>:77: FutureWarning: MaskDetectedDetails is experimental.
    inspection_config=INSPECT_CONFIG))

apache_beam/ml/gcp/cloud_dlp_it_test.py:87
  <https://ci-beam.apache.org/job/beam_PostCommit_Python36/ws/src/sdks/python/apache_beam/ml/gcp/cloud_dlp_it_test.py>:87: FutureWarning: InspectForDetails is experimental.
    | beam.ParDo(extract_inspection_results).with_outputs(

-- Docs: https://docs.pytest.org/en/latest/warnings.html
- generated xml file: <https://ci-beam.apache.org/job/beam_PostCommit_Python36/ws/src/sdks/python/pytest_postCommitIT-df-py36.xml> -
======= 1 failed, 61 passed, 8 skipped, 168 warnings in 5825.81 seconds ========

> Task :sdks:python:test-suites:dataflow:py36:postCommitIT FAILED

FAILURE: Build failed with an exception.

* Where:
Script '<https://ci-beam.apache.org/job/beam_PostCommit_Python36/ws/src/sdks/python/test-suites/dataflow/common.gradle'> line: 121

* What went wrong:
Execution failed for task ':sdks:python:test-suites:dataflow:py36:postCommitIT'.
> Process 'command 'sh'' finished with non-zero exit value 1

* Try:
> Run with --stacktrace option to get the stack trace.
> Run with --info or --debug option to get more log output.
> Run with --scan to get full insights.

* Get more help at https://help.gradle.org

Deprecated Gradle features were used in this build, making it incompatible with Gradle 8.0.

You can use '--warning-mode all' to show the individual deprecation warnings and determine if they come from your own scripts or plugins.

See https://docs.gradle.org/7.4/userguide/command_line_interface.html#sec:command_line_warnings

Execution optimizations have been disabled for 1 invalid unit(s) of work during this build to ensure correctness.
Please consult deprecation warnings for more details.

BUILD FAILED in 1h 42m 4s
219 actionable tasks: 151 executed, 62 from cache, 6 up-to-date

Publishing build scan...
https://gradle.com/s/yyn3dhflpcr7c

Build step 'Invoke Gradle script' changed build result to FAILURE
Build step 'Invoke Gradle script' marked build as failure

---------------------------------------------------------------------
To unsubscribe, e-mail: builds-unsubscribe@beam.apache.org
For additional commands, e-mail: builds-help@beam.apache.org


Build failed in Jenkins: beam_PostCommit_Python36 #5216

Posted by Apache Jenkins Server <je...@builds.apache.org>.
See <https://ci-beam.apache.org/job/beam_PostCommit_Python36/5216/display/redirect?page=changes>

Changes:

[mmack] [BEAM-14323] Improve IDE integration of Spark cross version builds


------------------------------------------
[...truncated 35.77 MB...]
apache_beam/io/gcp/bigquery.py:2143
apache_beam/io/gcp/bigquery.py:2143
apache_beam/io/gcp/bigquery.py:2143
apache_beam/io/gcp/bigquery.py:2143
apache_beam/io/gcp/bigquery.py:2143
apache_beam/io/gcp/bigquery.py:2143
apache_beam/io/gcp/bigquery.py:2143
apache_beam/io/gcp/bigquery.py:2143
apache_beam/io/gcp/bigquery.py:2143
apache_beam/io/gcp/bigquery.py:2143
apache_beam/io/gcp/bigquery.py:2143
apache_beam/io/gcp/bigquery.py:2143
  <https://ci-beam.apache.org/job/beam_PostCommit_Python36/ws/src/sdks/python/apache_beam/io/gcp/bigquery.py>:2143: BeamDeprecationWarning: options is deprecated since First stable release. References to <pipeline>.options will not be supported
    is_streaming_pipeline = p.options.view_as(StandardOptions).streaming

apache_beam/io/gcp/bigquery.py:2149
apache_beam/io/gcp/bigquery.py:2149
apache_beam/io/gcp/bigquery.py:2149
apache_beam/io/gcp/bigquery.py:2149
apache_beam/io/gcp/bigquery.py:2149
apache_beam/io/gcp/bigquery.py:2149
apache_beam/io/gcp/bigquery.py:2149
apache_beam/io/gcp/bigquery.py:2149
apache_beam/io/gcp/bigquery.py:2149
apache_beam/io/gcp/bigquery.py:2149
apache_beam/io/gcp/bigquery.py:2149
apache_beam/io/gcp/bigquery.py:2149
apache_beam/io/gcp/bigquery.py:2149
apache_beam/io/gcp/bigquery.py:2149
apache_beam/io/gcp/bigquery.py:2149
apache_beam/io/gcp/bigquery.py:2149
apache_beam/io/gcp/bigquery.py:2149
apache_beam/io/gcp/bigquery.py:2149
apache_beam/io/gcp/bigquery.py:2149
apache_beam/io/gcp/bigquery.py:2149
apache_beam/io/gcp/bigquery.py:2149
apache_beam/io/gcp/bigquery.py:2149
apache_beam/io/gcp/bigquery.py:2149
apache_beam/io/gcp/bigquery.py:2149
  <https://ci-beam.apache.org/job/beam_PostCommit_Python36/ws/src/sdks/python/apache_beam/io/gcp/bigquery.py>:2149: BeamDeprecationWarning: options is deprecated since First stable release. References to <pipeline>.options will not be supported
    experiments = p.options.view_as(DebugOptions).experiments or []

apache_beam/io/gcp/bigquery.py:2443
apache_beam/io/gcp/bigquery.py:2443
apache_beam/io/gcp/bigquery.py:2443
apache_beam/io/gcp/bigquery.py:2443
apache_beam/io/gcp/bigquery.py:2443
apache_beam/io/gcp/bigquery.py:2443
apache_beam/io/gcp/bigquery.py:2443
apache_beam/io/gcp/bigquery.py:2443
apache_beam/io/gcp/bigquery.py:2443
apache_beam/io/gcp/bigquery.py:2443
apache_beam/io/gcp/bigquery.py:2443
apache_beam/io/gcp/bigquery.py:2443
apache_beam/io/gcp/bigquery.py:2443
apache_beam/io/gcp/bigquery.py:2443
  <https://ci-beam.apache.org/job/beam_PostCommit_Python36/ws/src/sdks/python/apache_beam/io/gcp/bigquery.py>:2443: BeamDeprecationWarning: options is deprecated since First stable release. References to <pipeline>.options will not be supported
    temp_location = pcoll.pipeline.options.view_as(

apache_beam/io/gcp/bigquery.py:2445
apache_beam/io/gcp/bigquery.py:2445
apache_beam/io/gcp/bigquery.py:2445
apache_beam/io/gcp/bigquery.py:2445
apache_beam/io/gcp/bigquery.py:2445
apache_beam/io/gcp/bigquery.py:2445
apache_beam/io/gcp/bigquery.py:2445
apache_beam/io/gcp/bigquery.py:2445
apache_beam/io/gcp/bigquery.py:2445
apache_beam/io/gcp/bigquery.py:2445
apache_beam/io/gcp/bigquery.py:2445
apache_beam/io/gcp/bigquery.py:2445
apache_beam/io/gcp/bigquery.py:2445
apache_beam/io/gcp/bigquery.py:2445
  <https://ci-beam.apache.org/job/beam_PostCommit_Python36/ws/src/sdks/python/apache_beam/io/gcp/bigquery.py>:2445: BeamDeprecationWarning: options is deprecated since First stable release. References to <pipeline>.options will not be supported
    job_name = pcoll.pipeline.options.view_as(GoogleCloudOptions).job_name

apache_beam/io/gcp/bigquery.py:2476
apache_beam/io/gcp/bigquery.py:2476
apache_beam/io/gcp/bigquery.py:2476
apache_beam/io/gcp/bigquery.py:2476
apache_beam/io/gcp/bigquery.py:2476
apache_beam/io/gcp/bigquery.py:2476
apache_beam/io/gcp/bigquery.py:2476
apache_beam/io/gcp/bigquery.py:2476
apache_beam/io/gcp/bigquery.py:2476
apache_beam/io/gcp/bigquery.py:2476
apache_beam/io/gcp/bigquery.py:2476
apache_beam/io/gcp/bigquery.py:2476
apache_beam/io/gcp/bigquery.py:2476
apache_beam/io/gcp/bigquery.py:2476
  <https://ci-beam.apache.org/job/beam_PostCommit_Python36/ws/src/sdks/python/apache_beam/io/gcp/bigquery.py>:2476: BeamDeprecationWarning: options is deprecated since First stable release. References to <pipeline>.options will not be supported
    | _PassThroughThenCleanup(files_to_remove_pcoll))

apache_beam/io/gcp/bigquery.py:2139
apache_beam/io/gcp/bigquery.py:2139
apache_beam/io/gcp/bigquery.py:2139
apache_beam/io/gcp/bigquery.py:2139
apache_beam/io/gcp/bigquery.py:2139
apache_beam/io/gcp/bigquery.py:2139
apache_beam/io/gcp/bigquery.py:2139
apache_beam/io/gcp/bigquery.py:2139
apache_beam/io/gcp/bigquery.py:2139
apache_beam/io/gcp/bigquery.py:2139
apache_beam/io/gcp/bigquery.py:2139
apache_beam/io/gcp/bigquery.py:2139
  <https://ci-beam.apache.org/job/beam_PostCommit_Python36/ws/src/sdks/python/apache_beam/io/gcp/bigquery.py>:2139: BeamDeprecationWarning: options is deprecated since First stable release. References to <pipeline>.options will not be supported
    self.table_reference.projectId = pcoll.pipeline.options.view_as(

apache_beam/io/gcp/bigquery_file_loads.py:1128
apache_beam/io/gcp/bigquery_file_loads.py:1128
apache_beam/io/gcp/bigquery_file_loads.py:1128
apache_beam/io/gcp/bigquery_file_loads.py:1128
apache_beam/io/gcp/bigquery_file_loads.py:1128
apache_beam/io/gcp/bigquery_file_loads.py:1128
apache_beam/io/gcp/bigquery_file_loads.py:1128
apache_beam/io/gcp/bigquery_file_loads.py:1128
apache_beam/io/gcp/bigquery_file_loads.py:1128
apache_beam/io/gcp/bigquery_file_loads.py:1128
apache_beam/io/gcp/bigquery_file_loads.py:1128
apache_beam/io/gcp/bigquery_file_loads.py:1128
apache_beam/io/gcp/bigquery_file_loads.py:1128
apache_beam/io/gcp/bigquery_file_loads.py:1128
apache_beam/io/gcp/bigquery_file_loads.py:1128
apache_beam/io/gcp/bigquery_file_loads.py:1128
apache_beam/io/gcp/bigquery_file_loads.py:1128
  <https://ci-beam.apache.org/job/beam_PostCommit_Python36/ws/src/sdks/python/apache_beam/io/gcp/bigquery_file_loads.py>:1128: BeamDeprecationWarning: options is deprecated since First stable release. References to <pipeline>.options will not be supported
    temp_location = p.options.view_as(GoogleCloudOptions).temp_location

apache_beam/io/gcp/bigquery_file_loads.py:1130
apache_beam/io/gcp/bigquery_file_loads.py:1130
apache_beam/io/gcp/bigquery_file_loads.py:1130
apache_beam/io/gcp/bigquery_file_loads.py:1130
apache_beam/io/gcp/bigquery_file_loads.py:1130
apache_beam/io/gcp/bigquery_file_loads.py:1130
apache_beam/io/gcp/bigquery_file_loads.py:1130
apache_beam/io/gcp/bigquery_file_loads.py:1130
apache_beam/io/gcp/bigquery_file_loads.py:1130
apache_beam/io/gcp/bigquery_file_loads.py:1130
apache_beam/io/gcp/bigquery_file_loads.py:1130
apache_beam/io/gcp/bigquery_file_loads.py:1130
apache_beam/io/gcp/bigquery_file_loads.py:1130
apache_beam/io/gcp/bigquery_file_loads.py:1130
apache_beam/io/gcp/bigquery_file_loads.py:1130
apache_beam/io/gcp/bigquery_file_loads.py:1130
apache_beam/io/gcp/bigquery_file_loads.py:1130
  <https://ci-beam.apache.org/job/beam_PostCommit_Python36/ws/src/sdks/python/apache_beam/io/gcp/bigquery_file_loads.py>:1130: BeamDeprecationWarning: options is deprecated since First stable release. References to <pipeline>.options will not be supported
    p.options.view_as(GoogleCloudOptions).job_name or 'AUTOMATIC_JOB_NAME')

apache_beam/io/gcp/tests/utils.py:100
  <https://ci-beam.apache.org/job/beam_PostCommit_Python36/ws/src/sdks/python/apache_beam/io/gcp/tests/utils.py>:100: PendingDeprecationWarning: Client.dataset is deprecated and will be removed in a future version. Use a string like 'my_project.my_dataset' or a cloud.google.bigquery.DatasetReference object, instead.
    table_ref = client.dataset(dataset_id).table(table_id)

apache_beam/dataframe/io.py:632
apache_beam/dataframe/io.py:632
apache_beam/dataframe/io.py:632
  <https://ci-beam.apache.org/job/beam_PostCommit_Python36/ws/src/sdks/python/apache_beam/dataframe/io.py>:632: FutureWarning: WriteToFiles is experimental.
    sink=lambda _: _WriteToPandasFileSink(

apache_beam/io/fileio.py:550
apache_beam/io/fileio.py:550
apache_beam/io/fileio.py:550
  <https://ci-beam.apache.org/job/beam_PostCommit_Python36/ws/src/sdks/python/apache_beam/io/fileio.py>:550: BeamDeprecationWarning: options is deprecated since First stable release. References to <pipeline>.options will not be supported
    p.options.view_as(GoogleCloudOptions).temp_location or

apache_beam/io/gcp/bigquery_test.py:1183
  <https://ci-beam.apache.org/job/beam_PostCommit_Python36/ws/src/sdks/python/apache_beam/io/gcp/bigquery_test.py>:1183: BeamDeprecationWarning: options is deprecated since First stable release. References to <pipeline>.options will not be supported
    streaming = self.test_pipeline.options.view_as(StandardOptions).streaming

apache_beam/io/gcp/bigquery_read_it_test.py:167
  <https://ci-beam.apache.org/job/beam_PostCommit_Python36/ws/src/sdks/python/apache_beam/io/gcp/bigquery_read_it_test.py>:167: BeamDeprecationWarning: BigQuerySource is deprecated since 2.25.0. Use ReadFromBigQuery instead.
    beam.io.BigQuerySource(query=self.query, use_standard_sql=True)))

apache_beam/io/gcp/big_query_query_to_table_pipeline.py:84
apache_beam/io/gcp/big_query_query_to_table_pipeline.py:84
  <https://ci-beam.apache.org/job/beam_PostCommit_Python36/ws/src/sdks/python/apache_beam/io/gcp/big_query_query_to_table_pipeline.py>:84: BeamDeprecationWarning: BigQuerySource is deprecated since 2.25.0. Use ReadFromBigQuery instead.
    kms_key=kms_key))

apache_beam/runners/dataflow/ptransform_overrides.py:323
apache_beam/runners/dataflow/ptransform_overrides.py:323
  <https://ci-beam.apache.org/job/beam_PostCommit_Python36/ws/src/sdks/python/apache_beam/runners/dataflow/ptransform_overrides.py>:323: BeamDeprecationWarning: BigQuerySink is deprecated since 2.11.0. Use WriteToBigQuery instead.
    kms_key=self.kms_key))

apache_beam/io/gcp/bigquery_read_it_test.py:556
  <https://ci-beam.apache.org/job/beam_PostCommit_Python36/ws/src/sdks/python/apache_beam/io/gcp/bigquery_read_it_test.py>:556: BeamDeprecationWarning: BigQuerySource is deprecated since 2.25.0. Use ReadFromBigQuery instead.
    beam.io.BigQuerySource(query=self.query, use_standard_sql=True)))

apache_beam/io/gcp/bigquery_read_it_test.py:670
  <https://ci-beam.apache.org/job/beam_PostCommit_Python36/ws/src/sdks/python/apache_beam/io/gcp/bigquery_read_it_test.py>:670: FutureWarning: ReadAllFromBigQuery is experimental.
    | beam.io.ReadAllFromBigQuery())

apache_beam/io/gcp/bigquery.py:2617
  <https://ci-beam.apache.org/job/beam_PostCommit_Python36/ws/src/sdks/python/apache_beam/io/gcp/bigquery.py>:2617: BeamDeprecationWarning: options is deprecated since First stable release. References to <pipeline>.options will not be supported
    job_name = pcoll.pipeline.options.view_as(GoogleCloudOptions).job_name

apache_beam/io/gcp/bigquery.py:2618
  <https://ci-beam.apache.org/job/beam_PostCommit_Python36/ws/src/sdks/python/apache_beam/io/gcp/bigquery.py>:2618: BeamDeprecationWarning: options is deprecated since First stable release. References to <pipeline>.options will not be supported
    project = pcoll.pipeline.options.view_as(GoogleCloudOptions).project

apache_beam/io/gcp/bigquery.py:2631
  <https://ci-beam.apache.org/job/beam_PostCommit_Python36/ws/src/sdks/python/apache_beam/io/gcp/bigquery.py>:2631: BeamDeprecationWarning: options is deprecated since First stable release. References to <pipeline>.options will not be supported
    options=pcoll.pipeline.options,

apache_beam/ml/gcp/cloud_dlp_it_test.py:77
  <https://ci-beam.apache.org/job/beam_PostCommit_Python36/ws/src/sdks/python/apache_beam/ml/gcp/cloud_dlp_it_test.py>:77: FutureWarning: MaskDetectedDetails is experimental.
    inspection_config=INSPECT_CONFIG))

apache_beam/ml/gcp/cloud_dlp_it_test.py:87
  <https://ci-beam.apache.org/job/beam_PostCommit_Python36/ws/src/sdks/python/apache_beam/ml/gcp/cloud_dlp_it_test.py>:87: FutureWarning: InspectForDetails is experimental.
    | beam.ParDo(extract_inspection_results).with_outputs(

-- Docs: https://docs.pytest.org/en/latest/warnings.html
- generated xml file: <https://ci-beam.apache.org/job/beam_PostCommit_Python36/ws/src/sdks/python/pytest_postCommitIT-df-py36.xml> -
======= 1 failed, 60 passed, 8 skipped, 169 warnings in 5599.22 seconds ========

> Task :sdks:python:test-suites:dataflow:py36:postCommitIT FAILED

FAILURE: Build failed with an exception.

* Where:
Script '<https://ci-beam.apache.org/job/beam_PostCommit_Python36/ws/src/sdks/python/test-suites/dataflow/common.gradle'> line: 121

* What went wrong:
Execution failed for task ':sdks:python:test-suites:dataflow:py36:postCommitIT'.
> Process 'command 'sh'' finished with non-zero exit value 1

* Try:
> Run with --stacktrace option to get the stack trace.
> Run with --info or --debug option to get more log output.
> Run with --scan to get full insights.

* Get more help at https://help.gradle.org

Deprecated Gradle features were used in this build, making it incompatible with Gradle 8.0.

You can use '--warning-mode all' to show the individual deprecation warnings and determine if they come from your own scripts or plugins.

See https://docs.gradle.org/7.4/userguide/command_line_interface.html#sec:command_line_warnings

Execution optimizations have been disabled for 1 invalid unit(s) of work during this build to ensure correctness.
Please consult deprecation warnings for more details.

BUILD FAILED in 1h 35m 6s
219 actionable tasks: 149 executed, 64 from cache, 6 up-to-date

Publishing build scan...
https://gradle.com/s/edwe47cvpauj6

Build step 'Invoke Gradle script' changed build result to FAILURE
Build step 'Invoke Gradle script' marked build as failure

---------------------------------------------------------------------
To unsubscribe, e-mail: builds-unsubscribe@beam.apache.org
For additional commands, e-mail: builds-help@beam.apache.org


Build failed in Jenkins: beam_PostCommit_Python36 #5215

Posted by Apache Jenkins Server <je...@builds.apache.org>.
See <https://ci-beam.apache.org/job/beam_PostCommit_Python36/5215/display/redirect>

Changes:


------------------------------------------
[...truncated 23.79 MB...]
message: "Closing all cached grpc data channels."
log_location: "/usr/local/lib/python3.6/site-packages/apache_beam/runners/worker/data_plane.py:782"
thread: "MainThread"

INFO:root:severity: INFO
timestamp {
  seconds: 1650445007
  nanos: 803620815
}
message: "Closing all cached gRPC state handlers."
log_location: "/usr/local/lib/python3.6/site-packages/apache_beam/runners/worker/sdk_worker.py:859"
thread: "MainThread"

INFO:root:severity: INFO
timestamp {
  seconds: 1650445007
  nanos: 803847312
}
message: "Done consuming work."
log_location: "/usr/local/lib/python3.6/site-packages/apache_beam/runners/worker/sdk_worker.py:257"
thread: "MainThread"

INFO:root:severity: INFO
timestamp {
  seconds: 1650445007
  nanos: 803915262
}
message: "Python sdk harness exiting."
log_location: "/usr/local/lib/python3.6/site-packages/apache_beam/runners/worker/sdk_worker_main.py:181"
thread: "MainThread"

INFO:apache_beam.runners.portability.local_job_service:Completed job in 8.512784719467163 seconds with state DONE.
INFO:root:Completed job in 8.512784719467163 seconds with state DONE.
INFO:apache_beam.runners.portability.portable_runner:Job state changed to DONE

> Task :sdks:python:test-suites:portable:py36:portableWordCountSparkRunnerBatch
INFO:apache_beam.runners.worker.worker_pool_main:Listening for workers at localhost:34591
WARNING:root:Make sure that locally built Python SDK docker image has Python 3.6 interpreter.
INFO:root:Default Python SDK image for environment is apache/beam_python3.6_sdk:2.39.0.dev
INFO:apache_beam.runners.portability.fn_api_runner.translations:==================== <function pack_combiners at 0x7fa931d40840> ====================
INFO:apache_beam.runners.portability.fn_api_runner.translations:==================== <function lift_combiners at 0x7fa931d408c8> ====================
INFO:apache_beam.runners.portability.fn_api_runner.translations:==================== <function sort_stages at 0x7fa931d42048> ====================
INFO:apache_beam.utils.subprocess_server:Starting service with ['java' '-jar' '<https://ci-beam.apache.org/job/beam_PostCommit_Python36/ws/src/runners/spark/2/job-server/build/libs/beam-runners-spark-job-server-2.39.0-SNAPSHOT.jar'> '--spark-master-url' 'local[4]' '--artifacts-dir' '/tmp/beam-tempf1k026qp/artifactst8amzecx' '--job-port' '43315' '--artifact-port' '0' '--expansion-port' '0']
E0420 08:56:50.803499716  922968 fork_posix.cc:70]           Fork support is only compatible with the epoll1 and poll polling strategies
INFO:apache_beam.utils.subprocess_server:b'22/04/20 08:56:52 WARN software.amazon.awssdk.regions.internal.util.EC2MetadataUtils: Unable to retrieve the requested metadata.'
INFO:apache_beam.utils.subprocess_server:b'22/04/20 08:56:52 INFO org.apache.beam.runners.jobsubmission.JobServerDriver: ArtifactStagingService started on localhost:34481'
INFO:apache_beam.utils.subprocess_server:b'22/04/20 08:56:52 INFO org.apache.beam.runners.jobsubmission.JobServerDriver: Java ExpansionService started on localhost:36573'
INFO:apache_beam.utils.subprocess_server:b'22/04/20 08:56:52 INFO org.apache.beam.runners.jobsubmission.JobServerDriver: JobService started on localhost:43315'
INFO:apache_beam.utils.subprocess_server:b'22/04/20 08:56:52 INFO org.apache.beam.runners.jobsubmission.JobServerDriver: Job server now running, terminate with Ctrl+C'
WARNING:apache_beam.options.pipeline_options:Discarding unparseable args: ['--parallelism=2']
INFO:apache_beam.utils.subprocess_server:b'22/04/20 08:56:53 INFO org.apache.beam.runners.fnexecution.artifact.ArtifactStagingService: Staging artifacts for job_07316786-cd4c-4879-b05e-4286a77077c1.'
INFO:apache_beam.utils.subprocess_server:b'22/04/20 08:56:53 INFO org.apache.beam.runners.fnexecution.artifact.ArtifactStagingService: Resolving artifacts for job_07316786-cd4c-4879-b05e-4286a77077c1.ref_Environment_default_environment_1.'
INFO:apache_beam.utils.subprocess_server:b'22/04/20 08:56:53 INFO org.apache.beam.runners.fnexecution.artifact.ArtifactStagingService: Getting 1 artifacts for job_07316786-cd4c-4879-b05e-4286a77077c1.null.'
INFO:apache_beam.utils.subprocess_server:b'22/04/20 08:56:53 INFO org.apache.beam.runners.fnexecution.artifact.ArtifactStagingService: Artifacts fully staged for job_07316786-cd4c-4879-b05e-4286a77077c1.'
INFO:apache_beam.utils.subprocess_server:b'22/04/20 08:56:54 INFO org.apache.beam.runners.spark.SparkJobInvoker: Invoking job BeamApp-jenkins-0420085653-9ee32e9f_dbb4d215-132f-4acb-b530-99ce5cfdc865'
INFO:apache_beam.utils.subprocess_server:b'22/04/20 08:56:54 INFO org.apache.beam.runners.jobsubmission.JobInvocation: Starting job invocation BeamApp-jenkins-0420085653-9ee32e9f_dbb4d215-132f-4acb-b530-99ce5cfdc865'
INFO:apache_beam.runners.portability.portable_runner:Environment "LOOPBACK" has started a component necessary for the execution. Be sure to run the pipeline using
  with Pipeline() as p:
    p.apply(..)
This ensures that the pipeline finishes before this program exits.
INFO:apache_beam.runners.portability.portable_runner:Job state changed to STOPPED
INFO:apache_beam.runners.portability.portable_runner:Job state changed to STARTING
INFO:apache_beam.runners.portability.portable_runner:Job state changed to RUNNING
INFO:apache_beam.utils.subprocess_server:b'22/04/20 08:56:54 INFO org.apache.beam.runners.spark.translation.SparkContextFactory: Creating a brand new Spark Context.'
INFO:apache_beam.utils.subprocess_server:b'22/04/20 08:56:54 WARN org.apache.hadoop.util.NativeCodeLoader: Unable to load native-hadoop library for your platform... using builtin-java classes where applicable'
INFO:apache_beam.utils.subprocess_server:b'22/04/20 08:56:55 INFO org.apache.beam.runners.spark.aggregators.AggregatorsAccumulator: Instantiated aggregators accumulator:'
INFO:apache_beam.utils.subprocess_server:b'22/04/20 08:56:55 INFO org.apache.beam.runners.spark.metrics.MetricsAccumulator: Instantiated metrics accumulator: MetricQueryResults()'
INFO:apache_beam.utils.subprocess_server:b'22/04/20 08:56:55 WARN software.amazon.awssdk.regions.internal.util.EC2MetadataUtils: Unable to retrieve the requested metadata.'
INFO:apache_beam.utils.subprocess_server:b'22/04/20 08:56:55 INFO org.apache.beam.runners.spark.SparkPipelineRunner: Running job BeamApp-jenkins-0420085653-9ee32e9f_dbb4d215-132f-4acb-b530-99ce5cfdc865 on Spark master local[4]'
INFO:apache_beam.utils.subprocess_server:b'22/04/20 08:56:56 WARN software.amazon.awssdk.regions.internal.util.EC2MetadataUtils: Unable to retrieve the requested metadata.'
INFO:apache_beam.utils.subprocess_server:b'22/04/20 08:56:56 WARN software.amazon.awssdk.regions.internal.util.EC2MetadataUtils: Unable to retrieve the requested metadata.'
INFO:apache_beam.utils.subprocess_server:b'22/04/20 08:56:56 WARN software.amazon.awssdk.regions.internal.util.EC2MetadataUtils: Unable to retrieve the requested metadata.'
INFO:apache_beam.utils.subprocess_server:b'22/04/20 08:56:56 WARN software.amazon.awssdk.regions.internal.util.EC2MetadataUtils: Unable to retrieve the requested metadata.'
INFO:apache_beam.runners.worker.statecache:Creating state cache with size 0
INFO:apache_beam.runners.worker.sdk_worker:Creating insecure control channel for localhost:45971.
INFO:apache_beam.runners.worker.sdk_worker:Control channel established.
INFO:apache_beam.runners.worker.sdk_worker:Initializing SDKHarness with unbounded number of workers.
INFO:apache_beam.utils.subprocess_server:b'22/04/20 08:56:56 INFO org.apache.beam.runners.fnexecution.control.FnApiControlClientPoolService: Beam Fn Control client connected with id 1-1'
INFO:apache_beam.utils.subprocess_server:b'22/04/20 08:56:56 INFO org.apache.beam.runners.fnexecution.control.FnApiControlClientPoolService: getProcessBundleDescriptor request with id 1-2'
INFO:apache_beam.runners.worker.sdk_worker:Creating insecure state channel for localhost:41711.
INFO:apache_beam.runners.worker.sdk_worker:State channel established.
INFO:apache_beam.runners.worker.data_plane:Creating client data channel for localhost:39059
INFO:apache_beam.utils.subprocess_server:b'22/04/20 08:56:56 INFO org.apache.beam.runners.fnexecution.data.GrpcDataService: Beam Fn Data client connected.'
INFO:apache_beam.utils.subprocess_server:b'22/04/20 08:56:56 INFO org.apache.beam.runners.fnexecution.control.FnApiControlClientPoolService: getProcessBundleDescriptor request with id 1-3'
INFO:apache_beam.utils.subprocess_server:b'22/04/20 08:56:56 WARN software.amazon.awssdk.regions.internal.util.EC2MetadataUtils: Unable to retrieve the requested metadata.'
INFO:apache_beam.utils.subprocess_server:b'22/04/20 08:56:56 WARN software.amazon.awssdk.regions.internal.util.EC2MetadataUtils: Unable to retrieve the requested metadata.'
INFO:apache_beam.utils.subprocess_server:b'22/04/20 08:56:56 WARN software.amazon.awssdk.regions.internal.util.EC2MetadataUtils: Unable to retrieve the requested metadata.'
INFO:apache_beam.utils.subprocess_server:b'22/04/20 08:56:56 WARN software.amazon.awssdk.regions.internal.util.EC2MetadataUtils: Unable to retrieve the requested metadata.'
INFO:apache_beam.utils.subprocess_server:b'22/04/20 08:56:56 INFO org.apache.beam.runners.fnexecution.control.FnApiControlClientPoolService: getProcessBundleDescriptor request with id 1-4'
INFO:apache_beam.utils.subprocess_server:b'22/04/20 08:56:56 INFO org.apache.beam.runners.fnexecution.control.FnApiControlClientPoolService: getProcessBundleDescriptor request with id 1-5'
INFO:apache_beam.utils.subprocess_server:b'22/04/20 08:56:57 WARN software.amazon.awssdk.regions.internal.util.EC2MetadataUtils: Unable to retrieve the requested metadata.'
INFO:apache_beam.utils.subprocess_server:b'22/04/20 08:56:57 WARN software.amazon.awssdk.regions.internal.util.EC2MetadataUtils: Unable to retrieve the requested metadata.'
INFO:apache_beam.utils.subprocess_server:b'22/04/20 08:56:57 WARN software.amazon.awssdk.regions.internal.util.EC2MetadataUtils: Unable to retrieve the requested metadata.'
INFO:apache_beam.utils.subprocess_server:b'22/04/20 08:56:57 WARN software.amazon.awssdk.regions.internal.util.EC2MetadataUtils: Unable to retrieve the requested metadata.'
INFO:apache_beam.utils.subprocess_server:b'22/04/20 08:56:57 INFO org.apache.beam.runners.fnexecution.control.FnApiControlClientPoolService: getProcessBundleDescriptor request with id 1-9'
INFO:apache_beam.utils.subprocess_server:b'22/04/20 08:56:57 INFO org.apache.beam.runners.fnexecution.control.FnApiControlClientPoolService: getProcessBundleDescriptor request with id 1-8'
INFO:apache_beam.utils.subprocess_server:b'22/04/20 08:56:57 INFO org.apache.beam.runners.fnexecution.control.FnApiControlClientPoolService: getProcessBundleDescriptor request with id 1-7'
INFO:apache_beam.utils.subprocess_server:b'22/04/20 08:56:57 INFO org.apache.beam.runners.fnexecution.control.FnApiControlClientPoolService: getProcessBundleDescriptor request with id 1-6'
INFO:apache_beam.utils.subprocess_server:b'22/04/20 08:56:57 INFO org.apache.beam.runners.fnexecution.control.FnApiControlClientPoolService: getProcessBundleDescriptor request with id 1-10'
INFO:apache_beam.utils.subprocess_server:b'22/04/20 08:56:57 INFO org.apache.beam.runners.fnexecution.control.FnApiControlClientPoolService: getProcessBundleDescriptor request with id 1-11'
INFO:apache_beam.utils.subprocess_server:b'22/04/20 08:56:57 INFO org.apache.beam.runners.fnexecution.control.FnApiControlClientPoolService: getProcessBundleDescriptor request with id 1-12'
INFO:apache_beam.utils.subprocess_server:b'22/04/20 08:56:57 INFO org.apache.beam.runners.fnexecution.control.FnApiControlClientPoolService: getProcessBundleDescriptor request with id 1-13'
INFO:apache_beam.utils.subprocess_server:b'22/04/20 08:56:57 WARN software.amazon.awssdk.regions.internal.util.EC2MetadataUtils: Unable to retrieve the requested metadata.'
INFO:apache_beam.utils.subprocess_server:b'22/04/20 08:56:57 WARN software.amazon.awssdk.regions.internal.util.EC2MetadataUtils: Unable to retrieve the requested metadata.'
INFO:apache_beam.utils.subprocess_server:b'22/04/20 08:56:57 WARN software.amazon.awssdk.regions.internal.util.EC2MetadataUtils: Unable to retrieve the requested metadata.'
INFO:apache_beam.utils.subprocess_server:b'22/04/20 08:56:57 WARN software.amazon.awssdk.regions.internal.util.EC2MetadataUtils: Unable to retrieve the requested metadata.'
INFO:apache_beam.utils.subprocess_server:b'22/04/20 08:56:57 INFO org.apache.beam.runners.fnexecution.control.FnApiControlClientPoolService: getProcessBundleDescriptor request with id 1-14'
INFO:apache_beam.utils.subprocess_server:b'22/04/20 08:56:57 WARN software.amazon.awssdk.regions.internal.util.EC2MetadataUtils: Unable to retrieve the requested metadata.'
INFO:apache_beam.utils.subprocess_server:b'22/04/20 08:56:57 WARN software.amazon.awssdk.regions.internal.util.EC2MetadataUtils: Unable to retrieve the requested metadata.'
INFO:apache_beam.utils.subprocess_server:b'22/04/20 08:56:57 WARN software.amazon.awssdk.regions.internal.util.EC2MetadataUtils: Unable to retrieve the requested metadata.'
INFO:apache_beam.utils.subprocess_server:b'22/04/20 08:56:57 WARN software.amazon.awssdk.regions.internal.util.EC2MetadataUtils: Unable to retrieve the requested metadata.'
INFO:apache_beam.utils.subprocess_server:b'22/04/20 08:56:57 INFO org.apache.beam.runners.fnexecution.control.FnApiControlClientPoolService: getProcessBundleDescriptor request with id 1-15'
INFO:apache_beam.utils.subprocess_server:b'22/04/20 08:56:57 INFO org.apache.beam.runners.spark.SparkPipelineRunner: Job BeamApp-jenkins-0420085653-9ee32e9f_dbb4d215-132f-4acb-b530-99ce5cfdc865: Pipeline translated successfully. Computing outputs'
INFO:apache_beam.utils.subprocess_server:b'22/04/20 08:56:57 WARN software.amazon.awssdk.regions.internal.util.EC2MetadataUtils: Unable to retrieve the requested metadata.'
INFO:apache_beam.utils.subprocess_server:b'22/04/20 08:56:57 WARN software.amazon.awssdk.regions.internal.util.EC2MetadataUtils: Unable to retrieve the requested metadata.'
INFO:apache_beam.utils.subprocess_server:b'22/04/20 08:56:57 WARN software.amazon.awssdk.regions.internal.util.EC2MetadataUtils: Unable to retrieve the requested metadata.'
INFO:apache_beam.utils.subprocess_server:b'22/04/20 08:56:57 WARN software.amazon.awssdk.regions.internal.util.EC2MetadataUtils: Unable to retrieve the requested metadata.'
INFO:apache_beam.utils.subprocess_server:b'22/04/20 08:56:57 INFO org.apache.beam.runners.fnexecution.control.FnApiControlClientPoolService: getProcessBundleDescriptor request with id 1-16'
INFO:apache_beam.io.filebasedsink:Starting finalize_write threads with num_shards: 4 (skipped: 0), batches: 4, num_threads: 4
INFO:apache_beam.io.filebasedsink:Renamed 4 shards in 0.10 seconds.
INFO:apache_beam.utils.subprocess_server:b'22/04/20 08:56:57 INFO org.apache.beam.runners.spark.SparkPipelineRunner: Job BeamApp-jenkins-0420085653-9ee32e9f_dbb4d215-132f-4acb-b530-99ce5cfdc865 finished.'
INFO:apache_beam.runners.portability.portable_runner:Job state changed to DONE
ERROR:apache_beam.runners.worker.data_plane:Failed to read inputs in the data plane.
Traceback (most recent call last):
  File "<https://ci-beam.apache.org/job/beam_PostCommit_Python36/ws/src/sdks/python/apache_beam/runners/worker/data_plane.py",> line 634, in _read_inputs
    for elements in elements_iterator:
  File "<https://ci-beam.apache.org/job/beam_PostCommit_Python36/ws/src/build/gradleenv/2022703440/lib/python3.6/site-packages/grpc/_channel.py",> line 426, in __next__
    return self._next()
  File "<https://ci-beam.apache.org/job/beam_PostCommit_Python36/ws/src/build/gradleenv/2022703440/lib/python3.6/site-packages/grpc/_channel.py",> line 826, in _next
    raise self
grpc._channel._MultiThreadedRendezvous: <_MultiThreadedRendezvous of RPC that terminated with:
	status = StatusCode.UNAVAILABLE
	details = "Socket closed"
	debug_error_string = "{"created":"@1650445018.071104198","description":"Error received from peer ipv6:[::1]:39059","file":"src/core/lib/surface/call.cc","file_line":903,"grpc_message":"Socket closed","grpc_status":14}"
>
Exception in thread run_worker_1-1:
Traceback (most recent call last):
  File "/usr/lib/python3.6/threading.py", line 916, in _bootstrap_inner
    self.run()
  File "/usr/lib/python3.6/threading.py", line 864, in run
    self._target(*self._args, **self._kwargs)
  File "<https://ci-beam.apache.org/job/beam_PostCommit_Python36/ws/src/sdks/python/apache_beam/runners/worker/sdk_worker.py",> line 234, in run
    for work_request in self._control_stub.Control(get_responses()):
  File "<https://ci-beam.apache.org/job/beam_PostCommit_Python36/ws/src/build/gradleenv/2022703440/lib/python3.6/site-packages/grpc/_channel.py",> line 426, in __next__
    return self._next()
  File "<https://ci-beam.apache.org/job/beam_PostCommit_Python36/ws/src/build/gradleenv/2022703440/lib/python3.6/site-packages/grpc/_channel.py",> line 826, in _next
    raise self
grpc._channel._MultiThreadedRendezvous: <_MultiThreadedRendezvous of RPC that terminated with:
	status = StatusCode.UNAVAILABLE
	details = "Socket closed"
	debug_error_string = "{"created":"@1650445018.071103422","description":"Error received from peer ipv6:[::1]:45971","file":"src/core/lib/surface/call.cc","file_line":903,"grpc_message":"Socket closed","grpc_status":14}"
>

Exception in thread read_state:
Traceback (most recent call last):
  File "/usr/lib/python3.6/threading.py", line 916, in _bootstrap_inner
    self.run()
  File "/usr/lib/python3.6/threading.py", line 864, in run
    self._target(*self._args, **self._kwargs)
  File "<https://ci-beam.apache.org/job/beam_PostCommit_Python36/ws/src/sdks/python/apache_beam/runners/worker/sdk_worker.py",> line 990, in pull_responses
    for response in responses:
  File "<https://ci-beam.apache.org/job/beam_PostCommit_Python36/ws/src/build/gradleenv/2022703440/lib/python3.6/site-packages/grpc/_channel.py",> line 426, in __next__
    return self._next()
  File "<https://ci-beam.apache.org/job/beam_PostCommit_Python36/ws/src/build/gradleenv/2022703440/lib/python3.6/site-packages/grpc/_channel.py",> line 826, in _next
    raise self
grpc._channel._MultiThreadedRendezvous: <_MultiThreadedRendezvous of RPC that terminated with:
	status = StatusCode.UNAVAILABLE
	details = "Socket closed"
	debug_error_string = "{"created":"@1650445018.071103227","description":"Error received from peer ipv6:[::1]:41711","file":"src/core/lib/surface/call.cc","file_line":903,"grpc_message":"Socket closed","grpc_status":14}"
>

Exception in thread read_grpc_client_inputs:
Traceback (most recent call last):
  File "/usr/lib/python3.6/threading.py", line 916, in _bootstrap_inner
    self.run()
  File "/usr/lib/python3.6/threading.py", line 864, in run
    self._target(*self._args, **self._kwargs)
  File "<https://ci-beam.apache.org/job/beam_PostCommit_Python36/ws/src/sdks/python/apache_beam/runners/worker/data_plane.py",> line 651, in <lambda>
    target=lambda: self._read_inputs(elements_iterator),
  File "<https://ci-beam.apache.org/job/beam_PostCommit_Python36/ws/src/sdks/python/apache_beam/runners/worker/data_plane.py",> line 634, in _read_inputs
    for elements in elements_iterator:
  File "<https://ci-beam.apache.org/job/beam_PostCommit_Python36/ws/src/build/gradleenv/2022703440/lib/python3.6/site-packages/grpc/_channel.py",> line 426, in __next__
    return self._next()
  File "<https://ci-beam.apache.org/job/beam_PostCommit_Python36/ws/src/build/gradleenv/2022703440/lib/python3.6/site-packages/grpc/_channel.py",> line 826, in _next
    raise self
grpc._channel._MultiThreadedRendezvous: <_MultiThreadedRendezvous of RPC that terminated with:
	status = StatusCode.UNAVAILABLE
	details = "Socket closed"
	debug_error_string = "{"created":"@1650445018.071104198","description":"Error received from peer ipv6:[::1]:39059","file":"src/core/lib/surface/call.cc","file_line":903,"grpc_message":"Socket closed","grpc_status":14}"
>


> Task :sdks:python:test-suites:portable:py36:postCommitPy36

> Task :sdks:python:test-suites:dataflow:py36:postCommitIT
E0420 08:58:40.411998003  899922 fork_posix.cc:70]           Fork support is only compatible with the epoll1 and poll polling strategies
E0420 09:00:43.939010568  899885 fork_posix.cc:70]           Fork support is only compatible with the epoll1 and poll polling strategies
E0420 09:03:11.777129800  899876 fork_posix.cc:70]           Fork support is only compatible with the epoll1 and poll polling strategies
E0420 09:05:44.102430859  899871 fork_posix.cc:70]           Fork support is only compatible with the epoll1 and poll polling strategies
E0420 09:13:22.783731699  899871 fork_posix.cc:70]           Fork support is only compatible with the epoll1 and poll polling strategies
E0420 09:20:39.618447225  899871 fork_posix.cc:70]           Fork support is only compatible with the epoll1 and poll polling strategies
E0420 09:23:35.929987361  899922 fork_posix.cc:70]           Fork support is only compatible with the epoll1 and poll polling strategies
E0420 09:28:21.804867047  899871 fork_posix.cc:70]           Fork support is only compatible with the epoll1 and poll polling strategies
E0420 09:34:43.246709786  899871 fork_posix.cc:70]           Fork support is only compatible with the epoll1 and poll polling strategies
E0420 09:40:15.571843762  899922 fork_posix.cc:70]           Fork support is only compatible with the epoll1 and poll polling strategies
E0420 09:41:25.028881547  899871 fork_posix.cc:70]           Fork support is only compatible with the epoll1 and poll polling strategies
E0420 09:48:31.421968444  899871 fork_posix.cc:70]           Fork support is only compatible with the epoll1 and poll polling strategies
E0420 09:55:38.429686858  899871 fork_posix.cc:70]           Fork support is only compatible with the epoll1 and poll polling strategies
E0420 09:57:11.102571729  899922 fork_posix.cc:70]           Fork support is only compatible with the epoll1 and poll polling strategies
E0420 09:59:28.866605726  899989 fork_posix.cc:70]           Fork support is only compatible with the epoll1 and poll polling strategies
E0420 10:03:27.838216188  899871 fork_posix.cc:70]           Fork support is only compatible with the epoll1 and poll polling strategies
E0420 10:09:58.249950060  899989 fork_posix.cc:70]           Fork support is only compatible with the epoll1 and poll polling strategies
E0420 10:10:23.166790131  899871 fork_posix.cc:70]           Fork support is only compatible with the epoll1 and poll polling strategies

> Task :sdks:python:test-suites:dataflow:py36:postCommitIT FAILED

FAILURE: Build failed with an exception.

* Where:
Script '<https://ci-beam.apache.org/job/beam_PostCommit_Python36/ws/src/sdks/python/test-suites/dataflow/common.gradle'> line: 121

* What went wrong:
Execution failed for task ':sdks:python:test-suites:dataflow:py36:postCommitIT'.
> Process 'command 'sh'' finished with non-zero exit value 1

* Try:
> Run with --stacktrace option to get the stack trace.
> Run with --info or --debug option to get more log output.
> Run with --scan to get full insights.

* Get more help at https://help.gradle.org

Deprecated Gradle features were used in this build, making it incompatible with Gradle 8.0.

You can use '--warning-mode all' to show the individual deprecation warnings and determine if they come from your own scripts or plugins.

See https://docs.gradle.org/7.4/userguide/command_line_interface.html#sec:command_line_warnings

Execution optimizations have been disabled for 1 invalid unit(s) of work during this build to ensure correctness.
Please consult deprecation warnings for more details.

BUILD FAILED in 1h 35m 26s
218 actionable tasks: 148 executed, 64 from cache, 6 up-to-date

Publishing build scan...
https://gradle.com/s/tdgztdmk2bmnm

Build step 'Invoke Gradle script' changed build result to FAILURE
Build step 'Invoke Gradle script' marked build as failure

---------------------------------------------------------------------
To unsubscribe, e-mail: builds-unsubscribe@beam.apache.org
For additional commands, e-mail: builds-help@beam.apache.org


Build failed in Jenkins: beam_PostCommit_Python36 #5214

Posted by Apache Jenkins Server <je...@builds.apache.org>.
See <https://ci-beam.apache.org/job/beam_PostCommit_Python36/5214/display/redirect?page=changes>

Changes:

[noreply] Populate actual dataflow job id to bigquery write trace id (#17130)

[relax] mark static thread as a daemon thread

[noreply] [BEAM-13866] Add miscellaneous exec unit tests (#17363)


------------------------------------------
[...truncated 23.77 MB...]
log_location: "/usr/local/lib/python3.6/site-packages/apache_beam/runners/worker/data_plane.py:782"
thread: "MainThread"

INFO:root:severity: INFO
timestamp {
  seconds: 1650423454
  nanos: 456180810
}
message: "Closing all cached gRPC state handlers."
log_location: "/usr/local/lib/python3.6/site-packages/apache_beam/runners/worker/sdk_worker.py:859"
thread: "MainThread"

INFO:root:severity: INFO
timestamp {
  seconds: 1650423454
  nanos: 457619667
}
message: "Done consuming work."
log_location: "/usr/local/lib/python3.6/site-packages/apache_beam/runners/worker/sdk_worker.py:257"
thread: "MainThread"

INFO:root:severity: INFO
timestamp {
  seconds: 1650423454
  nanos: 457765340
}
message: "Python sdk harness exiting."
log_location: "/usr/local/lib/python3.6/site-packages/apache_beam/runners/worker/sdk_worker_main.py:181"
thread: "MainThread"

INFO:apache_beam.runners.portability.local_job_service:Completed job in 9.047558784484863 seconds with state DONE.
INFO:root:Completed job in 9.047558784484863 seconds with state DONE.
INFO:apache_beam.runners.portability.portable_runner:Job state changed to DONE

> Task :sdks:python:test-suites:portable:py36:portableWordCountSparkRunnerBatch
INFO:apache_beam.runners.worker.worker_pool_main:Listening for workers at localhost:44105
WARNING:root:Make sure that locally built Python SDK docker image has Python 3.6 interpreter.
INFO:root:Default Python SDK image for environment is apache/beam_python3.6_sdk:2.39.0.dev
INFO:apache_beam.runners.portability.fn_api_runner.translations:==================== <function pack_combiners at 0x7f93306a1840> ====================
INFO:apache_beam.runners.portability.fn_api_runner.translations:==================== <function lift_combiners at 0x7f93306a18c8> ====================
INFO:apache_beam.runners.portability.fn_api_runner.translations:==================== <function sort_stages at 0x7f933069d048> ====================
INFO:apache_beam.utils.subprocess_server:Starting service with ['java' '-jar' '<https://ci-beam.apache.org/job/beam_PostCommit_Python36/ws/src/runners/spark/2/job-server/build/libs/beam-runners-spark-job-server-2.39.0-SNAPSHOT.jar'> '--spark-master-url' 'local[4]' '--artifacts-dir' '/tmp/beam-tempi34tsi_j/artifactsafliepfi' '--job-port' '51359' '--artifact-port' '0' '--expansion-port' '0']
E0420 02:57:37.748879063 1150787 fork_posix.cc:70]           Fork support is only compatible with the epoll1 and poll polling strategies
INFO:apache_beam.utils.subprocess_server:b'22/04/20 02:57:39 WARN software.amazon.awssdk.regions.internal.util.EC2MetadataUtils: Unable to retrieve the requested metadata.'
INFO:apache_beam.utils.subprocess_server:b'22/04/20 02:57:39 INFO org.apache.beam.runners.jobsubmission.JobServerDriver: ArtifactStagingService started on localhost:39023'
INFO:apache_beam.utils.subprocess_server:b'22/04/20 02:57:39 INFO org.apache.beam.runners.jobsubmission.JobServerDriver: Java ExpansionService started on localhost:34083'
INFO:apache_beam.utils.subprocess_server:b'22/04/20 02:57:39 INFO org.apache.beam.runners.jobsubmission.JobServerDriver: JobService started on localhost:51359'
INFO:apache_beam.utils.subprocess_server:b'22/04/20 02:57:39 INFO org.apache.beam.runners.jobsubmission.JobServerDriver: Job server now running, terminate with Ctrl+C'
WARNING:apache_beam.options.pipeline_options:Discarding unparseable args: ['--parallelism=2']
INFO:apache_beam.utils.subprocess_server:b'22/04/20 02:57:40 INFO org.apache.beam.runners.fnexecution.artifact.ArtifactStagingService: Staging artifacts for job_ca23cd21-5479-48d6-adc8-6bf31883d359.'
INFO:apache_beam.utils.subprocess_server:b'22/04/20 02:57:40 INFO org.apache.beam.runners.fnexecution.artifact.ArtifactStagingService: Resolving artifacts for job_ca23cd21-5479-48d6-adc8-6bf31883d359.ref_Environment_default_environment_1.'
INFO:apache_beam.utils.subprocess_server:b'22/04/20 02:57:40 INFO org.apache.beam.runners.fnexecution.artifact.ArtifactStagingService: Getting 1 artifacts for job_ca23cd21-5479-48d6-adc8-6bf31883d359.null.'
INFO:apache_beam.utils.subprocess_server:b'22/04/20 02:57:40 INFO org.apache.beam.runners.fnexecution.artifact.ArtifactStagingService: Artifacts fully staged for job_ca23cd21-5479-48d6-adc8-6bf31883d359.'
INFO:apache_beam.utils.subprocess_server:b'22/04/20 02:57:40 INFO org.apache.beam.runners.spark.SparkJobInvoker: Invoking job BeamApp-jenkins-0420025740-b0746001_c62a5943-4eb7-4946-a896-318a3e540486'
INFO:apache_beam.utils.subprocess_server:b'22/04/20 02:57:41 INFO org.apache.beam.runners.jobsubmission.JobInvocation: Starting job invocation BeamApp-jenkins-0420025740-b0746001_c62a5943-4eb7-4946-a896-318a3e540486'
INFO:apache_beam.runners.portability.portable_runner:Environment "LOOPBACK" has started a component necessary for the execution. Be sure to run the pipeline using
  with Pipeline() as p:
    p.apply(..)
This ensures that the pipeline finishes before this program exits.
INFO:apache_beam.runners.portability.portable_runner:Job state changed to STOPPED
INFO:apache_beam.runners.portability.portable_runner:Job state changed to STARTING
INFO:apache_beam.runners.portability.portable_runner:Job state changed to RUNNING
INFO:apache_beam.utils.subprocess_server:b'22/04/20 02:57:41 INFO org.apache.beam.runners.spark.translation.SparkContextFactory: Creating a brand new Spark Context.'
INFO:apache_beam.utils.subprocess_server:b'22/04/20 02:57:41 WARN org.apache.hadoop.util.NativeCodeLoader: Unable to load native-hadoop library for your platform... using builtin-java classes where applicable'
INFO:apache_beam.utils.subprocess_server:b'22/04/20 02:57:42 INFO org.apache.beam.runners.spark.aggregators.AggregatorsAccumulator: Instantiated aggregators accumulator:'
INFO:apache_beam.utils.subprocess_server:b'22/04/20 02:57:42 INFO org.apache.beam.runners.spark.metrics.MetricsAccumulator: Instantiated metrics accumulator: MetricQueryResults()'
INFO:apache_beam.utils.subprocess_server:b'22/04/20 02:57:42 WARN software.amazon.awssdk.regions.internal.util.EC2MetadataUtils: Unable to retrieve the requested metadata.'
INFO:apache_beam.utils.subprocess_server:b'22/04/20 02:57:42 INFO org.apache.beam.runners.spark.SparkPipelineRunner: Running job BeamApp-jenkins-0420025740-b0746001_c62a5943-4eb7-4946-a896-318a3e540486 on Spark master local[4]'
INFO:apache_beam.utils.subprocess_server:b'22/04/20 02:57:43 WARN software.amazon.awssdk.regions.internal.util.EC2MetadataUtils: Unable to retrieve the requested metadata.'
INFO:apache_beam.utils.subprocess_server:b'22/04/20 02:57:43 WARN software.amazon.awssdk.regions.internal.util.EC2MetadataUtils: Unable to retrieve the requested metadata.'
INFO:apache_beam.utils.subprocess_server:b'22/04/20 02:57:43 WARN software.amazon.awssdk.regions.internal.util.EC2MetadataUtils: Unable to retrieve the requested metadata.'
INFO:apache_beam.utils.subprocess_server:b'22/04/20 02:57:43 WARN software.amazon.awssdk.regions.internal.util.EC2MetadataUtils: Unable to retrieve the requested metadata.'
INFO:apache_beam.runners.worker.statecache:Creating state cache with size 0
INFO:apache_beam.runners.worker.sdk_worker:Creating insecure control channel for localhost:34589.
INFO:apache_beam.runners.worker.sdk_worker:Control channel established.
INFO:apache_beam.runners.worker.sdk_worker:Initializing SDKHarness with unbounded number of workers.
INFO:apache_beam.utils.subprocess_server:b'22/04/20 02:57:43 INFO org.apache.beam.runners.fnexecution.control.FnApiControlClientPoolService: Beam Fn Control client connected with id 1-1'
INFO:apache_beam.utils.subprocess_server:b'22/04/20 02:57:43 INFO org.apache.beam.runners.fnexecution.control.FnApiControlClientPoolService: getProcessBundleDescriptor request with id 1-2'
INFO:apache_beam.runners.worker.sdk_worker:Creating insecure state channel for localhost:38833.
INFO:apache_beam.runners.worker.sdk_worker:State channel established.
INFO:apache_beam.runners.worker.data_plane:Creating client data channel for localhost:46075
INFO:apache_beam.utils.subprocess_server:b'22/04/20 02:57:43 INFO org.apache.beam.runners.fnexecution.data.GrpcDataService: Beam Fn Data client connected.'
INFO:apache_beam.utils.subprocess_server:b'22/04/20 02:57:43 INFO org.apache.beam.runners.fnexecution.control.FnApiControlClientPoolService: getProcessBundleDescriptor request with id 1-3'
INFO:apache_beam.utils.subprocess_server:b'22/04/20 02:57:43 WARN software.amazon.awssdk.regions.internal.util.EC2MetadataUtils: Unable to retrieve the requested metadata.'
INFO:apache_beam.utils.subprocess_server:b'22/04/20 02:57:43 WARN software.amazon.awssdk.regions.internal.util.EC2MetadataUtils: Unable to retrieve the requested metadata.'
INFO:apache_beam.utils.subprocess_server:b'22/04/20 02:57:43 WARN software.amazon.awssdk.regions.internal.util.EC2MetadataUtils: Unable to retrieve the requested metadata.'
INFO:apache_beam.utils.subprocess_server:b'22/04/20 02:57:43 WARN software.amazon.awssdk.regions.internal.util.EC2MetadataUtils: Unable to retrieve the requested metadata.'
INFO:apache_beam.utils.subprocess_server:b'22/04/20 02:57:43 INFO org.apache.beam.runners.fnexecution.control.FnApiControlClientPoolService: getProcessBundleDescriptor request with id 1-4'
INFO:apache_beam.utils.subprocess_server:b'22/04/20 02:57:43 INFO org.apache.beam.runners.fnexecution.control.FnApiControlClientPoolService: getProcessBundleDescriptor request with id 1-5'
INFO:apache_beam.utils.subprocess_server:b'22/04/20 02:57:43 WARN software.amazon.awssdk.regions.internal.util.EC2MetadataUtils: Unable to retrieve the requested metadata.'
INFO:apache_beam.utils.subprocess_server:b'22/04/20 02:57:43 WARN software.amazon.awssdk.regions.internal.util.EC2MetadataUtils: Unable to retrieve the requested metadata.'
INFO:apache_beam.utils.subprocess_server:b'22/04/20 02:57:43 WARN software.amazon.awssdk.regions.internal.util.EC2MetadataUtils: Unable to retrieve the requested metadata.'
INFO:apache_beam.utils.subprocess_server:b'22/04/20 02:57:43 WARN software.amazon.awssdk.regions.internal.util.EC2MetadataUtils: Unable to retrieve the requested metadata.'
INFO:apache_beam.utils.subprocess_server:b'22/04/20 02:57:43 INFO org.apache.beam.runners.fnexecution.control.FnApiControlClientPoolService: getProcessBundleDescriptor request with id 1-9'
INFO:apache_beam.utils.subprocess_server:b'22/04/20 02:57:43 INFO org.apache.beam.runners.fnexecution.control.FnApiControlClientPoolService: getProcessBundleDescriptor request with id 1-7'
INFO:apache_beam.utils.subprocess_server:b'22/04/20 02:57:43 INFO org.apache.beam.runners.fnexecution.control.FnApiControlClientPoolService: getProcessBundleDescriptor request with id 1-8'
INFO:apache_beam.utils.subprocess_server:b'22/04/20 02:57:43 INFO org.apache.beam.runners.fnexecution.control.FnApiControlClientPoolService: getProcessBundleDescriptor request with id 1-6'
INFO:apache_beam.utils.subprocess_server:b'22/04/20 02:57:43 INFO org.apache.beam.runners.fnexecution.control.FnApiControlClientPoolService: getProcessBundleDescriptor request with id 1-10'
INFO:apache_beam.utils.subprocess_server:b'22/04/20 02:57:43 INFO org.apache.beam.runners.fnexecution.control.FnApiControlClientPoolService: getProcessBundleDescriptor request with id 1-11'
INFO:apache_beam.utils.subprocess_server:b'22/04/20 02:57:43 INFO org.apache.beam.runners.fnexecution.control.FnApiControlClientPoolService: getProcessBundleDescriptor request with id 1-13'
INFO:apache_beam.utils.subprocess_server:b'22/04/20 02:57:43 INFO org.apache.beam.runners.fnexecution.control.FnApiControlClientPoolService: getProcessBundleDescriptor request with id 1-12'
INFO:apache_beam.utils.subprocess_server:b'22/04/20 02:57:44 WARN software.amazon.awssdk.regions.internal.util.EC2MetadataUtils: Unable to retrieve the requested metadata.'
INFO:apache_beam.utils.subprocess_server:b'22/04/20 02:57:44 WARN software.amazon.awssdk.regions.internal.util.EC2MetadataUtils: Unable to retrieve the requested metadata.'
INFO:apache_beam.utils.subprocess_server:b'22/04/20 02:57:44 WARN software.amazon.awssdk.regions.internal.util.EC2MetadataUtils: Unable to retrieve the requested metadata.'
INFO:apache_beam.utils.subprocess_server:b'22/04/20 02:57:44 WARN software.amazon.awssdk.regions.internal.util.EC2MetadataUtils: Unable to retrieve the requested metadata.'
INFO:apache_beam.utils.subprocess_server:b'22/04/20 02:57:44 INFO org.apache.beam.runners.fnexecution.control.FnApiControlClientPoolService: getProcessBundleDescriptor request with id 1-14'
INFO:apache_beam.utils.subprocess_server:b'22/04/20 02:57:44 WARN software.amazon.awssdk.regions.internal.util.EC2MetadataUtils: Unable to retrieve the requested metadata.'
INFO:apache_beam.utils.subprocess_server:b'22/04/20 02:57:44 WARN software.amazon.awssdk.regions.internal.util.EC2MetadataUtils: Unable to retrieve the requested metadata.'
INFO:apache_beam.utils.subprocess_server:b'22/04/20 02:57:44 WARN software.amazon.awssdk.regions.internal.util.EC2MetadataUtils: Unable to retrieve the requested metadata.'
INFO:apache_beam.utils.subprocess_server:b'22/04/20 02:57:44 WARN software.amazon.awssdk.regions.internal.util.EC2MetadataUtils: Unable to retrieve the requested metadata.'
INFO:apache_beam.utils.subprocess_server:b'22/04/20 02:57:44 INFO org.apache.beam.runners.fnexecution.control.FnApiControlClientPoolService: getProcessBundleDescriptor request with id 1-15'
INFO:apache_beam.utils.subprocess_server:b'22/04/20 02:57:44 INFO org.apache.beam.runners.spark.SparkPipelineRunner: Job BeamApp-jenkins-0420025740-b0746001_c62a5943-4eb7-4946-a896-318a3e540486: Pipeline translated successfully. Computing outputs'
INFO:apache_beam.utils.subprocess_server:b'22/04/20 02:57:44 WARN software.amazon.awssdk.regions.internal.util.EC2MetadataUtils: Unable to retrieve the requested metadata.'
INFO:apache_beam.utils.subprocess_server:b'22/04/20 02:57:44 WARN software.amazon.awssdk.regions.internal.util.EC2MetadataUtils: Unable to retrieve the requested metadata.'
INFO:apache_beam.utils.subprocess_server:b'22/04/20 02:57:44 WARN software.amazon.awssdk.regions.internal.util.EC2MetadataUtils: Unable to retrieve the requested metadata.'
INFO:apache_beam.utils.subprocess_server:b'22/04/20 02:57:44 WARN software.amazon.awssdk.regions.internal.util.EC2MetadataUtils: Unable to retrieve the requested metadata.'
INFO:apache_beam.utils.subprocess_server:b'22/04/20 02:57:44 INFO org.apache.beam.runners.fnexecution.control.FnApiControlClientPoolService: getProcessBundleDescriptor request with id 1-16'
INFO:apache_beam.io.filebasedsink:Starting finalize_write threads with num_shards: 4 (skipped: 0), batches: 4, num_threads: 4
INFO:apache_beam.io.filebasedsink:Renamed 4 shards in 0.10 seconds.
INFO:apache_beam.utils.subprocess_server:b'22/04/20 02:57:44 INFO org.apache.beam.runners.spark.SparkPipelineRunner: Job BeamApp-jenkins-0420025740-b0746001_c62a5943-4eb7-4946-a896-318a3e540486 finished.'
INFO:apache_beam.runners.portability.portable_runner:Job state changed to DONE
ERROR:apache_beam.runners.worker.data_plane:Failed to read inputs in the data plane.
Traceback (most recent call last):
  File "<https://ci-beam.apache.org/job/beam_PostCommit_Python36/ws/src/sdks/python/apache_beam/runners/worker/data_plane.py",> line 634, in _read_inputs
    for elements in elements_iterator:
  File "<https://ci-beam.apache.org/job/beam_PostCommit_Python36/ws/src/build/gradleenv/2022703440/lib/python3.6/site-packages/grpc/_channel.py",> line 426, in __next__
    return self._next()
  File "<https://ci-beam.apache.org/job/beam_PostCommit_Python36/ws/src/build/gradleenv/2022703440/lib/python3.6/site-packages/grpc/_channel.py",> line 826, in _next
    raise self
grpc._channel._MultiThreadedRendezvous: <_MultiThreadedRendezvous of RPC that terminated with:
	status = StatusCode.UNAVAILABLE
	details = "Socket closed"
	debug_error_string = "{"created":"@1650423464.865618293","description":"Error received from peer ipv6:[::1]:46075","file":"src/core/lib/surface/call.cc","file_line":903,"grpc_message":"Socket closed","grpc_status":14}"
>
Exception in thread read_grpc_client_inputs:
Traceback (most recent call last):
  File "/usr/lib/python3.6/threading.py", line 916, in _bootstrap_inner
    self.run()
  File "/usr/lib/python3.6/threading.py", line 864, in run
    self._target(*self._args, **self._kwargs)
  File "<https://ci-beam.apache.org/job/beam_PostCommit_Python36/ws/src/sdks/python/apache_beam/runners/worker/data_plane.py",> line 651, in <lambda>
    target=lambda: self._read_inputs(elements_iterator),
  File "<https://ci-beam.apache.org/job/beam_PostCommit_Python36/ws/src/sdks/python/apache_beam/runners/worker/data_plane.py",> line 634, in _read_inputs
    for elements in elements_iterator:
  File "<https://ci-beam.apache.org/job/beam_PostCommit_Python36/ws/src/build/gradleenv/2022703440/lib/python3.6/site-packages/grpc/_channel.py",> line 426, in __next__
    return self._next()
  File "<https://ci-beam.apache.org/job/beam_PostCommit_Python36/ws/src/build/gradleenv/2022703440/lib/python3.6/site-packages/grpc/_channel.py",> line 826, in _next
    raise self
grpc._channel._MultiThreadedRendezvous: <_MultiThreadedRendezvous of RPC that terminated with:
	status = StatusCode.UNAVAILABLE
	details = "Socket closed"
	debug_error_string = "{"created":"@1650423464.865618293","description":"Error received from peer ipv6:[::1]:46075","file":"src/core/lib/surface/call.cc","file_line":903,"grpc_message":"Socket closed","grpc_status":14}"
>

Exception in thread read_state:
Traceback (most recent call last):
  File "/usr/lib/python3.6/threading.py", line 916, in _bootstrap_inner
    self.run()
  File "/usr/lib/python3.6/threading.py", line 864, in run
    self._target(*self._args, **self._kwargs)
  File "<https://ci-beam.apache.org/job/beam_PostCommit_Python36/ws/src/sdks/python/apache_beam/runners/worker/sdk_worker.py",> line 990, in pull_responses
    for response in responses:
  File "<https://ci-beam.apache.org/job/beam_PostCommit_Python36/ws/src/build/gradleenv/2022703440/lib/python3.6/site-packages/grpc/_channel.py",> line 426, in __next__
    return self._next()
  File "<https://ci-beam.apache.org/job/beam_PostCommit_Python36/ws/src/build/gradleenv/2022703440/lib/python3.6/site-packages/grpc/_channel.py",> line 826, in _next
    raise self
grpc._channel._MultiThreadedRendezvous: <_MultiThreadedRendezvous of RPC that terminated with:
	status = StatusCode.UNAVAILABLE
	details = "Socket closed"
	debug_error_string = "{"created":"@1650423464.865630971","description":"Error received from peer ipv6:[::1]:38833","file":"src/core/lib/surface/call.cc","file_line":903,"grpc_message":"Socket closed","grpc_status":14}"
>

Exception in thread run_worker_1-1:
Traceback (most recent call last):
  File "/usr/lib/python3.6/threading.py", line 916, in _bootstrap_inner
    self.run()
  File "/usr/lib/python3.6/threading.py", line 864, in run
    self._target(*self._args, **self._kwargs)
  File "<https://ci-beam.apache.org/job/beam_PostCommit_Python36/ws/src/sdks/python/apache_beam/runners/worker/sdk_worker.py",> line 234, in run
    for work_request in self._control_stub.Control(get_responses()):
  File "<https://ci-beam.apache.org/job/beam_PostCommit_Python36/ws/src/build/gradleenv/2022703440/lib/python3.6/site-packages/grpc/_channel.py",> line 426, in __next__
    return self._next()
  File "<https://ci-beam.apache.org/job/beam_PostCommit_Python36/ws/src/build/gradleenv/2022703440/lib/python3.6/site-packages/grpc/_channel.py",> line 826, in _next
    raise self
grpc._channel._MultiThreadedRendezvous: <_MultiThreadedRendezvous of RPC that terminated with:
	status = StatusCode.UNAVAILABLE
	details = "Socket closed"
	debug_error_string = "{"created":"@1650423464.865683330","description":"Error received from peer ipv6:[::1]:34589","file":"src/core/lib/surface/call.cc","file_line":903,"grpc_message":"Socket closed","grpc_status":14}"
>


> Task :sdks:python:test-suites:portable:py36:postCommitPy36

> Task :sdks:python:test-suites:dataflow:py36:postCommitIT
E0420 02:58:22.025687924 1127759 fork_posix.cc:70]           Fork support is only compatible with the epoll1 and poll polling strategies
E0420 02:58:29.255677740 1127961 fork_posix.cc:70]           Fork support is only compatible with the epoll1 and poll polling strategies
E0420 03:00:58.083439947 1127784 fork_posix.cc:70]           Fork support is only compatible with the epoll1 and poll polling strategies
E0420 03:05:46.520272561 1127767 fork_posix.cc:70]           Fork support is only compatible with the epoll1 and poll polling strategies
E0420 03:06:44.267128576 1127759 fork_posix.cc:70]           Fork support is only compatible with the epoll1 and poll polling strategies
E0420 03:12:38.154987202 1127767 fork_posix.cc:70]           Fork support is only compatible with the epoll1 and poll polling strategies
E0420 03:20:59.056981131 1127767 fork_posix.cc:70]           Fork support is only compatible with the epoll1 and poll polling strategies
E0420 03:22:51.564523287 1127746 fork_posix.cc:70]           Fork support is only compatible with the epoll1 and poll polling strategies
E0420 03:28:45.770031717 1127767 fork_posix.cc:70]           Fork support is only compatible with the epoll1 and poll polling strategies
E0420 03:35:14.589180453 1127767 fork_posix.cc:70]           Fork support is only compatible with the epoll1 and poll polling strategies
E0420 03:40:02.796802283 1127746 fork_posix.cc:70]           Fork support is only compatible with the epoll1 and poll polling strategies
E0420 03:41:54.821332197 1127767 fork_posix.cc:70]           Fork support is only compatible with the epoll1 and poll polling strategies
E0420 03:49:04.246688106 1127767 fork_posix.cc:70]           Fork support is only compatible with the epoll1 and poll polling strategies
E0420 03:53:50.774974178 1127862 fork_posix.cc:70]           Fork support is only compatible with the epoll1 and poll polling strategies
E0420 03:56:41.901995888 1127746 fork_posix.cc:70]           Fork support is only compatible with the epoll1 and poll polling strategies
E0420 03:56:49.512382084 1127767 fork_posix.cc:70]           Fork support is only compatible with the epoll1 and poll polling strategies
E0420 04:04:36.089319664 1127862 fork_posix.cc:70]           Fork support is only compatible with the epoll1 and poll polling strategies
E0420 04:04:44.179720113 1127767 fork_posix.cc:70]           Fork support is only compatible with the epoll1 and poll polling strategies
E0420 04:11:33.797822539 1127767 fork_posix.cc:70]           Fork support is only compatible with the epoll1 and poll polling strategies

> Task :sdks:python:test-suites:dataflow:py36:postCommitIT FAILED

FAILURE: Build failed with an exception.

* Where:
Script '<https://ci-beam.apache.org/job/beam_PostCommit_Python36/ws/src/sdks/python/test-suites/dataflow/common.gradle'> line: 121

* What went wrong:
Execution failed for task ':sdks:python:test-suites:dataflow:py36:postCommitIT'.
> Process 'command 'sh'' finished with non-zero exit value 1

* Try:
> Run with --stacktrace option to get the stack trace.
> Run with --info or --debug option to get more log output.
> Run with --scan to get full insights.

* Get more help at https://help.gradle.org

Deprecated Gradle features were used in this build, making it incompatible with Gradle 8.0.

You can use '--warning-mode all' to show the individual deprecation warnings and determine if they come from your own scripts or plugins.

See https://docs.gradle.org/7.4/userguide/command_line_interface.html#sec:command_line_warnings

Execution optimizations have been disabled for 1 invalid unit(s) of work during this build to ensure correctness.
Please consult deprecation warnings for more details.

BUILD FAILED in 1h 34m 7s
218 actionable tasks: 149 executed, 63 from cache, 6 up-to-date

Publishing build scan...
https://gradle.com/s/hfqopluvrxp2o

Build step 'Invoke Gradle script' changed build result to FAILURE
Build step 'Invoke Gradle script' marked build as failure

---------------------------------------------------------------------
To unsubscribe, e-mail: builds-unsubscribe@beam.apache.org
For additional commands, e-mail: builds-help@beam.apache.org


Build failed in Jenkins: beam_PostCommit_Python36 #5213

Posted by Apache Jenkins Server <je...@builds.apache.org>.
See <https://ci-beam.apache.org/job/beam_PostCommit_Python36/5213/display/redirect?page=changes>

Changes:

[andyye333] Change func to PTransform


------------------------------------------
[...truncated 28.05 MB...]
}
message: "Closing all cached grpc data channels."
log_location: "/usr/local/lib/python3.6/site-packages/apache_beam/runners/worker/data_plane.py:782"
thread: "MainThread"

INFO:root:severity: INFO
timestamp {
  seconds: 1650401992
  nanos: 621508121
}
message: "Closing all cached gRPC state handlers."
log_location: "/usr/local/lib/python3.6/site-packages/apache_beam/runners/worker/sdk_worker.py:859"
thread: "MainThread"

INFO:root:severity: INFO
timestamp {
  seconds: 1650401992
  nanos: 622382640
}
message: "Done consuming work."
log_location: "/usr/local/lib/python3.6/site-packages/apache_beam/runners/worker/sdk_worker.py:257"
thread: "MainThread"

INFO:root:severity: INFO
timestamp {
  seconds: 1650401992
  nanos: 622504711
}
message: "Python sdk harness exiting."
log_location: "/usr/local/lib/python3.6/site-packages/apache_beam/runners/worker/sdk_worker_main.py:181"
thread: "MainThread"

INFO:apache_beam.runners.portability.local_job_service:Completed job in 9.10697340965271 seconds with state DONE.
INFO:root:Completed job in 9.10697340965271 seconds with state DONE.
INFO:apache_beam.runners.portability.portable_runner:Job state changed to DONE

> Task :sdks:python:test-suites:portable:py36:portableWordCountSparkRunnerBatch
INFO:apache_beam.runners.worker.worker_pool_main:Listening for workers at localhost:42557
WARNING:root:Make sure that locally built Python SDK docker image has Python 3.6 interpreter.
INFO:root:Default Python SDK image for environment is apache/beam_python3.6_sdk:2.39.0.dev
INFO:apache_beam.runners.portability.fn_api_runner.translations:==================== <function pack_combiners at 0x7ff8140f4840> ====================
INFO:apache_beam.runners.portability.fn_api_runner.translations:==================== <function lift_combiners at 0x7ff8140f48c8> ====================
INFO:apache_beam.runners.portability.fn_api_runner.translations:==================== <function sort_stages at 0x7ff8140f6048> ====================
INFO:apache_beam.utils.subprocess_server:Starting service with ['java' '-jar' '<https://ci-beam.apache.org/job/beam_PostCommit_Python36/ws/src/runners/spark/2/job-server/build/libs/beam-runners-spark-job-server-2.39.0-SNAPSHOT.jar'> '--spark-master-url' 'local[4]' '--artifacts-dir' '/tmp/beam-tempa8mjhgrk/artifactshblqg0qd' '--job-port' '33181' '--artifact-port' '0' '--expansion-port' '0']
E0419 20:59:55.863907227  113263 fork_posix.cc:70]           Fork support is only compatible with the epoll1 and poll polling strategies
INFO:apache_beam.utils.subprocess_server:b'22/04/19 20:59:57 WARN software.amazon.awssdk.regions.internal.util.EC2MetadataUtils: Unable to retrieve the requested metadata.'
INFO:apache_beam.utils.subprocess_server:b'22/04/19 20:59:57 INFO org.apache.beam.runners.jobsubmission.JobServerDriver: ArtifactStagingService started on localhost:38347'
INFO:apache_beam.utils.subprocess_server:b'22/04/19 20:59:58 INFO org.apache.beam.runners.jobsubmission.JobServerDriver: Java ExpansionService started on localhost:34325'
INFO:apache_beam.utils.subprocess_server:b'22/04/19 20:59:58 INFO org.apache.beam.runners.jobsubmission.JobServerDriver: JobService started on localhost:33181'
INFO:apache_beam.utils.subprocess_server:b'22/04/19 20:59:58 INFO org.apache.beam.runners.jobsubmission.JobServerDriver: Job server now running, terminate with Ctrl+C'
WARNING:apache_beam.options.pipeline_options:Discarding unparseable args: ['--parallelism=2']
INFO:apache_beam.utils.subprocess_server:b'22/04/19 20:59:58 INFO org.apache.beam.runners.fnexecution.artifact.ArtifactStagingService: Staging artifacts for job_7a5a0722-fb55-4cb2-bce8-0ac990e9b48c.'
INFO:apache_beam.utils.subprocess_server:b'22/04/19 20:59:58 INFO org.apache.beam.runners.fnexecution.artifact.ArtifactStagingService: Resolving artifacts for job_7a5a0722-fb55-4cb2-bce8-0ac990e9b48c.ref_Environment_default_environment_1.'
INFO:apache_beam.utils.subprocess_server:b'22/04/19 20:59:58 INFO org.apache.beam.runners.fnexecution.artifact.ArtifactStagingService: Getting 1 artifacts for job_7a5a0722-fb55-4cb2-bce8-0ac990e9b48c.null.'
INFO:apache_beam.utils.subprocess_server:b'22/04/19 20:59:58 INFO org.apache.beam.runners.fnexecution.artifact.ArtifactStagingService: Artifacts fully staged for job_7a5a0722-fb55-4cb2-bce8-0ac990e9b48c.'
INFO:apache_beam.utils.subprocess_server:b'22/04/19 20:59:59 INFO org.apache.beam.runners.spark.SparkJobInvoker: Invoking job BeamApp-jenkins-0419205958-4b343699_ae851f2f-19d7-4a6d-8d39-a179427708c5'
INFO:apache_beam.utils.subprocess_server:b'22/04/19 20:59:59 INFO org.apache.beam.runners.jobsubmission.JobInvocation: Starting job invocation BeamApp-jenkins-0419205958-4b343699_ae851f2f-19d7-4a6d-8d39-a179427708c5'
INFO:apache_beam.runners.portability.portable_runner:Environment "LOOPBACK" has started a component necessary for the execution. Be sure to run the pipeline using
  with Pipeline() as p:
    p.apply(..)
This ensures that the pipeline finishes before this program exits.
INFO:apache_beam.runners.portability.portable_runner:Job state changed to STOPPED
INFO:apache_beam.runners.portability.portable_runner:Job state changed to STARTING
INFO:apache_beam.runners.portability.portable_runner:Job state changed to RUNNING
INFO:apache_beam.utils.subprocess_server:b'22/04/19 20:59:59 INFO org.apache.beam.runners.spark.translation.SparkContextFactory: Creating a brand new Spark Context.'
INFO:apache_beam.utils.subprocess_server:b'22/04/19 20:59:59 WARN org.apache.hadoop.util.NativeCodeLoader: Unable to load native-hadoop library for your platform... using builtin-java classes where applicable'
INFO:apache_beam.utils.subprocess_server:b'22/04/19 21:00:00 INFO org.apache.beam.runners.spark.aggregators.AggregatorsAccumulator: Instantiated aggregators accumulator:'
INFO:apache_beam.utils.subprocess_server:b'22/04/19 21:00:00 INFO org.apache.beam.runners.spark.metrics.MetricsAccumulator: Instantiated metrics accumulator: MetricQueryResults()'
INFO:apache_beam.utils.subprocess_server:b'22/04/19 21:00:00 WARN software.amazon.awssdk.regions.internal.util.EC2MetadataUtils: Unable to retrieve the requested metadata.'
INFO:apache_beam.utils.subprocess_server:b'22/04/19 21:00:00 INFO org.apache.beam.runners.spark.SparkPipelineRunner: Running job BeamApp-jenkins-0419205958-4b343699_ae851f2f-19d7-4a6d-8d39-a179427708c5 on Spark master local[4]'
INFO:apache_beam.utils.subprocess_server:b'22/04/19 21:00:01 WARN software.amazon.awssdk.regions.internal.util.EC2MetadataUtils: Unable to retrieve the requested metadata.'
INFO:apache_beam.utils.subprocess_server:b'22/04/19 21:00:01 WARN software.amazon.awssdk.regions.internal.util.EC2MetadataUtils: Unable to retrieve the requested metadata.'
INFO:apache_beam.utils.subprocess_server:b'22/04/19 21:00:01 WARN software.amazon.awssdk.regions.internal.util.EC2MetadataUtils: Unable to retrieve the requested metadata.'
INFO:apache_beam.utils.subprocess_server:b'22/04/19 21:00:01 WARN software.amazon.awssdk.regions.internal.util.EC2MetadataUtils: Unable to retrieve the requested metadata.'
INFO:apache_beam.runners.worker.statecache:Creating state cache with size 0
INFO:apache_beam.runners.worker.sdk_worker:Creating insecure control channel for localhost:43325.
INFO:apache_beam.runners.worker.sdk_worker:Control channel established.
INFO:apache_beam.runners.worker.sdk_worker:Initializing SDKHarness with unbounded number of workers.
INFO:apache_beam.utils.subprocess_server:b'22/04/19 21:00:01 INFO org.apache.beam.runners.fnexecution.control.FnApiControlClientPoolService: Beam Fn Control client connected with id 1-1'
INFO:apache_beam.utils.subprocess_server:b'22/04/19 21:00:02 INFO org.apache.beam.runners.fnexecution.control.FnApiControlClientPoolService: getProcessBundleDescriptor request with id 1-2'
INFO:apache_beam.runners.worker.sdk_worker:Creating insecure state channel for localhost:40189.
INFO:apache_beam.runners.worker.sdk_worker:State channel established.
INFO:apache_beam.runners.worker.data_plane:Creating client data channel for localhost:33443
INFO:apache_beam.utils.subprocess_server:b'22/04/19 21:00:02 INFO org.apache.beam.runners.fnexecution.data.GrpcDataService: Beam Fn Data client connected.'
INFO:apache_beam.utils.subprocess_server:b'22/04/19 21:00:02 INFO org.apache.beam.runners.fnexecution.control.FnApiControlClientPoolService: getProcessBundleDescriptor request with id 1-3'
INFO:apache_beam.utils.subprocess_server:b'22/04/19 21:00:02 WARN software.amazon.awssdk.regions.internal.util.EC2MetadataUtils: Unable to retrieve the requested metadata.'
INFO:apache_beam.utils.subprocess_server:b'22/04/19 21:00:02 WARN software.amazon.awssdk.regions.internal.util.EC2MetadataUtils: Unable to retrieve the requested metadata.'
INFO:apache_beam.utils.subprocess_server:b'22/04/19 21:00:02 WARN software.amazon.awssdk.regions.internal.util.EC2MetadataUtils: Unable to retrieve the requested metadata.'
INFO:apache_beam.utils.subprocess_server:b'22/04/19 21:00:02 WARN software.amazon.awssdk.regions.internal.util.EC2MetadataUtils: Unable to retrieve the requested metadata.'
INFO:apache_beam.utils.subprocess_server:b'22/04/19 21:00:02 INFO org.apache.beam.runners.fnexecution.control.FnApiControlClientPoolService: getProcessBundleDescriptor request with id 1-4'
INFO:apache_beam.utils.subprocess_server:b'22/04/19 21:00:02 INFO org.apache.beam.runners.fnexecution.control.FnApiControlClientPoolService: getProcessBundleDescriptor request with id 1-5'
INFO:apache_beam.utils.subprocess_server:b'22/04/19 21:00:02 WARN software.amazon.awssdk.regions.internal.util.EC2MetadataUtils: Unable to retrieve the requested metadata.'
INFO:apache_beam.utils.subprocess_server:b'22/04/19 21:00:02 WARN software.amazon.awssdk.regions.internal.util.EC2MetadataUtils: Unable to retrieve the requested metadata.'
INFO:apache_beam.utils.subprocess_server:b'22/04/19 21:00:02 WARN software.amazon.awssdk.regions.internal.util.EC2MetadataUtils: Unable to retrieve the requested metadata.'
INFO:apache_beam.utils.subprocess_server:b'22/04/19 21:00:02 WARN software.amazon.awssdk.regions.internal.util.EC2MetadataUtils: Unable to retrieve the requested metadata.'
INFO:apache_beam.utils.subprocess_server:b'22/04/19 21:00:02 INFO org.apache.beam.runners.fnexecution.control.FnApiControlClientPoolService: getProcessBundleDescriptor request with id 1-6'
INFO:apache_beam.utils.subprocess_server:b'22/04/19 21:00:02 INFO org.apache.beam.runners.fnexecution.control.FnApiControlClientPoolService: getProcessBundleDescriptor request with id 1-8'
INFO:apache_beam.utils.subprocess_server:b'22/04/19 21:00:02 INFO org.apache.beam.runners.fnexecution.control.FnApiControlClientPoolService: getProcessBundleDescriptor request with id 1-7'
INFO:apache_beam.utils.subprocess_server:b'22/04/19 21:00:02 INFO org.apache.beam.runners.fnexecution.control.FnApiControlClientPoolService: getProcessBundleDescriptor request with id 1-9'
INFO:apache_beam.utils.subprocess_server:b'22/04/19 21:00:02 INFO org.apache.beam.runners.fnexecution.control.FnApiControlClientPoolService: getProcessBundleDescriptor request with id 1-10'
INFO:apache_beam.utils.subprocess_server:b'22/04/19 21:00:02 INFO org.apache.beam.runners.fnexecution.control.FnApiControlClientPoolService: getProcessBundleDescriptor request with id 1-12'
INFO:apache_beam.utils.subprocess_server:b'22/04/19 21:00:02 INFO org.apache.beam.runners.fnexecution.control.FnApiControlClientPoolService: getProcessBundleDescriptor request with id 1-11'
INFO:apache_beam.utils.subprocess_server:b'22/04/19 21:00:02 INFO org.apache.beam.runners.fnexecution.control.FnApiControlClientPoolService: getProcessBundleDescriptor request with id 1-13'
INFO:apache_beam.utils.subprocess_server:b'22/04/19 21:00:02 WARN software.amazon.awssdk.regions.internal.util.EC2MetadataUtils: Unable to retrieve the requested metadata.'
INFO:apache_beam.utils.subprocess_server:b'22/04/19 21:00:02 WARN software.amazon.awssdk.regions.internal.util.EC2MetadataUtils: Unable to retrieve the requested metadata.'
INFO:apache_beam.utils.subprocess_server:b'22/04/19 21:00:02 WARN software.amazon.awssdk.regions.internal.util.EC2MetadataUtils: Unable to retrieve the requested metadata.'
INFO:apache_beam.utils.subprocess_server:b'22/04/19 21:00:02 WARN software.amazon.awssdk.regions.internal.util.EC2MetadataUtils: Unable to retrieve the requested metadata.'
INFO:apache_beam.utils.subprocess_server:b'22/04/19 21:00:02 INFO org.apache.beam.runners.fnexecution.control.FnApiControlClientPoolService: getProcessBundleDescriptor request with id 1-14'
INFO:apache_beam.utils.subprocess_server:b'22/04/19 21:00:02 WARN software.amazon.awssdk.regions.internal.util.EC2MetadataUtils: Unable to retrieve the requested metadata.'
INFO:apache_beam.utils.subprocess_server:b'22/04/19 21:00:02 WARN software.amazon.awssdk.regions.internal.util.EC2MetadataUtils: Unable to retrieve the requested metadata.'
INFO:apache_beam.utils.subprocess_server:b'22/04/19 21:00:02 WARN software.amazon.awssdk.regions.internal.util.EC2MetadataUtils: Unable to retrieve the requested metadata.'
INFO:apache_beam.utils.subprocess_server:b'22/04/19 21:00:02 WARN software.amazon.awssdk.regions.internal.util.EC2MetadataUtils: Unable to retrieve the requested metadata.'
INFO:apache_beam.utils.subprocess_server:b'22/04/19 21:00:02 INFO org.apache.beam.runners.fnexecution.control.FnApiControlClientPoolService: getProcessBundleDescriptor request with id 1-15'
INFO:apache_beam.utils.subprocess_server:b'22/04/19 21:00:02 INFO org.apache.beam.runners.spark.SparkPipelineRunner: Job BeamApp-jenkins-0419205958-4b343699_ae851f2f-19d7-4a6d-8d39-a179427708c5: Pipeline translated successfully. Computing outputs'
INFO:apache_beam.utils.subprocess_server:b'22/04/19 21:00:02 WARN software.amazon.awssdk.regions.internal.util.EC2MetadataUtils: Unable to retrieve the requested metadata.'
INFO:apache_beam.utils.subprocess_server:b'22/04/19 21:00:02 WARN software.amazon.awssdk.regions.internal.util.EC2MetadataUtils: Unable to retrieve the requested metadata.'
INFO:apache_beam.utils.subprocess_server:b'22/04/19 21:00:02 WARN software.amazon.awssdk.regions.internal.util.EC2MetadataUtils: Unable to retrieve the requested metadata.'
INFO:apache_beam.utils.subprocess_server:b'22/04/19 21:00:02 WARN software.amazon.awssdk.regions.internal.util.EC2MetadataUtils: Unable to retrieve the requested metadata.'
INFO:apache_beam.utils.subprocess_server:b'22/04/19 21:00:03 INFO org.apache.beam.runners.fnexecution.control.FnApiControlClientPoolService: getProcessBundleDescriptor request with id 1-16'
INFO:apache_beam.io.filebasedsink:Starting finalize_write threads with num_shards: 4 (skipped: 0), batches: 4, num_threads: 4
INFO:apache_beam.io.filebasedsink:Renamed 4 shards in 0.10 seconds.
INFO:apache_beam.utils.subprocess_server:b'22/04/19 21:00:03 INFO org.apache.beam.runners.spark.SparkPipelineRunner: Job BeamApp-jenkins-0419205958-4b343699_ae851f2f-19d7-4a6d-8d39-a179427708c5 finished.'
INFO:apache_beam.runners.portability.portable_runner:Job state changed to DONE
ERROR:apache_beam.runners.worker.data_plane:Failed to read inputs in the data plane.
Traceback (most recent call last):
  File "<https://ci-beam.apache.org/job/beam_PostCommit_Python36/ws/src/sdks/python/apache_beam/runners/worker/data_plane.py",> line 634, in _read_inputs
    for elements in elements_iterator:
  File "<https://ci-beam.apache.org/job/beam_PostCommit_Python36/ws/src/build/gradleenv/2022703440/lib/python3.6/site-packages/grpc/_channel.py",> line 426, in __next__
    return self._next()
  File "<https://ci-beam.apache.org/job/beam_PostCommit_Python36/ws/src/build/gradleenv/2022703440/lib/python3.6/site-packages/grpc/_channel.py",> line 826, in _next
    raise self
grpc._channel._MultiThreadedRendezvous: <_MultiThreadedRendezvous of RPC that terminated with:
	status = StatusCode.UNAVAILABLE
	details = "Socket closed"
	debug_error_string = "{"created":"@1650402003.708154745","description":"Error received from peer ipv6:[::1]:33443","file":"src/core/lib/surface/call.cc","file_line":903,"grpc_message":"Socket closed","grpc_status":14}"
>
Exception in thread run_worker_1-1:
Traceback (most recent call last):
  File "/usr/lib/python3.6/threading.py", line 916, in _bootstrap_inner
    self.run()
  File "/usr/lib/python3.6/threading.py", line 864, in run
    self._target(*self._args, **self._kwargs)
  File "<https://ci-beam.apache.org/job/beam_PostCommit_Python36/ws/src/sdks/python/apache_beam/runners/worker/sdk_worker.py",> line 234, in run
    for work_request in self._control_stub.Control(get_responses()):
  File "<https://ci-beam.apache.org/job/beam_PostCommit_Python36/ws/src/build/gradleenv/2022703440/lib/python3.6/site-packages/grpc/_channel.py",> line 426, in __next__
    return self._next()
  File "<https://ci-beam.apache.org/job/beam_PostCommit_Python36/ws/src/build/gradleenv/2022703440/lib/python3.6/site-packages/grpc/_channel.py",> line 826, in _next
    raise self
grpc._channel._MultiThreadedRendezvous: <_MultiThreadedRendezvous of RPC that terminated with:
	status = StatusCode.UNAVAILABLE
	details = "Connection reset by peer"
	debug_error_string = "{"created":"@1650402003.708177561","description":"Error received from peer ipv6:[::1]:43325","file":"src/core/lib/surface/call.cc","file_line":903,"grpc_message":"Connection reset by peer","grpc_status":14}"
>

Exception in thread read_grpc_client_inputs:
Traceback (most recent call last):
  File "/usr/lib/python3.6/threading.py", line 916, in _bootstrap_inner
    self.run()
  File "/usr/lib/python3.6/threading.py", line 864, in run
    self._target(*self._args, **self._kwargs)
  File "<https://ci-beam.apache.org/job/beam_PostCommit_Python36/ws/src/sdks/python/apache_beam/runners/worker/data_plane.py",> line 651, in <lambda>
    target=lambda: self._read_inputs(elements_iterator),
  File "<https://ci-beam.apache.org/job/beam_PostCommit_Python36/ws/src/sdks/python/apache_beam/runners/worker/data_plane.py",> line 634, in _read_inputs
    for elements in elements_iterator:
  File "<https://ci-beam.apache.org/job/beam_PostCommit_Python36/ws/src/build/gradleenv/2022703440/lib/python3.6/site-packages/grpc/_channel.py",> line 426, in __next__
    return self._next()
  File "<https://ci-beam.apache.org/job/beam_PostCommit_Python36/ws/src/build/gradleenv/2022703440/lib/python3.6/site-packages/grpc/_channel.py",> line 826, in _next
    raise self
grpc._channel._MultiThreadedRendezvous: <_MultiThreadedRendezvous of RPC that terminated with:
	status = StatusCode.UNAVAILABLE
	details = "Socket closed"
	debug_error_string = "{"created":"@1650402003.708154745","description":"Error received from peer ipv6:[::1]:33443","file":"src/core/lib/surface/call.cc","file_line":903,"grpc_message":"Socket closed","grpc_status":14}"
>

Exception in thread read_state:
Traceback (most recent call last):
  File "/usr/lib/python3.6/threading.py", line 916, in _bootstrap_inner
    self.run()
  File "/usr/lib/python3.6/threading.py", line 864, in run
    self._target(*self._args, **self._kwargs)
  File "<https://ci-beam.apache.org/job/beam_PostCommit_Python36/ws/src/sdks/python/apache_beam/runners/worker/sdk_worker.py",> line 990, in pull_responses
    for response in responses:
  File "<https://ci-beam.apache.org/job/beam_PostCommit_Python36/ws/src/build/gradleenv/2022703440/lib/python3.6/site-packages/grpc/_channel.py",> line 426, in __next__
    return self._next()
  File "<https://ci-beam.apache.org/job/beam_PostCommit_Python36/ws/src/build/gradleenv/2022703440/lib/python3.6/site-packages/grpc/_channel.py",> line 826, in _next
    raise self
grpc._channel._MultiThreadedRendezvous: <_MultiThreadedRendezvous of RPC that terminated with:
	status = StatusCode.UNAVAILABLE
	details = "Socket closed"
	debug_error_string = "{"created":"@1650402003.708223105","description":"Error received from peer ipv6:[::1]:40189","file":"src/core/lib/surface/call.cc","file_line":903,"grpc_message":"Socket closed","grpc_status":14}"
>


> Task :sdks:python:test-suites:portable:py36:postCommitPy36

> Task :sdks:python:test-suites:dataflow:py36:postCommitIT
E0419 21:00:45.347255152   87064 fork_posix.cc:70]           Fork support is only compatible with the epoll1 and poll polling strategies
E0419 21:02:54.394072092   87032 fork_posix.cc:70]           Fork support is only compatible with the epoll1 and poll polling strategies
E0419 21:06:36.078448292   86945 fork_posix.cc:70]           Fork support is only compatible with the epoll1 and poll polling strategies
E0419 21:10:23.516161248   87032 fork_posix.cc:70]           Fork support is only compatible with the epoll1 and poll polling strategies
E0419 21:18:07.548516471   87032 fork_posix.cc:70]           Fork support is only compatible with the epoll1 and poll polling strategies
E0419 21:23:16.055006549   87001 fork_posix.cc:70]           Fork support is only compatible with the epoll1 and poll polling strategies
E0419 21:27:07.672587613   87032 fork_posix.cc:70]           Fork support is only compatible with the epoll1 and poll polling strategies
E0419 21:34:34.518734383   87032 fork_posix.cc:70]           Fork support is only compatible with the epoll1 and poll polling strategies
E0419 21:41:39.042675317   87032 fork_posix.cc:70]           Fork support is only compatible with the epoll1 and poll polling strategies
E0419 21:42:49.146600498   87001 fork_posix.cc:70]           Fork support is only compatible with the epoll1 and poll polling strategies
E0419 21:48:48.591968944   87032 fork_posix.cc:70]           Fork support is only compatible with the epoll1 and poll polling strategies
E0419 21:56:59.440905926   87032 fork_posix.cc:70]           Fork support is only compatible with the epoll1 and poll polling strategies
E0419 21:58:17.454657827   87086 fork_posix.cc:70]           Fork support is only compatible with the epoll1 and poll polling strategies
E0419 21:59:53.692471915   87001 fork_posix.cc:70]           Fork support is only compatible with the epoll1 and poll polling strategies
E0419 22:03:49.615715505   87032 fork_posix.cc:70]           Fork support is only compatible with the epoll1 and poll polling strategies
E0419 22:08:36.101910503   87086 fork_posix.cc:70]           Fork support is only compatible with the epoll1 and poll polling strategies
E0419 22:11:36.517673961   87032 fork_posix.cc:70]           Fork support is only compatible with the epoll1 and poll polling strategies

> Task :sdks:python:test-suites:dataflow:py36:postCommitIT FAILED

FAILURE: Build failed with an exception.

* Where:
Script '<https://ci-beam.apache.org/job/beam_PostCommit_Python36/ws/src/sdks/python/test-suites/dataflow/common.gradle'> line: 121

* What went wrong:
Execution failed for task ':sdks:python:test-suites:dataflow:py36:postCommitIT'.
> Process 'command 'sh'' finished with non-zero exit value 1

* Try:
> Run with --stacktrace option to get the stack trace.
> Run with --info or --debug option to get more log output.
> Run with --scan to get full insights.

* Get more help at https://help.gradle.org

Deprecated Gradle features were used in this build, making it incompatible with Gradle 8.0.

You can use '--warning-mode all' to show the individual deprecation warnings and determine if they come from your own scripts or plugins.

See https://docs.gradle.org/7.4/userguide/command_line_interface.html#sec:command_line_warnings

Execution optimizations have been disabled for 1 invalid unit(s) of work during this build to ensure correctness.
Please consult deprecation warnings for more details.

BUILD FAILED in 1h 34m 27s
218 actionable tasks: 148 executed, 64 from cache, 6 up-to-date

Publishing build scan...
https://gradle.com/s/5qhozooj4dnnq

Build step 'Invoke Gradle script' changed build result to FAILURE
Build step 'Invoke Gradle script' marked build as failure

---------------------------------------------------------------------
To unsubscribe, e-mail: builds-unsubscribe@beam.apache.org
For additional commands, e-mail: builds-help@beam.apache.org


Build failed in Jenkins: beam_PostCommit_Python36 #5212

Posted by Apache Jenkins Server <je...@builds.apache.org>.
See <https://ci-beam.apache.org/job/beam_PostCommit_Python36/5212/display/redirect>

Changes:


------------------------------------------
[...truncated 26.09 MB...]
message: "Closing all cached gRPC state handlers."
log_location: "/usr/local/lib/python3.6/site-packages/apache_beam/runners/worker/sdk_worker.py:859"
thread: "MainThread"

INFO:root:severity: INFO
timestamp {
  seconds: 1650380169
  nanos: 990648031
}
message: "Done consuming work."
log_location: "/usr/local/lib/python3.6/site-packages/apache_beam/runners/worker/sdk_worker.py:257"
thread: "MainThread"

INFO:root:severity: INFO
timestamp {
  seconds: 1650380169
  nanos: 990767002
}
message: "Python sdk harness exiting."
log_location: "/usr/local/lib/python3.6/site-packages/apache_beam/runners/worker/sdk_worker_main.py:181"
thread: "MainThread"

INFO:apache_beam.runners.portability.local_job_service:Completed job in 9.374450922012329 seconds with state DONE.
INFO:root:Completed job in 9.374450922012329 seconds with state DONE.
INFO:apache_beam.runners.portability.portable_runner:Job state changed to DONE

> Task :sdks:python:test-suites:portable:py36:portableWordCountSparkRunnerBatch
INFO:apache_beam.runners.worker.worker_pool_main:Listening for workers at localhost:39643
WARNING:root:Make sure that locally built Python SDK docker image has Python 3.6 interpreter.
INFO:root:Default Python SDK image for environment is apache/beam_python3.6_sdk:2.39.0.dev
INFO:apache_beam.runners.portability.fn_api_runner.translations:==================== <function pack_combiners at 0x7f6d1ce56840> ====================
INFO:apache_beam.runners.portability.fn_api_runner.translations:==================== <function lift_combiners at 0x7f6d1ce568c8> ====================
INFO:apache_beam.runners.portability.fn_api_runner.translations:==================== <function sort_stages at 0x7f6d1ce57048> ====================
INFO:apache_beam.utils.subprocess_server:Starting service with ['java' '-jar' '<https://ci-beam.apache.org/job/beam_PostCommit_Python36/ws/src/runners/spark/2/job-server/build/libs/beam-runners-spark-job-server-2.39.0-SNAPSHOT.jar'> '--spark-master-url' 'local[4]' '--artifacts-dir' '/tmp/beam-temp2yklg9ng/artifactseiopvvxy' '--job-port' '58055' '--artifact-port' '0' '--expansion-port' '0']
E0419 14:56:13.368866662  407446 fork_posix.cc:70]           Fork support is only compatible with the epoll1 and poll polling strategies
INFO:apache_beam.utils.subprocess_server:b'22/04/19 14:56:14 WARN software.amazon.awssdk.regions.internal.util.EC2MetadataUtils: Unable to retrieve the requested metadata.'
INFO:apache_beam.utils.subprocess_server:b'22/04/19 14:56:15 INFO org.apache.beam.runners.jobsubmission.JobServerDriver: ArtifactStagingService started on localhost:39787'
INFO:apache_beam.utils.subprocess_server:b'22/04/19 14:56:15 INFO org.apache.beam.runners.jobsubmission.JobServerDriver: Java ExpansionService started on localhost:39799'
INFO:apache_beam.utils.subprocess_server:b'22/04/19 14:56:15 INFO org.apache.beam.runners.jobsubmission.JobServerDriver: JobService started on localhost:58055'
INFO:apache_beam.utils.subprocess_server:b'22/04/19 14:56:15 INFO org.apache.beam.runners.jobsubmission.JobServerDriver: Job server now running, terminate with Ctrl+C'
WARNING:apache_beam.options.pipeline_options:Discarding unparseable args: ['--parallelism=2']
INFO:apache_beam.utils.subprocess_server:b'22/04/19 14:56:16 INFO org.apache.beam.runners.fnexecution.artifact.ArtifactStagingService: Staging artifacts for job_f1adea56-e70e-4a32-aabb-248a6efe1bc7.'
INFO:apache_beam.utils.subprocess_server:b'22/04/19 14:56:16 INFO org.apache.beam.runners.fnexecution.artifact.ArtifactStagingService: Resolving artifacts for job_f1adea56-e70e-4a32-aabb-248a6efe1bc7.ref_Environment_default_environment_1.'
INFO:apache_beam.utils.subprocess_server:b'22/04/19 14:56:16 INFO org.apache.beam.runners.fnexecution.artifact.ArtifactStagingService: Getting 1 artifacts for job_f1adea56-e70e-4a32-aabb-248a6efe1bc7.null.'
INFO:apache_beam.utils.subprocess_server:b'22/04/19 14:56:16 INFO org.apache.beam.runners.fnexecution.artifact.ArtifactStagingService: Artifacts fully staged for job_f1adea56-e70e-4a32-aabb-248a6efe1bc7.'
INFO:apache_beam.utils.subprocess_server:b'22/04/19 14:56:16 INFO org.apache.beam.runners.spark.SparkJobInvoker: Invoking job BeamApp-jenkins-0419145616-ac4b8a10_57a3342d-f2c5-4023-9382-3799d14ed3be'
INFO:apache_beam.utils.subprocess_server:b'22/04/19 14:56:16 INFO org.apache.beam.runners.jobsubmission.JobInvocation: Starting job invocation BeamApp-jenkins-0419145616-ac4b8a10_57a3342d-f2c5-4023-9382-3799d14ed3be'
INFO:apache_beam.runners.portability.portable_runner:Environment "LOOPBACK" has started a component necessary for the execution. Be sure to run the pipeline using
  with Pipeline() as p:
    p.apply(..)
This ensures that the pipeline finishes before this program exits.
INFO:apache_beam.runners.portability.portable_runner:Job state changed to STOPPED
INFO:apache_beam.runners.portability.portable_runner:Job state changed to STARTING
INFO:apache_beam.runners.portability.portable_runner:Job state changed to RUNNING
INFO:apache_beam.utils.subprocess_server:b'22/04/19 14:56:16 INFO org.apache.beam.runners.spark.translation.SparkContextFactory: Creating a brand new Spark Context.'
INFO:apache_beam.utils.subprocess_server:b'22/04/19 14:56:17 WARN org.apache.hadoop.util.NativeCodeLoader: Unable to load native-hadoop library for your platform... using builtin-java classes where applicable'
INFO:apache_beam.utils.subprocess_server:b'22/04/19 14:56:18 INFO org.apache.beam.runners.spark.aggregators.AggregatorsAccumulator: Instantiated aggregators accumulator:'
INFO:apache_beam.utils.subprocess_server:b'22/04/19 14:56:18 INFO org.apache.beam.runners.spark.metrics.MetricsAccumulator: Instantiated metrics accumulator: MetricQueryResults()'
INFO:apache_beam.utils.subprocess_server:b'22/04/19 14:56:18 WARN software.amazon.awssdk.regions.internal.util.EC2MetadataUtils: Unable to retrieve the requested metadata.'
INFO:apache_beam.utils.subprocess_server:b'22/04/19 14:56:18 INFO org.apache.beam.runners.spark.SparkPipelineRunner: Running job BeamApp-jenkins-0419145616-ac4b8a10_57a3342d-f2c5-4023-9382-3799d14ed3be on Spark master local[4]'
INFO:apache_beam.utils.subprocess_server:b'22/04/19 14:56:18 WARN software.amazon.awssdk.regions.internal.util.EC2MetadataUtils: Unable to retrieve the requested metadata.'
INFO:apache_beam.utils.subprocess_server:b'22/04/19 14:56:18 WARN software.amazon.awssdk.regions.internal.util.EC2MetadataUtils: Unable to retrieve the requested metadata.'
INFO:apache_beam.utils.subprocess_server:b'22/04/19 14:56:18 WARN software.amazon.awssdk.regions.internal.util.EC2MetadataUtils: Unable to retrieve the requested metadata.'
INFO:apache_beam.utils.subprocess_server:b'22/04/19 14:56:18 WARN software.amazon.awssdk.regions.internal.util.EC2MetadataUtils: Unable to retrieve the requested metadata.'
INFO:apache_beam.runners.worker.statecache:Creating state cache with size 0
INFO:apache_beam.runners.worker.sdk_worker:Creating insecure control channel for localhost:37375.
INFO:apache_beam.runners.worker.sdk_worker:Control channel established.
INFO:apache_beam.runners.worker.sdk_worker:Initializing SDKHarness with unbounded number of workers.
INFO:apache_beam.utils.subprocess_server:b'22/04/19 14:56:19 INFO org.apache.beam.runners.fnexecution.control.FnApiControlClientPoolService: Beam Fn Control client connected with id 1-1'
INFO:apache_beam.utils.subprocess_server:b'22/04/19 14:56:19 INFO org.apache.beam.runners.fnexecution.control.FnApiControlClientPoolService: getProcessBundleDescriptor request with id 1-2'
INFO:apache_beam.runners.worker.sdk_worker:Creating insecure state channel for localhost:36041.
INFO:apache_beam.runners.worker.sdk_worker:State channel established.
INFO:apache_beam.runners.worker.data_plane:Creating client data channel for localhost:34395
INFO:apache_beam.utils.subprocess_server:b'22/04/19 14:56:19 INFO org.apache.beam.runners.fnexecution.data.GrpcDataService: Beam Fn Data client connected.'
INFO:apache_beam.utils.subprocess_server:b'22/04/19 14:56:19 INFO org.apache.beam.runners.fnexecution.control.FnApiControlClientPoolService: getProcessBundleDescriptor request with id 1-3'
INFO:apache_beam.utils.subprocess_server:b'22/04/19 14:56:19 WARN software.amazon.awssdk.regions.internal.util.EC2MetadataUtils: Unable to retrieve the requested metadata.'
INFO:apache_beam.utils.subprocess_server:b'22/04/19 14:56:19 WARN software.amazon.awssdk.regions.internal.util.EC2MetadataUtils: Unable to retrieve the requested metadata.'
INFO:apache_beam.utils.subprocess_server:b'22/04/19 14:56:19 WARN software.amazon.awssdk.regions.internal.util.EC2MetadataUtils: Unable to retrieve the requested metadata.'
INFO:apache_beam.utils.subprocess_server:b'22/04/19 14:56:19 WARN software.amazon.awssdk.regions.internal.util.EC2MetadataUtils: Unable to retrieve the requested metadata.'
INFO:apache_beam.utils.subprocess_server:b'22/04/19 14:56:19 INFO org.apache.beam.runners.fnexecution.control.FnApiControlClientPoolService: getProcessBundleDescriptor request with id 1-4'
INFO:apache_beam.utils.subprocess_server:b'22/04/19 14:56:19 INFO org.apache.beam.runners.fnexecution.control.FnApiControlClientPoolService: getProcessBundleDescriptor request with id 1-5'
INFO:apache_beam.utils.subprocess_server:b'22/04/19 14:56:19 WARN software.amazon.awssdk.regions.internal.util.EC2MetadataUtils: Unable to retrieve the requested metadata.'
INFO:apache_beam.utils.subprocess_server:b'22/04/19 14:56:19 WARN software.amazon.awssdk.regions.internal.util.EC2MetadataUtils: Unable to retrieve the requested metadata.'
INFO:apache_beam.utils.subprocess_server:b'22/04/19 14:56:19 WARN software.amazon.awssdk.regions.internal.util.EC2MetadataUtils: Unable to retrieve the requested metadata.'
INFO:apache_beam.utils.subprocess_server:b'22/04/19 14:56:19 WARN software.amazon.awssdk.regions.internal.util.EC2MetadataUtils: Unable to retrieve the requested metadata.'
INFO:apache_beam.utils.subprocess_server:b'22/04/19 14:56:19 INFO org.apache.beam.runners.fnexecution.control.FnApiControlClientPoolService: getProcessBundleDescriptor request with id 1-8'
INFO:apache_beam.utils.subprocess_server:b'22/04/19 14:56:19 INFO org.apache.beam.runners.fnexecution.control.FnApiControlClientPoolService: getProcessBundleDescriptor request with id 1-9'
INFO:apache_beam.utils.subprocess_server:b'22/04/19 14:56:19 INFO org.apache.beam.runners.fnexecution.control.FnApiControlClientPoolService: getProcessBundleDescriptor request with id 1-7'
INFO:apache_beam.utils.subprocess_server:b'22/04/19 14:56:19 INFO org.apache.beam.runners.fnexecution.control.FnApiControlClientPoolService: getProcessBundleDescriptor request with id 1-6'
INFO:apache_beam.utils.subprocess_server:b'22/04/19 14:56:19 INFO org.apache.beam.runners.fnexecution.control.FnApiControlClientPoolService: getProcessBundleDescriptor request with id 1-10'
INFO:apache_beam.utils.subprocess_server:b'22/04/19 14:56:19 INFO org.apache.beam.runners.fnexecution.control.FnApiControlClientPoolService: getProcessBundleDescriptor request with id 1-11'
INFO:apache_beam.utils.subprocess_server:b'22/04/19 14:56:19 INFO org.apache.beam.runners.fnexecution.control.FnApiControlClientPoolService: getProcessBundleDescriptor request with id 1-12'
INFO:apache_beam.utils.subprocess_server:b'22/04/19 14:56:19 INFO org.apache.beam.runners.fnexecution.control.FnApiControlClientPoolService: getProcessBundleDescriptor request with id 1-13'
INFO:apache_beam.utils.subprocess_server:b'22/04/19 14:56:19 WARN software.amazon.awssdk.regions.internal.util.EC2MetadataUtils: Unable to retrieve the requested metadata.'
INFO:apache_beam.utils.subprocess_server:b'22/04/19 14:56:19 WARN software.amazon.awssdk.regions.internal.util.EC2MetadataUtils: Unable to retrieve the requested metadata.'
INFO:apache_beam.utils.subprocess_server:b'22/04/19 14:56:19 WARN software.amazon.awssdk.regions.internal.util.EC2MetadataUtils: Unable to retrieve the requested metadata.'
INFO:apache_beam.utils.subprocess_server:b'22/04/19 14:56:19 WARN software.amazon.awssdk.regions.internal.util.EC2MetadataUtils: Unable to retrieve the requested metadata.'
INFO:apache_beam.utils.subprocess_server:b'22/04/19 14:56:19 INFO org.apache.beam.runners.fnexecution.control.FnApiControlClientPoolService: getProcessBundleDescriptor request with id 1-14'
INFO:apache_beam.utils.subprocess_server:b'22/04/19 14:56:19 WARN software.amazon.awssdk.regions.internal.util.EC2MetadataUtils: Unable to retrieve the requested metadata.'
INFO:apache_beam.utils.subprocess_server:b'22/04/19 14:56:19 WARN software.amazon.awssdk.regions.internal.util.EC2MetadataUtils: Unable to retrieve the requested metadata.'
INFO:apache_beam.utils.subprocess_server:b'22/04/19 14:56:19 WARN software.amazon.awssdk.regions.internal.util.EC2MetadataUtils: Unable to retrieve the requested metadata.'
INFO:apache_beam.utils.subprocess_server:b'22/04/19 14:56:19 WARN software.amazon.awssdk.regions.internal.util.EC2MetadataUtils: Unable to retrieve the requested metadata.'
INFO:apache_beam.utils.subprocess_server:b'22/04/19 14:56:19 INFO org.apache.beam.runners.fnexecution.control.FnApiControlClientPoolService: getProcessBundleDescriptor request with id 1-15'
INFO:apache_beam.utils.subprocess_server:b'22/04/19 14:56:20 INFO org.apache.beam.runners.spark.SparkPipelineRunner: Job BeamApp-jenkins-0419145616-ac4b8a10_57a3342d-f2c5-4023-9382-3799d14ed3be: Pipeline translated successfully. Computing outputs'
INFO:apache_beam.utils.subprocess_server:b'22/04/19 14:56:20 WARN software.amazon.awssdk.regions.internal.util.EC2MetadataUtils: Unable to retrieve the requested metadata.'
INFO:apache_beam.utils.subprocess_server:b'22/04/19 14:56:20 WARN software.amazon.awssdk.regions.internal.util.EC2MetadataUtils: Unable to retrieve the requested metadata.'
INFO:apache_beam.utils.subprocess_server:b'22/04/19 14:56:20 WARN software.amazon.awssdk.regions.internal.util.EC2MetadataUtils: Unable to retrieve the requested metadata.'
INFO:apache_beam.utils.subprocess_server:b'22/04/19 14:56:20 WARN software.amazon.awssdk.regions.internal.util.EC2MetadataUtils: Unable to retrieve the requested metadata.'
INFO:apache_beam.utils.subprocess_server:b'22/04/19 14:56:20 INFO org.apache.beam.runners.fnexecution.control.FnApiControlClientPoolService: getProcessBundleDescriptor request with id 1-16'
INFO:apache_beam.io.filebasedsink:Starting finalize_write threads with num_shards: 4 (skipped: 0), batches: 4, num_threads: 4
INFO:apache_beam.io.filebasedsink:Renamed 4 shards in 0.10 seconds.
INFO:apache_beam.utils.subprocess_server:b'22/04/19 14:56:20 INFO org.apache.beam.runners.spark.SparkPipelineRunner: Job BeamApp-jenkins-0419145616-ac4b8a10_57a3342d-f2c5-4023-9382-3799d14ed3be finished.'
INFO:apache_beam.runners.portability.portable_runner:Job state changed to DONE
ERROR:apache_beam.runners.worker.data_plane:Failed to read inputs in the data plane.
Traceback (most recent call last):
  File "<https://ci-beam.apache.org/job/beam_PostCommit_Python36/ws/src/sdks/python/apache_beam/runners/worker/data_plane.py",> line 634, in _read_inputs
    for elements in elements_iterator:
  File "<https://ci-beam.apache.org/job/beam_PostCommit_Python36/ws/src/build/gradleenv/2022703440/lib/python3.6/site-packages/grpc/_channel.py",> line 426, in __next__
    return self._next()
  File "<https://ci-beam.apache.org/job/beam_PostCommit_Python36/ws/src/build/gradleenv/2022703440/lib/python3.6/site-packages/grpc/_channel.py",> line 826, in _next
    raise self
grpc._channel._MultiThreadedRendezvous: <_MultiThreadedRendezvous of RPC that terminated with:
	status = StatusCode.UNAVAILABLE
	details = "Socket closed"
	debug_error_string = "{"created":"@1650380180.724102434","description":"Error received from peer ipv6:[::1]:34395","file":"src/core/lib/surface/call.cc","file_line":903,"grpc_message":"Socket closed","grpc_status":14}"
>
Exception in thread run_worker_1-1:
Traceback (most recent call last):
  File "/usr/lib/python3.6/threading.py", line 916, in _bootstrap_inner
    self.run()
  File "/usr/lib/python3.6/threading.py", line 864, in run
    self._target(*self._args, **self._kwargs)
  File "<https://ci-beam.apache.org/job/beam_PostCommit_Python36/ws/src/sdks/python/apache_beam/runners/worker/sdk_worker.py",> line 234, in run
    for work_request in self._control_stub.Control(get_responses()):
  File "<https://ci-beam.apache.org/job/beam_PostCommit_Python36/ws/src/build/gradleenv/2022703440/lib/python3.6/site-packages/grpc/_channel.py",> line 426, in __next__
    return self._next()
  File "<https://ci-beam.apache.org/job/beam_PostCommit_Python36/ws/src/build/gradleenv/2022703440/lib/python3.6/site-packages/grpc/_channel.py",> line 826, in _next
    raise self
grpc._channel._MultiThreadedRendezvous: <_MultiThreadedRendezvous of RPC that terminated with:
	status = StatusCode.UNAVAILABLE
	details = "Socket closed"
	debug_error_string = "{"created":"@1650380180.724122091","description":"Error received from peer ipv6:[::1]:37375","file":"src/core/lib/surface/call.cc","file_line":903,"grpc_message":"Socket closed","grpc_status":14}"
>

Exception in thread read_grpc_client_inputs:
Traceback (most recent call last):
  File "/usr/lib/python3.6/threading.py", line 916, in _bootstrap_inner
    self.run()
  File "/usr/lib/python3.6/threading.py", line 864, in run
    self._target(*self._args, **self._kwargs)
  File "<https://ci-beam.apache.org/job/beam_PostCommit_Python36/ws/src/sdks/python/apache_beam/runners/worker/data_plane.py",> line 651, in <lambda>
    target=lambda: self._read_inputs(elements_iterator),
  File "<https://ci-beam.apache.org/job/beam_PostCommit_Python36/ws/src/sdks/python/apache_beam/runners/worker/data_plane.py",> line 634, in _read_inputs
    for elements in elements_iterator:
  File "<https://ci-beam.apache.org/job/beam_PostCommit_Python36/ws/src/build/gradleenv/2022703440/lib/python3.6/site-packages/grpc/_channel.py",> line 426, in __next__
    return self._next()
  File "<https://ci-beam.apache.org/job/beam_PostCommit_Python36/ws/src/build/gradleenv/2022703440/lib/python3.6/site-packages/grpc/_channel.py",> line 826, in _next
    raise self
grpc._channel._MultiThreadedRendezvous: <_MultiThreadedRendezvous of RPC that terminated with:
	status = StatusCode.UNAVAILABLE
	details = "Socket closed"
	debug_error_string = "{"created":"@1650380180.724102434","description":"Error received from peer ipv6:[::1]:34395","file":"src/core/lib/surface/call.cc","file_line":903,"grpc_message":"Socket closed","grpc_status":14}"
>

Exception in thread read_state:
Traceback (most recent call last):
  File "/usr/lib/python3.6/threading.py", line 916, in _bootstrap_inner
    self.run()
  File "/usr/lib/python3.6/threading.py", line 864, in run
    self._target(*self._args, **self._kwargs)
  File "<https://ci-beam.apache.org/job/beam_PostCommit_Python36/ws/src/sdks/python/apache_beam/runners/worker/sdk_worker.py",> line 990, in pull_responses
    for response in responses:
  File "<https://ci-beam.apache.org/job/beam_PostCommit_Python36/ws/src/build/gradleenv/2022703440/lib/python3.6/site-packages/grpc/_channel.py",> line 426, in __next__
    return self._next()
  File "<https://ci-beam.apache.org/job/beam_PostCommit_Python36/ws/src/build/gradleenv/2022703440/lib/python3.6/site-packages/grpc/_channel.py",> line 826, in _next
    raise self
grpc._channel._MultiThreadedRendezvous: <_MultiThreadedRendezvous of RPC that terminated with:
	status = StatusCode.UNAVAILABLE
	details = "Socket closed"
	debug_error_string = "{"created":"@1650380180.724115619","description":"Error received from peer ipv6:[::1]:36041","file":"src/core/lib/surface/call.cc","file_line":903,"grpc_message":"Socket closed","grpc_status":14}"
>


> Task :sdks:python:test-suites:portable:py36:postCommitPy36

> Task :sdks:python:test-suites:dataflow:py36:postCommitIT
E0419 14:58:15.892035984  375276 fork_posix.cc:70]           Fork support is only compatible with the epoll1 and poll polling strategies
E0419 14:58:28.377858538  375318 fork_posix.cc:70]           Fork support is only compatible with the epoll1 and poll polling strategies
E0419 15:00:23.450398432  375280 fork_posix.cc:70]           Fork support is only compatible with the epoll1 and poll polling strategies
E0419 15:05:16.551574995  375276 fork_posix.cc:70]           Fork support is only compatible with the epoll1 and poll polling strategies
E0419 15:05:25.067254007  375260 fork_posix.cc:70]           Fork support is only compatible with the epoll1 and poll polling strategies
E0419 15:06:08.881527740  375318 fork_posix.cc:70]           Fork support is only compatible with the epoll1 and poll polling strategies
E0419 15:08:35.020361370  375280 fork_posix.cc:70]           Fork support is only compatible with the epoll1 and poll polling strategies
E0419 15:12:06.287592896  375260 fork_posix.cc:70]           Fork support is only compatible with the epoll1 and poll polling strategies
E0419 15:13:54.709163195  375318 fork_posix.cc:70]           Fork support is only compatible with the epoll1 and poll polling strategies
E0419 15:16:08.816301695  375280 fork_posix.cc:70]           Fork support is only compatible with the epoll1 and poll polling strategies
E0419 15:20:30.907135662  375318 fork_posix.cc:70]           Fork support is only compatible with the epoll1 and poll polling strategies
E0419 15:21:27.094784891  375260 fork_posix.cc:70]           Fork support is only compatible with the epoll1 and poll polling strategies
E0419 15:25:27.223735791  375272 fork_posix.cc:70]           Fork support is only compatible with the epoll1 and poll polling strategies
E0419 15:27:14.521846733  375318 fork_posix.cc:70]           Fork support is only compatible with the epoll1 and poll polling strategies
E0419 15:30:24.262072148  375260 fork_posix.cc:70]           Fork support is only compatible with the epoll1 and poll polling strategies
E0419 15:33:56.884139589  375318 fork_posix.cc:70]           Fork support is only compatible with the epoll1 and poll polling strategies
E0419 15:37:58.561357135  375260 fork_posix.cc:70]           Fork support is only compatible with the epoll1 and poll polling strategies
E0419 15:42:18.290541670  375272 fork_posix.cc:70]           Fork support is only compatible with the epoll1 and poll polling strategies
E0419 15:44:46.948147101  375260 fork_posix.cc:70]           Fork support is only compatible with the epoll1 and poll polling strategies
E0419 15:52:36.688190567  375260 fork_posix.cc:70]           Fork support is only compatible with the epoll1 and poll polling strategies
E0419 15:58:53.767639871  375272 fork_posix.cc:70]           Fork support is only compatible with the epoll1 and poll polling strategies
E0419 15:59:06.588363574  375260 fork_posix.cc:70]           Fork support is only compatible with the epoll1 and poll polling strategies
E0419 16:03:49.059824894  375298 fork_posix.cc:70]           Fork support is only compatible with the epoll1 and poll polling strategies
E0419 16:06:05.665907905  375260 fork_posix.cc:70]           Fork support is only compatible with the epoll1 and poll polling strategies
E0419 16:12:51.436459699  375260 fork_posix.cc:70]           Fork support is only compatible with the epoll1 and poll polling strategies
E0419 16:14:26.756710014  375298 fork_posix.cc:70]           Fork support is only compatible with the epoll1 and poll polling strategies
E0419 16:20:46.187832121  375260 fork_posix.cc:70]           Fork support is only compatible with the epoll1 and poll polling strategies

> Task :sdks:python:test-suites:dataflow:py36:postCommitIT FAILED

FAILURE: Build failed with an exception.

* Where:
Script '<https://ci-beam.apache.org/job/beam_PostCommit_Python36/ws/src/sdks/python/test-suites/dataflow/common.gradle'> line: 121

* What went wrong:
Execution failed for task ':sdks:python:test-suites:dataflow:py36:postCommitIT'.
> Process 'command 'sh'' finished with non-zero exit value 1

* Try:
> Run with --stacktrace option to get the stack trace.
> Run with --info or --debug option to get more log output.
> Run with --scan to get full insights.

* Get more help at https://help.gradle.org

Deprecated Gradle features were used in this build, making it incompatible with Gradle 8.0.

You can use '--warning-mode all' to show the individual deprecation warnings and determine if they come from your own scripts or plugins.

See https://docs.gradle.org/7.4/userguide/command_line_interface.html#sec:command_line_warnings

Execution optimizations have been disabled for 1 invalid unit(s) of work during this build to ensure correctness.
Please consult deprecation warnings for more details.

BUILD FAILED in 1h 43m 10s
218 actionable tasks: 148 executed, 64 from cache, 6 up-to-date

Publishing build scan...
https://gradle.com/s/n7cw4ddctm53i

Build step 'Invoke Gradle script' changed build result to FAILURE
Build step 'Invoke Gradle script' marked build as failure

---------------------------------------------------------------------
To unsubscribe, e-mail: builds-unsubscribe@beam.apache.org
For additional commands, e-mail: builds-help@beam.apache.org


Build failed in Jenkins: beam_PostCommit_Python36 #5211

Posted by Apache Jenkins Server <je...@builds.apache.org>.
See <https://ci-beam.apache.org/job/beam_PostCommit_Python36/5211/display/redirect?page=changes>

Changes:

[noreply] Merge pull request #17382: [BEAM-12356] Close DatasetService leak as


------------------------------------------
[...truncated 26.14 MB...]
  seconds: 1650358561
  nanos: 87751388
}
message: "Closing all cached gRPC state handlers."
log_location: "/usr/local/lib/python3.6/site-packages/apache_beam/runners/worker/sdk_worker.py:859"
thread: "MainThread"

INFO:root:severity: INFO
timestamp {
  seconds: 1650358561
  nanos: 88629007
}
message: "Done consuming work."
log_location: "/usr/local/lib/python3.6/site-packages/apache_beam/runners/worker/sdk_worker.py:257"
thread: "MainThread"

INFO:root:severity: INFO
timestamp {
  seconds: 1650358561
  nanos: 88745117
}
message: "Python sdk harness exiting."
log_location: "/usr/local/lib/python3.6/site-packages/apache_beam/runners/worker/sdk_worker_main.py:181"
thread: "MainThread"

INFO:apache_beam.runners.portability.local_job_service:Completed job in 9.157074689865112 seconds with state DONE.
INFO:root:Completed job in 9.157074689865112 seconds with state DONE.
INFO:apache_beam.runners.portability.portable_runner:Job state changed to DONE

> Task :sdks:python:test-suites:portable:py36:portableWordCountSparkRunnerBatch
INFO:apache_beam.runners.worker.worker_pool_main:Listening for workers at localhost:46379
WARNING:root:Make sure that locally built Python SDK docker image has Python 3.6 interpreter.
INFO:root:Default Python SDK image for environment is apache/beam_python3.6_sdk:2.39.0.dev
INFO:apache_beam.runners.portability.fn_api_runner.translations:==================== <function pack_combiners at 0x7fc9693e4840> ====================
INFO:apache_beam.runners.portability.fn_api_runner.translations:==================== <function lift_combiners at 0x7fc9693e48c8> ====================
INFO:apache_beam.runners.portability.fn_api_runner.translations:==================== <function sort_stages at 0x7fc9693e0048> ====================
INFO:apache_beam.utils.subprocess_server:Starting service with ['java' '-jar' '<https://ci-beam.apache.org/job/beam_PostCommit_Python36/ws/src/runners/spark/2/job-server/build/libs/beam-runners-spark-job-server-2.39.0-SNAPSHOT.jar'> '--spark-master-url' 'local[4]' '--artifacts-dir' '/tmp/beam-temp4x1ce4_a/artifactsknihzym_' '--job-port' '35143' '--artifact-port' '0' '--expansion-port' '0']
E0419 08:56:04.339097896   36092 fork_posix.cc:70]           Fork support is only compatible with the epoll1 and poll polling strategies
INFO:apache_beam.utils.subprocess_server:b'22/04/19 08:56:05 WARN software.amazon.awssdk.regions.internal.util.EC2MetadataUtils: Unable to retrieve the requested metadata.'
INFO:apache_beam.utils.subprocess_server:b'22/04/19 08:56:06 INFO org.apache.beam.runners.jobsubmission.JobServerDriver: ArtifactStagingService started on localhost:34287'
INFO:apache_beam.utils.subprocess_server:b'22/04/19 08:56:06 INFO org.apache.beam.runners.jobsubmission.JobServerDriver: Java ExpansionService started on localhost:38515'
INFO:apache_beam.utils.subprocess_server:b'22/04/19 08:56:06 INFO org.apache.beam.runners.jobsubmission.JobServerDriver: JobService started on localhost:35143'
INFO:apache_beam.utils.subprocess_server:b'22/04/19 08:56:06 INFO org.apache.beam.runners.jobsubmission.JobServerDriver: Job server now running, terminate with Ctrl+C'
WARNING:apache_beam.options.pipeline_options:Discarding unparseable args: ['--parallelism=2']
INFO:apache_beam.utils.subprocess_server:b'22/04/19 08:56:06 INFO org.apache.beam.runners.fnexecution.artifact.ArtifactStagingService: Staging artifacts for job_039a67e5-2a5b-45b3-a551-f8ecf4a41b43.'
INFO:apache_beam.utils.subprocess_server:b'22/04/19 08:56:06 INFO org.apache.beam.runners.fnexecution.artifact.ArtifactStagingService: Resolving artifacts for job_039a67e5-2a5b-45b3-a551-f8ecf4a41b43.ref_Environment_default_environment_1.'
INFO:apache_beam.utils.subprocess_server:b'22/04/19 08:56:07 INFO org.apache.beam.runners.fnexecution.artifact.ArtifactStagingService: Getting 1 artifacts for job_039a67e5-2a5b-45b3-a551-f8ecf4a41b43.null.'
INFO:apache_beam.utils.subprocess_server:b'22/04/19 08:56:07 INFO org.apache.beam.runners.fnexecution.artifact.ArtifactStagingService: Artifacts fully staged for job_039a67e5-2a5b-45b3-a551-f8ecf4a41b43.'
INFO:apache_beam.utils.subprocess_server:b'22/04/19 08:56:07 INFO org.apache.beam.runners.spark.SparkJobInvoker: Invoking job BeamApp-jenkins-0419085607-d3a9657a_f5fefd3c-943d-4862-960f-c028d7ab6d75'
INFO:apache_beam.utils.subprocess_server:b'22/04/19 08:56:07 INFO org.apache.beam.runners.jobsubmission.JobInvocation: Starting job invocation BeamApp-jenkins-0419085607-d3a9657a_f5fefd3c-943d-4862-960f-c028d7ab6d75'
INFO:apache_beam.runners.portability.portable_runner:Environment "LOOPBACK" has started a component necessary for the execution. Be sure to run the pipeline using
  with Pipeline() as p:
    p.apply(..)
This ensures that the pipeline finishes before this program exits.
INFO:apache_beam.runners.portability.portable_runner:Job state changed to STOPPED
INFO:apache_beam.runners.portability.portable_runner:Job state changed to STARTING
INFO:apache_beam.runners.portability.portable_runner:Job state changed to RUNNING
INFO:apache_beam.utils.subprocess_server:b'22/04/19 08:56:07 INFO org.apache.beam.runners.spark.translation.SparkContextFactory: Creating a brand new Spark Context.'
INFO:apache_beam.utils.subprocess_server:b'22/04/19 08:56:07 WARN org.apache.hadoop.util.NativeCodeLoader: Unable to load native-hadoop library for your platform... using builtin-java classes where applicable'
INFO:apache_beam.utils.subprocess_server:b'22/04/19 08:56:08 INFO org.apache.beam.runners.spark.aggregators.AggregatorsAccumulator: Instantiated aggregators accumulator:'
INFO:apache_beam.utils.subprocess_server:b'22/04/19 08:56:08 INFO org.apache.beam.runners.spark.metrics.MetricsAccumulator: Instantiated metrics accumulator: MetricQueryResults()'
INFO:apache_beam.utils.subprocess_server:b'22/04/19 08:56:08 WARN software.amazon.awssdk.regions.internal.util.EC2MetadataUtils: Unable to retrieve the requested metadata.'
INFO:apache_beam.utils.subprocess_server:b'22/04/19 08:56:08 INFO org.apache.beam.runners.spark.SparkPipelineRunner: Running job BeamApp-jenkins-0419085607-d3a9657a_f5fefd3c-943d-4862-960f-c028d7ab6d75 on Spark master local[4]'
INFO:apache_beam.utils.subprocess_server:b'22/04/19 08:56:09 WARN software.amazon.awssdk.regions.internal.util.EC2MetadataUtils: Unable to retrieve the requested metadata.'
INFO:apache_beam.utils.subprocess_server:b'22/04/19 08:56:09 WARN software.amazon.awssdk.regions.internal.util.EC2MetadataUtils: Unable to retrieve the requested metadata.'
INFO:apache_beam.utils.subprocess_server:b'22/04/19 08:56:09 WARN software.amazon.awssdk.regions.internal.util.EC2MetadataUtils: Unable to retrieve the requested metadata.'
INFO:apache_beam.utils.subprocess_server:b'22/04/19 08:56:09 WARN software.amazon.awssdk.regions.internal.util.EC2MetadataUtils: Unable to retrieve the requested metadata.'
INFO:apache_beam.runners.worker.statecache:Creating state cache with size 0
INFO:apache_beam.runners.worker.sdk_worker:Creating insecure control channel for localhost:43755.
INFO:apache_beam.runners.worker.sdk_worker:Control channel established.
INFO:apache_beam.runners.worker.sdk_worker:Initializing SDKHarness with unbounded number of workers.
INFO:apache_beam.utils.subprocess_server:b'22/04/19 08:56:09 INFO org.apache.beam.runners.fnexecution.control.FnApiControlClientPoolService: Beam Fn Control client connected with id 1-1'
INFO:apache_beam.utils.subprocess_server:b'22/04/19 08:56:09 INFO org.apache.beam.runners.fnexecution.control.FnApiControlClientPoolService: getProcessBundleDescriptor request with id 1-2'
INFO:apache_beam.runners.worker.sdk_worker:Creating insecure state channel for localhost:34541.
INFO:apache_beam.runners.worker.sdk_worker:State channel established.
INFO:apache_beam.runners.worker.data_plane:Creating client data channel for localhost:43941
INFO:apache_beam.utils.subprocess_server:b'22/04/19 08:56:09 INFO org.apache.beam.runners.fnexecution.data.GrpcDataService: Beam Fn Data client connected.'
INFO:apache_beam.utils.subprocess_server:b'22/04/19 08:56:09 INFO org.apache.beam.runners.fnexecution.control.FnApiControlClientPoolService: getProcessBundleDescriptor request with id 1-3'
INFO:apache_beam.utils.subprocess_server:b'22/04/19 08:56:10 WARN software.amazon.awssdk.regions.internal.util.EC2MetadataUtils: Unable to retrieve the requested metadata.'
INFO:apache_beam.utils.subprocess_server:b'22/04/19 08:56:10 WARN software.amazon.awssdk.regions.internal.util.EC2MetadataUtils: Unable to retrieve the requested metadata.'
INFO:apache_beam.utils.subprocess_server:b'22/04/19 08:56:10 WARN software.amazon.awssdk.regions.internal.util.EC2MetadataUtils: Unable to retrieve the requested metadata.'
INFO:apache_beam.utils.subprocess_server:b'22/04/19 08:56:10 WARN software.amazon.awssdk.regions.internal.util.EC2MetadataUtils: Unable to retrieve the requested metadata.'
INFO:apache_beam.utils.subprocess_server:b'22/04/19 08:56:10 INFO org.apache.beam.runners.fnexecution.control.FnApiControlClientPoolService: getProcessBundleDescriptor request with id 1-4'
INFO:apache_beam.utils.subprocess_server:b'22/04/19 08:56:10 INFO org.apache.beam.runners.fnexecution.control.FnApiControlClientPoolService: getProcessBundleDescriptor request with id 1-5'
INFO:apache_beam.utils.subprocess_server:b'22/04/19 08:56:10 WARN software.amazon.awssdk.regions.internal.util.EC2MetadataUtils: Unable to retrieve the requested metadata.'
INFO:apache_beam.utils.subprocess_server:b'22/04/19 08:56:10 WARN software.amazon.awssdk.regions.internal.util.EC2MetadataUtils: Unable to retrieve the requested metadata.'
INFO:apache_beam.utils.subprocess_server:b'22/04/19 08:56:10 WARN software.amazon.awssdk.regions.internal.util.EC2MetadataUtils: Unable to retrieve the requested metadata.'
INFO:apache_beam.utils.subprocess_server:b'22/04/19 08:56:10 WARN software.amazon.awssdk.regions.internal.util.EC2MetadataUtils: Unable to retrieve the requested metadata.'
INFO:apache_beam.utils.subprocess_server:b'22/04/19 08:56:10 INFO org.apache.beam.runners.fnexecution.control.FnApiControlClientPoolService: getProcessBundleDescriptor request with id 1-6'
INFO:apache_beam.utils.subprocess_server:b'22/04/19 08:56:10 INFO org.apache.beam.runners.fnexecution.control.FnApiControlClientPoolService: getProcessBundleDescriptor request with id 1-9'
INFO:apache_beam.utils.subprocess_server:b'22/04/19 08:56:10 INFO org.apache.beam.runners.fnexecution.control.FnApiControlClientPoolService: getProcessBundleDescriptor request with id 1-8'
INFO:apache_beam.utils.subprocess_server:b'22/04/19 08:56:10 INFO org.apache.beam.runners.fnexecution.control.FnApiControlClientPoolService: getProcessBundleDescriptor request with id 1-7'
INFO:apache_beam.utils.subprocess_server:b'22/04/19 08:56:10 INFO org.apache.beam.runners.fnexecution.control.FnApiControlClientPoolService: getProcessBundleDescriptor request with id 1-10'
INFO:apache_beam.utils.subprocess_server:b'22/04/19 08:56:10 INFO org.apache.beam.runners.fnexecution.control.FnApiControlClientPoolService: getProcessBundleDescriptor request with id 1-11'
INFO:apache_beam.utils.subprocess_server:b'22/04/19 08:56:10 INFO org.apache.beam.runners.fnexecution.control.FnApiControlClientPoolService: getProcessBundleDescriptor request with id 1-12'
INFO:apache_beam.utils.subprocess_server:b'22/04/19 08:56:10 INFO org.apache.beam.runners.fnexecution.control.FnApiControlClientPoolService: getProcessBundleDescriptor request with id 1-13'
INFO:apache_beam.utils.subprocess_server:b'22/04/19 08:56:10 WARN software.amazon.awssdk.regions.internal.util.EC2MetadataUtils: Unable to retrieve the requested metadata.'
INFO:apache_beam.utils.subprocess_server:b'22/04/19 08:56:10 WARN software.amazon.awssdk.regions.internal.util.EC2MetadataUtils: Unable to retrieve the requested metadata.'
INFO:apache_beam.utils.subprocess_server:b'22/04/19 08:56:10 WARN software.amazon.awssdk.regions.internal.util.EC2MetadataUtils: Unable to retrieve the requested metadata.'
INFO:apache_beam.utils.subprocess_server:b'22/04/19 08:56:10 WARN software.amazon.awssdk.regions.internal.util.EC2MetadataUtils: Unable to retrieve the requested metadata.'
INFO:apache_beam.utils.subprocess_server:b'22/04/19 08:56:10 INFO org.apache.beam.runners.fnexecution.control.FnApiControlClientPoolService: getProcessBundleDescriptor request with id 1-14'
INFO:apache_beam.utils.subprocess_server:b'22/04/19 08:56:10 WARN software.amazon.awssdk.regions.internal.util.EC2MetadataUtils: Unable to retrieve the requested metadata.'
INFO:apache_beam.utils.subprocess_server:b'22/04/19 08:56:10 WARN software.amazon.awssdk.regions.internal.util.EC2MetadataUtils: Unable to retrieve the requested metadata.'
INFO:apache_beam.utils.subprocess_server:b'22/04/19 08:56:10 WARN software.amazon.awssdk.regions.internal.util.EC2MetadataUtils: Unable to retrieve the requested metadata.'
INFO:apache_beam.utils.subprocess_server:b'22/04/19 08:56:10 WARN software.amazon.awssdk.regions.internal.util.EC2MetadataUtils: Unable to retrieve the requested metadata.'
INFO:apache_beam.utils.subprocess_server:b'22/04/19 08:56:10 INFO org.apache.beam.runners.fnexecution.control.FnApiControlClientPoolService: getProcessBundleDescriptor request with id 1-15'
INFO:apache_beam.utils.subprocess_server:b'22/04/19 08:56:10 INFO org.apache.beam.runners.spark.SparkPipelineRunner: Job BeamApp-jenkins-0419085607-d3a9657a_f5fefd3c-943d-4862-960f-c028d7ab6d75: Pipeline translated successfully. Computing outputs'
INFO:apache_beam.utils.subprocess_server:b'22/04/19 08:56:10 WARN software.amazon.awssdk.regions.internal.util.EC2MetadataUtils: Unable to retrieve the requested metadata.'
INFO:apache_beam.utils.subprocess_server:b'22/04/19 08:56:10 WARN software.amazon.awssdk.regions.internal.util.EC2MetadataUtils: Unable to retrieve the requested metadata.'
INFO:apache_beam.utils.subprocess_server:b'22/04/19 08:56:10 WARN software.amazon.awssdk.regions.internal.util.EC2MetadataUtils: Unable to retrieve the requested metadata.'
INFO:apache_beam.utils.subprocess_server:b'22/04/19 08:56:10 WARN software.amazon.awssdk.regions.internal.util.EC2MetadataUtils: Unable to retrieve the requested metadata.'
INFO:apache_beam.utils.subprocess_server:b'22/04/19 08:56:10 INFO org.apache.beam.runners.fnexecution.control.FnApiControlClientPoolService: getProcessBundleDescriptor request with id 1-16'
INFO:apache_beam.io.filebasedsink:Starting finalize_write threads with num_shards: 4 (skipped: 0), batches: 4, num_threads: 4
INFO:apache_beam.io.filebasedsink:Renamed 4 shards in 0.10 seconds.
INFO:apache_beam.utils.subprocess_server:b'22/04/19 08:56:10 INFO org.apache.beam.runners.spark.SparkPipelineRunner: Job BeamApp-jenkins-0419085607-d3a9657a_f5fefd3c-943d-4862-960f-c028d7ab6d75 finished.'
INFO:apache_beam.runners.portability.portable_runner:Job state changed to DONE
Exception in thread run_worker_1-1:
Traceback (most recent call last):
  File "/usr/lib/python3.6/threading.py", line 916, in _bootstrap_inner
    self.run()
  File "/usr/lib/python3.6/threading.py", line 864, in run
    self._target(*self._args, **self._kwargs)
  File "<https://ci-beam.apache.org/job/beam_PostCommit_Python36/ws/src/sdks/python/apache_beam/runners/worker/sdk_worker.py",> line 234, in run
    for work_request in self._control_stub.Control(get_responses()):
  File "<https://ci-beam.apache.org/job/beam_PostCommit_Python36/ws/src/build/gradleenv/2022703440/lib/python3.6/site-packages/grpc/_channel.py",> line 426, in __next__
    return self._next()
  File "<https://ci-beam.apache.org/job/beam_PostCommit_Python36/ws/src/build/gradleenv/2022703440/lib/python3.6/site-packages/grpc/_channel.py",> line 826, in _next
    raise self
grpc._channel._MultiThreadedRendezvous: <_MultiThreadedRendezvous of RPC that terminated with:
	status = StatusCode.UNAVAILABLE
	details = "Socket closed"
	debug_error_string = "{"created":"@1650358571.489306695","description":"Error received from peer ipv6:[::1]:43755","file":"src/core/lib/surface/call.cc","file_line":903,"grpc_message":"Socket closed","grpc_status":14}"
>

ERROR:apache_beam.runners.worker.data_plane:Failed to read inputs in the data plane.
Traceback (most recent call last):
  File "<https://ci-beam.apache.org/job/beam_PostCommit_Python36/ws/src/sdks/python/apache_beam/runners/worker/data_plane.py",> line 634, in _read_inputs
    for elements in elements_iterator:
  File "<https://ci-beam.apache.org/job/beam_PostCommit_Python36/ws/src/build/gradleenv/2022703440/lib/python3.6/site-packages/grpc/_channel.py",> line 426, in __next__
    return self._next()
  File "<https://ci-beam.apache.org/job/beam_PostCommit_Python36/ws/src/build/gradleenv/2022703440/lib/python3.6/site-packages/grpc/_channel.py",> line 826, in _next
    raise self
grpc._channel._MultiThreadedRendezvous: <_MultiThreadedRendezvous of RPC that terminated with:
	status = StatusCode.UNAVAILABLE
	details = "Socket closed"
	debug_error_string = "{"created":"@1650358571.489275372","description":"Error received from peer ipv6:[::1]:43941","file":"src/core/lib/surface/call.cc","file_line":903,"grpc_message":"Socket closed","grpc_status":14}"
>

> Task :sdks:python:test-suites:dataflow:py36:postCommitIT
E0419 08:56:11.925501330   12216 fork_posix.cc:70]           Fork support is only compatible with the epoll1 and poll polling strategies

> Task :sdks:python:test-suites:portable:py36:portableWordCountSparkRunnerBatch
Exception in thread read_state:
Traceback (most recent call last):
  File "/usr/lib/python3.6/threading.py", line 916, in _bootstrap_inner
    self.run()
  File "/usr/lib/python3.6/threading.py", line 864, in run
    self._target(*self._args, **self._kwargs)
  File "<https://ci-beam.apache.org/job/beam_PostCommit_Python36/ws/src/sdks/python/apache_beam/runners/worker/sdk_worker.py",> line 990, in pull_responses
    for response in responses:
  File "<https://ci-beam.apache.org/job/beam_PostCommit_Python36/ws/src/build/gradleenv/2022703440/lib/python3.6/site-packages/grpc/_channel.py",> line 426, in __next__
    return self._next()
  File "<https://ci-beam.apache.org/job/beam_PostCommit_Python36/ws/src/build/gradleenv/2022703440/lib/python3.6/site-packages/grpc/_channel.py",> line 826, in _next
    raise self
grpc._channel._MultiThreadedRendezvous: <_MultiThreadedRendezvous of RPC that terminated with:
	status = StatusCode.UNAVAILABLE
	details = "Socket closed"
	debug_error_string = "{"created":"@1650358571.489274414","description":"Error received from peer ipv6:[::1]:34541","file":"src/core/lib/surface/call.cc","file_line":903,"grpc_message":"Socket closed","grpc_status":14}"
>

Exception in thread read_grpc_client_inputs:
Traceback (most recent call last):
  File "/usr/lib/python3.6/threading.py", line 916, in _bootstrap_inner
    self.run()
  File "/usr/lib/python3.6/threading.py", line 864, in run
    self._target(*self._args, **self._kwargs)
  File "<https://ci-beam.apache.org/job/beam_PostCommit_Python36/ws/src/sdks/python/apache_beam/runners/worker/data_plane.py",> line 651, in <lambda>
    target=lambda: self._read_inputs(elements_iterator),
  File "<https://ci-beam.apache.org/job/beam_PostCommit_Python36/ws/src/sdks/python/apache_beam/runners/worker/data_plane.py",> line 634, in _read_inputs
    for elements in elements_iterator:
  File "<https://ci-beam.apache.org/job/beam_PostCommit_Python36/ws/src/build/gradleenv/2022703440/lib/python3.6/site-packages/grpc/_channel.py",> line 426, in __next__
    return self._next()
  File "<https://ci-beam.apache.org/job/beam_PostCommit_Python36/ws/src/build/gradleenv/2022703440/lib/python3.6/site-packages/grpc/_channel.py",> line 826, in _next
    raise self
grpc._channel._MultiThreadedRendezvous: <_MultiThreadedRendezvous of RPC that terminated with:
	status = StatusCode.UNAVAILABLE
	details = "Socket closed"
	debug_error_string = "{"created":"@1650358571.489275372","description":"Error received from peer ipv6:[::1]:43941","file":"src/core/lib/surface/call.cc","file_line":903,"grpc_message":"Socket closed","grpc_status":14}"
>


> Task :sdks:python:test-suites:portable:py36:postCommitPy36

> Task :sdks:python:test-suites:dataflow:py36:postCommitIT
E0419 08:58:32.015614261   12339 fork_posix.cc:70]           Fork support is only compatible with the epoll1 and poll polling strategies
E0419 09:03:39.902127646   12216 fork_posix.cc:70]           Fork support is only compatible with the epoll1 and poll polling strategies
E0419 09:04:13.217159777   12227 fork_posix.cc:70]           Fork support is only compatible with the epoll1 and poll polling strategies
E0419 09:06:22.199314670   12339 fork_posix.cc:70]           Fork support is only compatible with the epoll1 and poll polling strategies
E0419 09:10:44.532939185   12227 fork_posix.cc:70]           Fork support is only compatible with the epoll1 and poll polling strategies
E0419 09:14:16.389037663   12339 fork_posix.cc:70]           Fork support is only compatible with the epoll1 and poll polling strategies
E0419 09:17:34.683702607   12227 fork_posix.cc:70]           Fork support is only compatible with the epoll1 and poll polling strategies
E0419 09:21:03.021580249   12209 fork_posix.cc:70]           Fork support is only compatible with the epoll1 and poll polling strategies
E0419 09:25:43.263238730   12227 fork_posix.cc:70]           Fork support is only compatible with the epoll1 and poll polling strategies
E0419 09:32:21.944105604   12227 fork_posix.cc:70]           Fork support is only compatible with the epoll1 and poll polling strategies
E0419 09:38:14.510715236   12209 fork_posix.cc:70]           Fork support is only compatible with the epoll1 and poll polling strategies
E0419 09:39:56.592225675   12227 fork_posix.cc:70]           Fork support is only compatible with the epoll1 and poll polling strategies
E0419 09:46:39.888034834   12227 fork_posix.cc:70]           Fork support is only compatible with the epoll1 and poll polling strategies
E0419 09:53:38.838092144   12227 fork_posix.cc:70]           Fork support is only compatible with the epoll1 and poll polling strategies
E0419 09:55:17.215674594   12209 fork_posix.cc:70]           Fork support is only compatible with the epoll1 and poll polling strategies
E0419 09:57:02.771894018   12360 fork_posix.cc:70]           Fork support is only compatible with the epoll1 and poll polling strategies
E0419 10:00:44.549021470   12227 fork_posix.cc:70]           Fork support is only compatible with the epoll1 and poll polling strategies
E0419 10:07:28.875054756   12360 fork_posix.cc:70]           Fork support is only compatible with the epoll1 and poll polling strategies
E0419 10:08:08.675824654   12227 fork_posix.cc:70]           Fork support is only compatible with the epoll1 and poll polling strategies

> Task :sdks:python:test-suites:dataflow:py36:postCommitIT FAILED

FAILURE: Build failed with an exception.

* Where:
Script '<https://ci-beam.apache.org/job/beam_PostCommit_Python36/ws/src/sdks/python/test-suites/dataflow/common.gradle'> line: 121

* What went wrong:
Execution failed for task ':sdks:python:test-suites:dataflow:py36:postCommitIT'.
> Process 'command 'sh'' finished with non-zero exit value 1

* Try:
> Run with --stacktrace option to get the stack trace.
> Run with --info or --debug option to get more log output.
> Run with --scan to get full insights.

* Get more help at https://help.gradle.org

Deprecated Gradle features were used in this build, making it incompatible with Gradle 8.0.

You can use '--warning-mode all' to show the individual deprecation warnings and determine if they come from your own scripts or plugins.

See https://docs.gradle.org/7.4/userguide/command_line_interface.html#sec:command_line_warnings

Execution optimizations have been disabled for 1 invalid unit(s) of work during this build to ensure correctness.
Please consult deprecation warnings for more details.

BUILD FAILED in 1h 32m 52s
218 actionable tasks: 149 executed, 63 from cache, 6 up-to-date

Publishing build scan...
https://gradle.com/s/cqybcfgxcttxq

Build step 'Invoke Gradle script' changed build result to FAILURE
Build step 'Invoke Gradle script' marked build as failure

---------------------------------------------------------------------
To unsubscribe, e-mail: builds-unsubscribe@beam.apache.org
For additional commands, e-mail: builds-help@beam.apache.org


Build failed in Jenkins: beam_PostCommit_Python36 #5210

Posted by Apache Jenkins Server <je...@builds.apache.org>.
See <https://ci-beam.apache.org/job/beam_PostCommit_Python36/5210/display/redirect?page=changes>

Changes:

[Heejong Lee] [BEAM-14251] add output_coder_override to ExpansionRequest

[Heejong Lee] remove null

[Heejong Lee] better error msg

[Heejong Lee] update from comments

[noreply] [BEAM-14290] Address staticcheck warnings in the reflectx package

[noreply] [BEAM-14302] Simply bools in fn.go, genx_test.go (#17356)


------------------------------------------
[...truncated 35.88 MB...]
apache_beam/io/gcp/bigquery.py:2143
apache_beam/io/gcp/bigquery.py:2143
apache_beam/io/gcp/bigquery.py:2143
apache_beam/io/gcp/bigquery.py:2143
apache_beam/io/gcp/bigquery.py:2143
apache_beam/io/gcp/bigquery.py:2143
apache_beam/io/gcp/bigquery.py:2143
apache_beam/io/gcp/bigquery.py:2143
apache_beam/io/gcp/bigquery.py:2143
apache_beam/io/gcp/bigquery.py:2143
apache_beam/io/gcp/bigquery.py:2143
apache_beam/io/gcp/bigquery.py:2143
  <https://ci-beam.apache.org/job/beam_PostCommit_Python36/ws/src/sdks/python/apache_beam/io/gcp/bigquery.py>:2143: BeamDeprecationWarning: options is deprecated since First stable release. References to <pipeline>.options will not be supported
    is_streaming_pipeline = p.options.view_as(StandardOptions).streaming

apache_beam/io/gcp/bigquery.py:2149
apache_beam/io/gcp/bigquery.py:2149
apache_beam/io/gcp/bigquery.py:2149
apache_beam/io/gcp/bigquery.py:2149
apache_beam/io/gcp/bigquery.py:2149
apache_beam/io/gcp/bigquery.py:2149
apache_beam/io/gcp/bigquery.py:2149
apache_beam/io/gcp/bigquery.py:2149
apache_beam/io/gcp/bigquery.py:2149
apache_beam/io/gcp/bigquery.py:2149
apache_beam/io/gcp/bigquery.py:2149
apache_beam/io/gcp/bigquery.py:2149
apache_beam/io/gcp/bigquery.py:2149
apache_beam/io/gcp/bigquery.py:2149
apache_beam/io/gcp/bigquery.py:2149
apache_beam/io/gcp/bigquery.py:2149
apache_beam/io/gcp/bigquery.py:2149
apache_beam/io/gcp/bigquery.py:2149
apache_beam/io/gcp/bigquery.py:2149
apache_beam/io/gcp/bigquery.py:2149
apache_beam/io/gcp/bigquery.py:2149
apache_beam/io/gcp/bigquery.py:2149
apache_beam/io/gcp/bigquery.py:2149
apache_beam/io/gcp/bigquery.py:2149
  <https://ci-beam.apache.org/job/beam_PostCommit_Python36/ws/src/sdks/python/apache_beam/io/gcp/bigquery.py>:2149: BeamDeprecationWarning: options is deprecated since First stable release. References to <pipeline>.options will not be supported
    experiments = p.options.view_as(DebugOptions).experiments or []

apache_beam/io/gcp/bigquery.py:2443
apache_beam/io/gcp/bigquery.py:2443
apache_beam/io/gcp/bigquery.py:2443
apache_beam/io/gcp/bigquery.py:2443
apache_beam/io/gcp/bigquery.py:2443
apache_beam/io/gcp/bigquery.py:2443
apache_beam/io/gcp/bigquery.py:2443
apache_beam/io/gcp/bigquery.py:2443
apache_beam/io/gcp/bigquery.py:2443
apache_beam/io/gcp/bigquery.py:2443
apache_beam/io/gcp/bigquery.py:2443
apache_beam/io/gcp/bigquery.py:2443
apache_beam/io/gcp/bigquery.py:2443
apache_beam/io/gcp/bigquery.py:2443
  <https://ci-beam.apache.org/job/beam_PostCommit_Python36/ws/src/sdks/python/apache_beam/io/gcp/bigquery.py>:2443: BeamDeprecationWarning: options is deprecated since First stable release. References to <pipeline>.options will not be supported
    temp_location = pcoll.pipeline.options.view_as(

apache_beam/io/gcp/bigquery.py:2445
apache_beam/io/gcp/bigquery.py:2445
apache_beam/io/gcp/bigquery.py:2445
apache_beam/io/gcp/bigquery.py:2445
apache_beam/io/gcp/bigquery.py:2445
apache_beam/io/gcp/bigquery.py:2445
apache_beam/io/gcp/bigquery.py:2445
apache_beam/io/gcp/bigquery.py:2445
apache_beam/io/gcp/bigquery.py:2445
apache_beam/io/gcp/bigquery.py:2445
apache_beam/io/gcp/bigquery.py:2445
apache_beam/io/gcp/bigquery.py:2445
apache_beam/io/gcp/bigquery.py:2445
apache_beam/io/gcp/bigquery.py:2445
  <https://ci-beam.apache.org/job/beam_PostCommit_Python36/ws/src/sdks/python/apache_beam/io/gcp/bigquery.py>:2445: BeamDeprecationWarning: options is deprecated since First stable release. References to <pipeline>.options will not be supported
    job_name = pcoll.pipeline.options.view_as(GoogleCloudOptions).job_name

apache_beam/io/gcp/bigquery.py:2476
apache_beam/io/gcp/bigquery.py:2476
apache_beam/io/gcp/bigquery.py:2476
apache_beam/io/gcp/bigquery.py:2476
apache_beam/io/gcp/bigquery.py:2476
apache_beam/io/gcp/bigquery.py:2476
apache_beam/io/gcp/bigquery.py:2476
apache_beam/io/gcp/bigquery.py:2476
apache_beam/io/gcp/bigquery.py:2476
apache_beam/io/gcp/bigquery.py:2476
apache_beam/io/gcp/bigquery.py:2476
apache_beam/io/gcp/bigquery.py:2476
apache_beam/io/gcp/bigquery.py:2476
apache_beam/io/gcp/bigquery.py:2476
  <https://ci-beam.apache.org/job/beam_PostCommit_Python36/ws/src/sdks/python/apache_beam/io/gcp/bigquery.py>:2476: BeamDeprecationWarning: options is deprecated since First stable release. References to <pipeline>.options will not be supported
    | _PassThroughThenCleanup(files_to_remove_pcoll))

apache_beam/io/gcp/bigquery.py:2139
apache_beam/io/gcp/bigquery.py:2139
apache_beam/io/gcp/bigquery.py:2139
apache_beam/io/gcp/bigquery.py:2139
apache_beam/io/gcp/bigquery.py:2139
apache_beam/io/gcp/bigquery.py:2139
apache_beam/io/gcp/bigquery.py:2139
apache_beam/io/gcp/bigquery.py:2139
apache_beam/io/gcp/bigquery.py:2139
apache_beam/io/gcp/bigquery.py:2139
apache_beam/io/gcp/bigquery.py:2139
apache_beam/io/gcp/bigquery.py:2139
  <https://ci-beam.apache.org/job/beam_PostCommit_Python36/ws/src/sdks/python/apache_beam/io/gcp/bigquery.py>:2139: BeamDeprecationWarning: options is deprecated since First stable release. References to <pipeline>.options will not be supported
    self.table_reference.projectId = pcoll.pipeline.options.view_as(

apache_beam/io/gcp/bigquery_file_loads.py:1128
apache_beam/io/gcp/bigquery_file_loads.py:1128
apache_beam/io/gcp/bigquery_file_loads.py:1128
apache_beam/io/gcp/bigquery_file_loads.py:1128
apache_beam/io/gcp/bigquery_file_loads.py:1128
apache_beam/io/gcp/bigquery_file_loads.py:1128
apache_beam/io/gcp/bigquery_file_loads.py:1128
apache_beam/io/gcp/bigquery_file_loads.py:1128
apache_beam/io/gcp/bigquery_file_loads.py:1128
apache_beam/io/gcp/bigquery_file_loads.py:1128
apache_beam/io/gcp/bigquery_file_loads.py:1128
apache_beam/io/gcp/bigquery_file_loads.py:1128
apache_beam/io/gcp/bigquery_file_loads.py:1128
apache_beam/io/gcp/bigquery_file_loads.py:1128
apache_beam/io/gcp/bigquery_file_loads.py:1128
apache_beam/io/gcp/bigquery_file_loads.py:1128
apache_beam/io/gcp/bigquery_file_loads.py:1128
  <https://ci-beam.apache.org/job/beam_PostCommit_Python36/ws/src/sdks/python/apache_beam/io/gcp/bigquery_file_loads.py>:1128: BeamDeprecationWarning: options is deprecated since First stable release. References to <pipeline>.options will not be supported
    temp_location = p.options.view_as(GoogleCloudOptions).temp_location

apache_beam/io/gcp/bigquery_file_loads.py:1130
apache_beam/io/gcp/bigquery_file_loads.py:1130
apache_beam/io/gcp/bigquery_file_loads.py:1130
apache_beam/io/gcp/bigquery_file_loads.py:1130
apache_beam/io/gcp/bigquery_file_loads.py:1130
apache_beam/io/gcp/bigquery_file_loads.py:1130
apache_beam/io/gcp/bigquery_file_loads.py:1130
apache_beam/io/gcp/bigquery_file_loads.py:1130
apache_beam/io/gcp/bigquery_file_loads.py:1130
apache_beam/io/gcp/bigquery_file_loads.py:1130
apache_beam/io/gcp/bigquery_file_loads.py:1130
apache_beam/io/gcp/bigquery_file_loads.py:1130
apache_beam/io/gcp/bigquery_file_loads.py:1130
apache_beam/io/gcp/bigquery_file_loads.py:1130
apache_beam/io/gcp/bigquery_file_loads.py:1130
apache_beam/io/gcp/bigquery_file_loads.py:1130
apache_beam/io/gcp/bigquery_file_loads.py:1130
  <https://ci-beam.apache.org/job/beam_PostCommit_Python36/ws/src/sdks/python/apache_beam/io/gcp/bigquery_file_loads.py>:1130: BeamDeprecationWarning: options is deprecated since First stable release. References to <pipeline>.options will not be supported
    p.options.view_as(GoogleCloudOptions).job_name or 'AUTOMATIC_JOB_NAME')

apache_beam/io/gcp/tests/utils.py:100
  <https://ci-beam.apache.org/job/beam_PostCommit_Python36/ws/src/sdks/python/apache_beam/io/gcp/tests/utils.py>:100: PendingDeprecationWarning: Client.dataset is deprecated and will be removed in a future version. Use a string like 'my_project.my_dataset' or a cloud.google.bigquery.DatasetReference object, instead.
    table_ref = client.dataset(dataset_id).table(table_id)

apache_beam/dataframe/io.py:632
apache_beam/dataframe/io.py:632
apache_beam/dataframe/io.py:632
  <https://ci-beam.apache.org/job/beam_PostCommit_Python36/ws/src/sdks/python/apache_beam/dataframe/io.py>:632: FutureWarning: WriteToFiles is experimental.
    sink=lambda _: _WriteToPandasFileSink(

apache_beam/io/fileio.py:550
apache_beam/io/fileio.py:550
apache_beam/io/fileio.py:550
  <https://ci-beam.apache.org/job/beam_PostCommit_Python36/ws/src/sdks/python/apache_beam/io/fileio.py>:550: BeamDeprecationWarning: options is deprecated since First stable release. References to <pipeline>.options will not be supported
    p.options.view_as(GoogleCloudOptions).temp_location or

apache_beam/io/gcp/bigquery_test.py:1183
  <https://ci-beam.apache.org/job/beam_PostCommit_Python36/ws/src/sdks/python/apache_beam/io/gcp/bigquery_test.py>:1183: BeamDeprecationWarning: options is deprecated since First stable release. References to <pipeline>.options will not be supported
    streaming = self.test_pipeline.options.view_as(StandardOptions).streaming

apache_beam/io/gcp/bigquery_read_it_test.py:167
  <https://ci-beam.apache.org/job/beam_PostCommit_Python36/ws/src/sdks/python/apache_beam/io/gcp/bigquery_read_it_test.py>:167: BeamDeprecationWarning: BigQuerySource is deprecated since 2.25.0. Use ReadFromBigQuery instead.
    beam.io.BigQuerySource(query=self.query, use_standard_sql=True)))

apache_beam/io/gcp/big_query_query_to_table_pipeline.py:84
apache_beam/io/gcp/big_query_query_to_table_pipeline.py:84
  <https://ci-beam.apache.org/job/beam_PostCommit_Python36/ws/src/sdks/python/apache_beam/io/gcp/big_query_query_to_table_pipeline.py>:84: BeamDeprecationWarning: BigQuerySource is deprecated since 2.25.0. Use ReadFromBigQuery instead.
    kms_key=kms_key))

apache_beam/runners/dataflow/ptransform_overrides.py:323
apache_beam/runners/dataflow/ptransform_overrides.py:323
  <https://ci-beam.apache.org/job/beam_PostCommit_Python36/ws/src/sdks/python/apache_beam/runners/dataflow/ptransform_overrides.py>:323: BeamDeprecationWarning: BigQuerySink is deprecated since 2.11.0. Use WriteToBigQuery instead.
    kms_key=self.kms_key))

apache_beam/io/gcp/bigquery_read_it_test.py:556
  <https://ci-beam.apache.org/job/beam_PostCommit_Python36/ws/src/sdks/python/apache_beam/io/gcp/bigquery_read_it_test.py>:556: BeamDeprecationWarning: BigQuerySource is deprecated since 2.25.0. Use ReadFromBigQuery instead.
    beam.io.BigQuerySource(query=self.query, use_standard_sql=True)))

apache_beam/io/gcp/bigquery_read_it_test.py:670
  <https://ci-beam.apache.org/job/beam_PostCommit_Python36/ws/src/sdks/python/apache_beam/io/gcp/bigquery_read_it_test.py>:670: FutureWarning: ReadAllFromBigQuery is experimental.
    | beam.io.ReadAllFromBigQuery())

apache_beam/io/gcp/bigquery.py:2617
  <https://ci-beam.apache.org/job/beam_PostCommit_Python36/ws/src/sdks/python/apache_beam/io/gcp/bigquery.py>:2617: BeamDeprecationWarning: options is deprecated since First stable release. References to <pipeline>.options will not be supported
    job_name = pcoll.pipeline.options.view_as(GoogleCloudOptions).job_name

apache_beam/io/gcp/bigquery.py:2618
  <https://ci-beam.apache.org/job/beam_PostCommit_Python36/ws/src/sdks/python/apache_beam/io/gcp/bigquery.py>:2618: BeamDeprecationWarning: options is deprecated since First stable release. References to <pipeline>.options will not be supported
    project = pcoll.pipeline.options.view_as(GoogleCloudOptions).project

apache_beam/io/gcp/bigquery.py:2631
  <https://ci-beam.apache.org/job/beam_PostCommit_Python36/ws/src/sdks/python/apache_beam/io/gcp/bigquery.py>:2631: BeamDeprecationWarning: options is deprecated since First stable release. References to <pipeline>.options will not be supported
    options=pcoll.pipeline.options,

apache_beam/ml/gcp/cloud_dlp_it_test.py:77
  <https://ci-beam.apache.org/job/beam_PostCommit_Python36/ws/src/sdks/python/apache_beam/ml/gcp/cloud_dlp_it_test.py>:77: FutureWarning: MaskDetectedDetails is experimental.
    inspection_config=INSPECT_CONFIG))

apache_beam/ml/gcp/cloud_dlp_it_test.py:87
  <https://ci-beam.apache.org/job/beam_PostCommit_Python36/ws/src/sdks/python/apache_beam/ml/gcp/cloud_dlp_it_test.py>:87: FutureWarning: InspectForDetails is experimental.
    | beam.ParDo(extract_inspection_results).with_outputs(

-- Docs: https://docs.pytest.org/en/latest/warnings.html
- generated xml file: <https://ci-beam.apache.org/job/beam_PostCommit_Python36/ws/src/sdks/python/pytest_postCommitIT-df-py36.xml> -
======= 1 failed, 60 passed, 8 skipped, 175 warnings in 5423.90 seconds ========

> Task :sdks:python:test-suites:dataflow:py36:postCommitIT FAILED

FAILURE: Build failed with an exception.

* Where:
Script '<https://ci-beam.apache.org/job/beam_PostCommit_Python36/ws/src/sdks/python/test-suites/dataflow/common.gradle'> line: 121

* What went wrong:
Execution failed for task ':sdks:python:test-suites:dataflow:py36:postCommitIT'.
> Process 'command 'sh'' finished with non-zero exit value 1

* Try:
> Run with --stacktrace option to get the stack trace.
> Run with --info or --debug option to get more log output.
> Run with --scan to get full insights.

* Get more help at https://help.gradle.org

Deprecated Gradle features were used in this build, making it incompatible with Gradle 8.0.

You can use '--warning-mode all' to show the individual deprecation warnings and determine if they come from your own scripts or plugins.

See https://docs.gradle.org/7.4/userguide/command_line_interface.html#sec:command_line_warnings

Execution optimizations have been disabled for 1 invalid unit(s) of work during this build to ensure correctness.
Please consult deprecation warnings for more details.

BUILD FAILED in 1h 33m 7s
218 actionable tasks: 171 executed, 41 from cache, 6 up-to-date

Publishing build scan...
https://gradle.com/s/nokgl6ufimfe2

Build step 'Invoke Gradle script' changed build result to FAILURE
Build step 'Invoke Gradle script' marked build as failure

---------------------------------------------------------------------
To unsubscribe, e-mail: builds-unsubscribe@beam.apache.org
For additional commands, e-mail: builds-help@beam.apache.org