You are viewing a plain text version of this content. The canonical link for it is here.
Posted to builds@mesos.apache.org by Apache Jenkins Server <je...@builds.apache.org> on 2017/03/10 01:06:20 UTC
Build failed in Jenkins: Mesos-Buildbot » autotools,gcc,--verbose,GLOG_v=1 MESOS_VERBOSE=1,ubuntu:14.04,(docker||Hadoop)&&(!ubuntu-us1)&&(!ubuntu-eu2) #3355
See <https://builds.apache.org/job/Mesos-Buildbot/BUILDTOOL=autotools,COMPILER=gcc,CONFIGURATION=--verbose,ENVIRONMENT=GLOG_v=1%20MESOS_VERBOSE=1,OS=ubuntu%3A14.04,label_exp=(docker%7C%7CHadoop)&&(!ubuntu-us1)&&(!ubuntu-eu2)/3355/display/redirect?page=changes>
Changes:
[yujie.jay] Removed redundant 'root' user set in containerizer::launch().
[yujie.jay] Fixed command task with container image 'root' user issue.
[yujie.jay] Added unit test for verifying user in command task with image specified.
[yujie.jay] Added placeholder in CHANGELOG for 1.2.1.
[yujie.jay] Added MESOS-7208 to 1.2.1 CHANGELOG.
------------------------------------------
[...truncated 25.67 MB...]
I0310 01:04:31.632490 30481 status_update_manager.cpp:203] Recovering status update manager
I0310 01:04:31.632733 30492 containerizer.cpp:600] Recovering containerizer
I0310 01:04:31.634565 30494 provisioner.cpp:410] Provisioner recovery complete
I0310 01:04:31.634990 30480 slave.cpp:5550] Finished recovery
I0310 01:04:31.635844 30480 slave.cpp:5724] Querying resource estimator for oversubscribable resources
I0310 01:04:31.636158 30485 slave.cpp:5738] Received oversubscribable resources {} from the resource estimator
I0310 01:04:31.638917 30485 process.cpp:3704] Handling HTTP event for process 'slave(696)' with path: '/slave(696)/monitor/statistics.json'
I0310 01:04:31.640410 30491 http.cpp:871] Authorizing principal 'test-principal' to GET the '/monitor/statistics.json' endpoint
I0310 01:04:31.646695 30485 slave.cpp:803] Agent terminating
[ OK ] Endpoint/SlaveEndpointTest.AuthorizedRequest/1 (34 ms)
[ RUN ] Endpoint/SlaveEndpointTest.AuthorizedRequest/2
I0310 01:04:31.658023 30461 containerizer.cpp:221] Using isolation: posix/cpu,posix/mem,filesystem/posix,network/cni
W0310 01:04:31.658622 30461 backend.cpp:76] Failed to create 'aufs' backend: AufsBackend requires root privileges
W0310 01:04:31.658740 30461 backend.cpp:76] Failed to create 'bind' backend: BindBackend requires root privileges
I0310 01:04:31.658782 30461 provisioner.cpp:249] Using default backend 'copy'
I0310 01:04:31.662741 30494 slave.cpp:211] Mesos agent started on (697)@172.17.0.2:55954
I0310 01:04:31.662773 30494 slave.cpp:212] Flags at startup: --acls="" --appc_simple_discovery_uri_prefix="http://" --appc_store_dir="/tmp/mesos/store/appc" --authenticate_http_readonly="true" --authenticate_http_readwrite="true" --authenticatee="crammd5" --authentication_backoff_factor="1secs" --authorizer="local" --cgroups_cpu_enable_pids_and_tids_count="false" --cgroups_enable_cfs="false" --cgroups_hierarchy="/sys/fs/cgroup" --cgroups_limit_swap="false" --cgroups_root="mesos" --container_disk_watch_interval="15secs" --containerizers="mesos" --credential="/tmp/Endpoint_SlaveEndpointTest_AuthorizedRequest_2_sbmzgS/credential" --default_role="*" --disk_watch_interval="1mins" --docker="docker" --docker_kill_orphans="true" --docker_registry="https://registry-1.docker.io" --docker_remove_delay="6hrs" --docker_socket="/var/run/docker.sock" --docker_stop_timeout="0ns" --docker_store_dir="/tmp/mesos/store/docker" --docker_volume_checkpoint_dir="/var/run/mesos/isolators/docker/volume" --enforce_container_disk_quota="false" --executor_registration_timeout="1mins" --executor_shutdown_grace_period="5secs" --fetcher_cache_dir="/tmp/Endpoint_SlaveEndpointTest_AuthorizedRequest_2_sbmzgS/fetch" --fetcher_cache_size="2GB" --frameworks_home="" --gc_delay="1weeks" --gc_disk_headroom="0.1" --hadoop_home="" --help="false" --hostname_lookup="true" --http_authenticators="basic" --http_command_executor="false" --http_credentials="/tmp/Endpoint_SlaveEndpointTest_AuthorizedRequest_2_sbmzgS/http_credentials" --http_heartbeat_interval="30secs" --initialize_driver_logging="true" --isolation="posix/cpu,posix/mem" --launcher="posix" --launcher_dir="/mesos/mesos-1.2.1/_build/src" --logbufsecs="0" --logging_level="INFO" --max_completed_executors_per_framework="150" --oversubscribed_resources_interval="15secs" --perf_duration="10secs" --perf_interval="1mins" --qos_correction_interval_min="0ns" --quiet="false" --recover="reconnect" --recovery_timeout="15mins" --registration_backoff_factor="10ms" --resources="cpus:2;gpus:0;mem:1024;disk:1024;ports:[31000-32000]" --revocable_cpu_low_priority="true" --runtime_dir="/tmp/Endpoint_SlaveEndpointTest_AuthorizedRequest_2_sbmzgS" --sandbox_directory="/mnt/mesos/sandbox" --strict="true" --switch_user="true" --systemd_enable_support="true" --systemd_runtime_directory="/run/systemd/system" --version="false" --work_dir="/tmp/Endpoint_SlaveEndpointTest_AuthorizedRequest_2_1KJVPu"
I0310 01:04:31.663429 30494 credentials.hpp:86] Loading credential for authentication from '/tmp/Endpoint_SlaveEndpointTest_AuthorizedRequest_2_sbmzgS/credential'
I0310 01:04:31.663597 30494 slave.cpp:354] Agent using credential for: test-principal
I0310 01:04:31.663624 30494 credentials.hpp:37] Loading credentials for authentication from '/tmp/Endpoint_SlaveEndpointTest_AuthorizedRequest_2_sbmzgS/http_credentials'
I0310 01:04:31.663883 30494 http.cpp:919] Using default 'basic' HTTP authenticator for realm 'mesos-agent-readonly'
I0310 01:04:31.664026 30494 http.cpp:919] Using default 'basic' HTTP authenticator for realm 'mesos-agent-readwrite'
I0310 01:04:31.665887 30494 slave.cpp:541] Agent resources: cpus(*):2; mem(*):1024; disk(*):1024; ports(*):[31000-32000]
I0310 01:04:31.665992 30494 slave.cpp:549] Agent attributes: [ ]
I0310 01:04:31.666007 30494 slave.cpp:554] Agent hostname: d230249975ec
I0310 01:04:31.666215 30481 status_update_manager.cpp:177] Pausing sending status updates
I0310 01:04:31.667515 30491 state.cpp:62] Recovering state from '/tmp/Endpoint_SlaveEndpointTest_AuthorizedRequest_2_1KJVPu/meta'
I0310 01:04:31.668123 30493 status_update_manager.cpp:203] Recovering status update manager
I0310 01:04:31.668639 30485 containerizer.cpp:600] Recovering containerizer
I0310 01:04:31.670286 30487 provisioner.cpp:410] Provisioner recovery complete
I0310 01:04:31.670804 30489 slave.cpp:5550] Finished recovery
I0310 01:04:31.671530 30489 slave.cpp:5724] Querying resource estimator for oversubscribable resources
I0310 01:04:31.672006 30481 slave.cpp:5738] Received oversubscribable resources {} from the resource estimator
I0310 01:04:31.674625 30495 process.cpp:3704] Handling HTTP event for process 'slave(697)' with path: '/slave(697)/containers'
I0310 01:04:31.676116 30483 http.cpp:871] Authorizing principal 'test-principal' to GET the '/containers' endpoint
I0310 01:04:31.680848 30482 slave.cpp:803] Agent terminating
[ OK ] Endpoint/SlaveEndpointTest.AuthorizedRequest/2 (34 ms)
[ RUN ] Endpoint/SlaveEndpointTest.UnauthorizedRequest/0
I0310 01:04:31.691997 30461 containerizer.cpp:221] Using isolation: posix/cpu,posix/mem,filesystem/posix,network/cni
W0310 01:04:31.692569 30461 backend.cpp:76] Failed to create 'aufs' backend: AufsBackend requires root privileges
W0310 01:04:31.692679 30461 backend.cpp:76] Failed to create 'bind' backend: BindBackend requires root privileges
I0310 01:04:31.692718 30461 provisioner.cpp:249] Using default backend 'copy'
I0310 01:04:31.696331 30480 slave.cpp:211] Mesos agent started on (698)@172.17.0.2:55954
I0310 01:04:31.696401 30480 slave.cpp:212] Flags at startup: --acls="" --appc_simple_discovery_uri_prefix="http://" --appc_store_dir="/tmp/mesos/store/appc" --authenticate_http_readonly="true" --authenticate_http_readwrite="true" --authenticatee="crammd5" --authentication_backoff_factor="1secs" --authorizer="local" --cgroups_cpu_enable_pids_and_tids_count="false" --cgroups_enable_cfs="false" --cgroups_hierarchy="/sys/fs/cgroup" --cgroups_limit_swap="false" --cgroups_root="mesos" --container_disk_watch_interval="15secs" --containerizers="mesos" --credential="/tmp/Endpoint_SlaveEndpointTest_UnauthorizedRequest_0_UsSUho/credential" --default_role="*" --disk_watch_interval="1mins" --docker="docker" --docker_kill_orphans="true" --docker_registry="https://registry-1.docker.io" --docker_remove_delay="6hrs" --docker_socket="/var/run/docker.sock" --docker_stop_timeout="0ns" --docker_store_dir="/tmp/mesos/store/docker" --docker_volume_checkpoint_dir="/var/run/mesos/isolators/docker/volume" --enforce_container_disk_quota="false" --executor_registration_timeout="1mins" --executor_shutdown_grace_period="5secs" --fetcher_cache_dir="/tmp/Endpoint_SlaveEndpointTest_UnauthorizedRequest_0_UsSUho/fetch" --fetcher_cache_size="2GB" --frameworks_home="" --gc_delay="1weeks" --gc_disk_headroom="0.1" --hadoop_home="" --help="false" --hostname_lookup="true" --http_authenticators="basic" --http_command_executor="false" --http_credentials="/tmp/Endpoint_SlaveEndpointTest_UnauthorizedRequest_0_UsSUho/http_credentials" --http_heartbeat_interval="30secs" --initialize_driver_logging="true" --isolation="posix/cpu,posix/mem" --launcher="posix" --launcher_dir="/mesos/mesos-1.2.1/_build/src" --logbufsecs="0" --logging_level="INFO" --max_completed_executors_per_framework="150" --oversubscribed_resources_interval="15secs" --perf_duration="10secs" --perf_interval="1mins" --qos_correction_interval_min="0ns" --quiet="false" --recover="reconnect" --recovery_timeout="15mins" --registration_backoff_factor="10ms" --resources="cpus:2;gpus:0;mem:1024;disk:1024;ports:[31000-32000]" --revocable_cpu_low_priority="true" --runtime_dir="/tmp/Endpoint_SlaveEndpointTest_UnauthorizedRequest_0_UsSUho" --sandbox_directory="/mnt/mesos/sandbox" --strict="true" --switch_user="true" --systemd_enable_support="true" --systemd_runtime_directory="/run/systemd/system" --version="false" --work_dir="/tmp/Endpoint_SlaveEndpointTest_UnauthorizedRequest_0_XIfLL0"
I0310 01:04:31.697376 30480 credentials.hpp:86] Loading credential for authentication from '/tmp/Endpoint_SlaveEndpointTest_UnauthorizedRequest_0_UsSUho/credential'
I0310 01:04:31.697593 30480 slave.cpp:354] Agent using credential for: test-principal
I0310 01:04:31.697628 30480 credentials.hpp:37] Loading credentials for authentication from '/tmp/Endpoint_SlaveEndpointTest_UnauthorizedRequest_0_UsSUho/http_credentials'
I0310 01:04:31.698004 30480 http.cpp:919] Using default 'basic' HTTP authenticator for realm 'mesos-agent-readonly'
I0310 01:04:31.698228 30480 http.cpp:919] Using default 'basic' HTTP authenticator for realm 'mesos-agent-readwrite'
I0310 01:04:31.699934 30480 slave.cpp:541] Agent resources: cpus(*):2; mem(*):1024; disk(*):1024; ports(*):[31000-32000]
I0310 01:04:31.700038 30480 slave.cpp:549] Agent attributes: [ ]
I0310 01:04:31.700052 30480 slave.cpp:554] Agent hostname: d230249975ec
I0310 01:04:31.700255 30486 status_update_manager.cpp:177] Pausing sending status updates
I0310 01:04:31.701727 30483 state.cpp:62] Recovering state from '/tmp/Endpoint_SlaveEndpointTest_UnauthorizedRequest_0_XIfLL0/meta'
I0310 01:04:31.702133 30480 status_update_manager.cpp:203] Recovering status update manager
I0310 01:04:31.702674 30490 containerizer.cpp:600] Recovering containerizer
I0310 01:04:31.704265 30491 provisioner.cpp:410] Provisioner recovery complete
I0310 01:04:31.704769 30484 slave.cpp:5550] Finished recovery
I0310 01:04:31.705344 30484 slave.cpp:5724] Querying resource estimator for oversubscribable resources
I0310 01:04:31.705752 30488 slave.cpp:5738] Received oversubscribable resources {} from the resource estimator
I0310 01:04:31.708389 30482 process.cpp:3704] Handling HTTP event for process 'slave(698)' with path: '/slave(698)/monitor/statistics'
I0310 01:04:31.709882 30483 http.cpp:871] Authorizing principal 'test-principal' to GET the '/monitor/statistics' endpoint
I0310 01:04:31.712723 30490 slave.cpp:803] Agent terminating
[ OK ] Endpoint/SlaveEndpointTest.UnauthorizedRequest/0 (33 ms)
[ RUN ] Endpoint/SlaveEndpointTest.UnauthorizedRequest/1
I0310 01:04:31.725059 30461 containerizer.cpp:221] Using isolation: posix/cpu,posix/mem,filesystem/posix,network/cni
W0310 01:04:31.725630 30461 backend.cpp:76] Failed to create 'aufs' backend: AufsBackend requires root privileges
W0310 01:04:31.725742 30461 backend.cpp:76] Failed to create 'bind' backend: BindBackend requires root privileges
I0310 01:04:31.725783 30461 provisioner.cpp:249] Using default backend 'copy'
I0310 01:04:31.729130 30481 slave.cpp:211] Mesos agent started on (699)@172.17.0.2:55954
I0310 01:04:31.729166 30481 slave.cpp:212] Flags at startup: --acls="" --appc_simple_discovery_uri_prefix="http://" --appc_store_dir="/tmp/mesos/store/appc" --authenticate_http_readonly="true" --authenticate_http_readwrite="true" --authenticatee="crammd5" --authentication_backoff_factor="1secs" --authorizer="local" --cgroups_cpu_enable_pids_and_tids_count="false" --cgroups_enable_cfs="false" --cgroups_hierarchy="/sys/fs/cgroup" --cgroups_limit_swap="false" --cgroups_root="mesos" --container_disk_watch_interval="15secs" --containerizers="mesos" --credential="/tmp/Endpoint_SlaveEndpointTest_UnauthorizedRequest_1_OqzTEU/credential" --default_role="*" --disk_watch_interval="1mins" --docker="docker" --docker_kill_orphans="true" --docker_registry="https://registry-1.docker.io" --docker_remove_delay="6hrs" --docker_socket="/var/run/docker.sock" --docker_stop_timeout="0ns" --docker_store_dir="/tmp/mesos/store/docker" --docker_volume_checkpoint_dir="/var/run/mesos/isolators/docker/volume" --enforce_container_disk_quota="false" --executor_registration_timeout="1mins" --executor_shutdown_grace_period="5secs" --fetcher_cache_dir="/tmp/Endpoint_SlaveEndpointTest_UnauthorizedRequest_1_OqzTEU/fetch" --fetcher_cache_size="2GB" --frameworks_home="" --gc_delay="1weeks" --gc_disk_headroom="0.1" --hadoop_home="" --help="false" --hostname_lookup="true" --http_authenticators="basic" --http_command_executor="false" --http_credentials="/tmp/Endpoint_SlaveEndpointTest_UnauthorizedRequest_1_OqzTEU/http_credentials" --http_heartbeat_interval="30secs" --initialize_driver_logging="true" --isolation="posix/cpu,posix/mem" --launcher="posix" --launcher_dir="/mesos/mesos-1.2.1/_build/src" --logbufsecs="0" --logging_level="INFO" --max_completed_executors_per_framework="150" --oversubscribed_resources_interval="15secs" --perf_duration="10secs" --perf_interval="1mins" --qos_correction_interval_min="0ns" --quiet="false" --recover="reconnect" --recovery_timeout="15mins" --registration_backoff_factor="10ms" --resources="cpus:2;gpus:0;mem:1024;disk:1024;ports:[31000-32000]" --revocable_cpu_low_priority="true" --runtime_dir="/tmp/Endpoint_SlaveEndpointTest_UnauthorizedRequest_1_OqzTEU" --sandbox_directory="/mnt/mesos/sandbox" --strict="true" --switch_user="true" --systemd_enable_support="true" --systemd_runtime_directory="/run/systemd/system" --version="false" --work_dir="/tmp/Endpoint_SlaveEndpointTest_UnauthorizedRequest_1_558l3w"
I0310 01:04:31.730274 30481 credentials.hpp:86] Loading credential for authentication from '/tmp/Endpoint_SlaveEndpointTest_UnauthorizedRequest_1_OqzTEU/credential'
I0310 01:04:31.730509 30481 slave.cpp:354] Agent using credential for: test-principal
I0310 01:04:31.730543 30481 credentials.hpp:37] Loading credentials for authentication from '/tmp/Endpoint_SlaveEndpointTest_UnauthorizedRequest_1_OqzTEU/http_credentials'
I0310 01:04:31.730944 30481 http.cpp:919] Using default 'basic' HTTP authenticator for realm 'mesos-agent-readonly'
I0310 01:04:31.731122 30481 http.cpp:919] Using default 'basic' HTTP authenticator for realm 'mesos-agent-readwrite'
I0310 01:04:31.732795 30481 slave.cpp:541] Agent resources: cpus(*):2; mem(*):1024; disk(*):1024; ports(*):[31000-32000]
I0310 01:04:31.732902 30481 slave.cpp:549] Agent attributes: [ ]
I0310 01:04:31.732915 30481 slave.cpp:554] Agent hostname: d230249975ec
I0310 01:04:31.733067 30493 status_update_manager.cpp:177] Pausing sending status updates
I0310 01:04:31.734542 30486 state.cpp:62] Recovering state from '/tmp/Endpoint_SlaveEndpointTest_UnauthorizedRequest_1_558l3w/meta'
I0310 01:04:31.735141 30494 status_update_manager.cpp:203] Recovering status update manager
I0310 01:04:31.735448 30491 containerizer.cpp:600] Recovering containerizer
I0310 01:04:31.737200 30493 provisioner.cpp:410] Provisioner recovery complete
I0310 01:04:31.738236 30482 slave.cpp:5550] Finished recovery
I0310 01:04:31.738874 30482 slave.cpp:5724] Querying resource estimator for oversubscribable resources
I0310 01:04:31.739197 30485 slave.cpp:5738] Received oversubscribable resources {} from the resource estimator
I0310 01:04:31.741174 30488 process.cpp:3704] Handling HTTP event for process 'slave(699)' with path: '/slave(699)/monitor/statistics.json'
I0310 01:04:31.742770 30494 http.cpp:871] Authorizing principal 'test-principal' to GET the '/monitor/statistics.json' endpoint
I0310 01:04:31.745607 30487 slave.cpp:803] Agent terminating
[ OK ] Endpoint/SlaveEndpointTest.UnauthorizedRequest/1 (32 ms)
[ RUN ] Endpoint/SlaveEndpointTest.UnauthorizedRequest/2
I0310 01:04:31.757225 30461 containerizer.cpp:221] Using isolation: posix/cpu,posix/mem,filesystem/posix,network/cni
W0310 01:04:31.757800 30461 backend.cpp:76] Failed to create 'aufs' backend: AufsBackend requires root privileges
W0310 01:04:31.757916 30461 backend.cpp:76] Failed to create 'bind' backend: BindBackend requires root privileges
I0310 01:04:31.757956 30461 provisioner.cpp:249] Using default backend 'copy'
I0310 01:04:31.760987 30490 slave.cpp:211] Mesos agent started on (700)@172.17.0.2:55954
I0310 01:04:31.761009 30490 slave.cpp:212] Flags at startup: --acls="" --appc_simple_discovery_uri_prefix="http://" --appc_store_dir="/tmp/mesos/store/appc" --authenticate_http_readonly="true" --authenticate_http_readwrite="true" --authenticatee="crammd5" --authentication_backoff_factor="1secs" --authorizer="local" --cgroups_cpu_enable_pids_and_tids_count="false" --cgroups_enable_cfs="false" --cgroups_hierarchy="/sys/fs/cgroup" --cgroups_limit_swap="false" --cgroups_root="mesos" --container_disk_watch_interval="15secs" --containerizers="mesos" --credential="/tmp/Endpoint_SlaveEndpointTest_UnauthorizedRequest_2_Ex5Xmr/credential" --default_role="*" --disk_watch_interval="1mins" --docker="docker" --docker_kill_orphans="true" --docker_registry="https://registry-1.docker.io" --docker_remove_delay="6hrs" --docker_socket="/var/run/docker.sock" --docker_stop_timeout="0ns" --docker_store_dir="/tmp/mesos/store/docker" --docker_volume_checkpoint_dir="/var/run/mesos/isolators/docker/volume" --enforce_container_disk_quota="false" --executor_registration_timeout="1mins" --executor_shutdown_grace_period="5secs" --fetcher_cache_dir="/tmp/Endpoint_SlaveEndpointTest_UnauthorizedRequest_2_Ex5Xmr/fetch" --fetcher_cache_size="2GB" --frameworks_home="" --gc_delay="1weeks" --gc_disk_headroom="0.1" --hadoop_home="" --help="false" --hostname_lookup="true" --http_authenticators="basic" --http_command_executor="false" --http_credentials="/tmp/Endpoint_SlaveEndpointTest_UnauthorizedRequest_2_Ex5Xmr/http_credentials" --http_heartbeat_interval="30secs" --initialize_driver_logging="true" --isolation="posix/cpu,posix/mem" --launcher="posix" --launcher_dir="/mesos/mesos-1.2.1/_build/src" --logbufsecs="0" --logging_level="INFO" --max_completed_executors_per_framework="150" --oversubscribed_resources_interval="15secs" --perf_duration="10secs" --perf_interval="1mins" --qos_correction_interval_min="0ns" --quiet="false" --recover="reconnect" --recovery_timeout="15mins" --registration_backoff_factor="10ms" --resources="cpus:2;gpus:0;mem:1024;disk:1024;ports:[31000-32000]" --revocable_cpu_low_priority="true" --runtime_dir="/tmp/Endpoint_SlaveEndpointTest_UnauthorizedRequest_2_Ex5Xmr" --sandbox_directory="/mnt/mesos/sandbox" --strict="true" --switch_user="true" --systemd_enable_support="true" --systemd_runtime_directory="/run/systemd/system" --version="false" --work_dir="/tmp/Endpoint_SlaveEndpointTest_UnauthorizedRequest_2_Nn6cG3"
I0310 01:04:31.761477 30490 credentials.hpp:86] Loading credential for authentication from '/tmp/Endpoint_SlaveEndpointTest_UnauthorizedRequest_2_Ex5Xmr/credential'
I0310 01:04:31.761606 30490 slave.cpp:354] Agent using credential for: test-principal
I0310 01:04:31.761626 30490 credentials.hpp:37] Loading credentials for authentication from '/tmp/Endpoint_SlaveEndpointTest_UnauthorizedRequest_2_Ex5Xmr/http_credentials'
I0310 01:04:31.761837 30490 http.cpp:919] Using default 'basic' HTTP authenticator for realm 'mesos-agent-readonly'
I0310 01:04:31.761958 30490 http.cpp:919] Using default 'basic' HTTP authenticator for realm 'mesos-agent-readwrite'
I0310 01:04:31.763180 30490 slave.cpp:541] Agent resources: cpus(*):2; mem(*):1024; disk(*):1024; ports(*):[31000-32000]
I0310 01:04:31.763284 30490 slave.cpp:549] Agent attributes: [ ]
I0310 01:04:31.763298 30490 slave.cpp:554] Agent hostname: d230249975ec
I0310 01:04:31.763496 30482 status_update_manager.cpp:177] Pausing sending status updates
I0310 01:04:31.764806 30481 state.cpp:62] Recovering state from '/tmp/Endpoint_SlaveEndpointTest_UnauthorizedRequest_2_Nn6cG3/meta'
I0310 01:04:31.765115 30486 status_update_manager.cpp:203] Recovering status update manager
I0310 01:04:31.765399 30495 containerizer.cpp:600] Recovering containerizer
I0310 01:04:31.767235 30486 provisioner.cpp:410] Provisioner recovery complete
I0310 01:04:31.767686 30495 slave.cpp:5550] Finished recovery
I0310 01:04:31.768225 30495 slave.cpp:5724] Querying resource estimator for oversubscribable resources
I0310 01:04:31.768692 30485 slave.cpp:5738] Received oversubscribable resources {} from the resource estimator
I0310 01:04:31.771149 30490 process.cpp:3704] Handling HTTP event for process 'slave(700)' with path: '/slave(700)/containers'
I0310 01:04:31.772488 30484 http.cpp:871] Authorizing principal 'test-principal' to GET the '/containers' endpoint
I0310 01:04:31.776065 30493 slave.cpp:803] Agent terminating
[ OK ] Endpoint/SlaveEndpointTest.UnauthorizedRequest/2 (30 ms)
[ RUN ] Endpoint/SlaveEndpointTest.NoAuthorizer/0
I0310 01:04:31.788507 30461 containerizer.cpp:221] Using isolation: posix/cpu,posix/mem,filesystem/posix,network/cni
W0310 01:04:31.789043 30461 backend.cpp:76] Failed to create 'aufs' backend: AufsBackend requires root privileges
W0310 01:04:31.789150 30461 backend.cpp:76] Failed to create 'bind' backend: BindBackend requires root privileges
I0310 01:04:31.789187 30461 provisioner.cpp:249] Using default backend 'copy'
I0310 01:04:31.791189 30461 cluster.cpp:446] Creating default 'local' authorizer
I0310 01:04:31.793220 30484 slave.cpp:211] Mesos agent started on (701)@172.17.0.2:55954
I0310 01:04:31.793247 30484 slave.cpp:212] Flags at startup: --acls="" --appc_simple_discovery_uri_prefix="http://" --appc_store_dir="/tmp/mesos/store/appc" --authenticate_http_readonly="true" --authenticate_http_readwrite="true" --authenticatee="crammd5" --authentication_backoff_factor="1secs" --authorizer="local" --cgroups_cpu_enable_pids_and_tids_count="false" --cgroups_enable_cfs="false" --cgroups_hierarchy="/sys/fs/cgroup" --cgroups_limit_swap="false" --cgroups_root="mesos" --container_disk_watch_interval="15secs" --containerizers="mesos" --credential="/tmp/Endpoint_SlaveEndpointTest_NoAuthorizer_0_FHW1oY/credential" --default_role="*" --disk_watch_interval="1mins" --docker="docker" --docker_kill_orphans="true" --docker_registry="https://registry-1.docker.io" --docker_remove_delay="6hrs" --docker_socket="/var/run/docker.sock" --docker_stop_timeout="0ns" --docker_store_dir="/tmp/mesos/store/docker" --docker_volume_checkpoint_dir="/var/run/mesos/isolators/docker/volume" --enforce_container_disk_quota="false" --executor_registration_timeout="1mins" --executor_shutdown_grace_period="5secs" --fetcher_cache_dir="/tmp/Endpoint_SlaveEndpointTest_NoAuthorizer_0_FHW1oY/fetch" --fetcher_cache_size="2GB" --frameworks_home="" --gc_delay="1weeks" --gc_disk_headroom="0.1" --hadoop_home="" --help="false" --hostname_lookup="true" --http_authenticators="basic" --http_command_executor="false" --http_credentials="/tmp/Endpoint_SlaveEndpointTest_NoAuthorizer_0_FHW1oY/http_credentials" --http_heartbeat_interval="30secs" --initialize_driver_logging="true" --isolation="posix/cpu,posix/mem" --launcher="posix" --launcher_dir="/mesos/mesos-1.2.1/_build/src" --logbufsecs="0" --logging_level="INFO" --max_completed_executors_per_framework="150" --oversubscribed_resources_interval="15secs" --perf_duration="10secs" --perf_interval="1mins" --qos_correction_interval_min="0ns" --quiet="false" --recover="reconnect" --recovery_timeout="15mins" --registration_backoff_factor="10ms" --resources="cpus:2;gpus:0;mem:1024;disk:1024;ports:[31000-32000]" --revocable_cpu_low_priority="true" --runtime_dir="/tmp/Endpoint_SlaveEndpointTest_NoAuthorizer_0_FHW1oY" --sandbox_directory="/mnt/mesos/sandbox" --strict="true" --switch_user="true" --systemd_enable_support="true" --systemd_runtime_directory="/run/systemd/system" --version="false" --work_dir="/tmp/Endpoint_SlaveEndpointTest_NoAuthorizer_0_BysdDA"
I0310 01:04:31.793889 30484 credentials.hpp:86] Loading credential for authentication from '/tmp/Endpoint_SlaveEndpointTest_NoAuthorizer_0_FHW1oY/credential'
I0310 01:04:31.794075 30484 slave.cpp:354] Agent using credential for: test-principal
I0310 01:04:31.794101 30484 credentials.hpp:37] Loading credentials for authentication from '/tmp/Endpoint_SlaveEndpointTest_NoAuthorizer_0_FHW1oY/http_credentials'
I0310 01:04:31.794414 30484 http.cpp:919] Using default 'basic' HTTP authenticator for realm 'mesos-agent-readonly'
I0310 01:04:31.794605 30484 http.cpp:919] Using default 'basic' HTTP authenticator for realm 'mesos-agent-readwrite'
I0310 01:04:31.796411 30484 slave.cpp:541] Agent resources: cpus(*):2; mem(*):1024; disk(*):1024; ports(*):[31000-32000]
I0310 01:04:31.796515 30484 slave.cpp:549] Agent attributes: [ ]
I0310 01:04:31.796530 30484 slave.cpp:554] Agent hostname: d230249975ec
I0310 01:04:31.796710 30494 status_update_manager.cpp:177] Pausing sending status updates
I0310 01:04:31.798144 30495 state.cpp:62] Recovering state from '/tmp/Endpoint_SlaveEndpointTest_NoAuthorizer_0_BysdDA/meta'
I0310 01:04:31.798596 30483 status_update_manager.cpp:203] Recovering status update manager
I0310 01:04:31.799209 30488 containerizer.cpp:600] Recovering containerizer
I0310 01:04:31.800843 30488 provisioner.cpp:410] Provisioner recovery complete
I0310 01:04:31.801321 30494 slave.cpp:5550] Finished recovery
I0310 01:04:31.801812 30494 slave.cpp:5724] Querying resource estimator for oversubscribable resources
I0310 01:04:31.802098 30480 slave.cpp:5738] Received oversubscribable resources {} from the resource estimator
I0310 01:04:31.804774 30484 process.cpp:3704] Handling HTTP event for process 'slave(701)' with path: '/slave(701)/monitor/statistics'
I0310 01:04:31.806299 30494 http.cpp:871] Authorizing principal 'test-principal' to GET the '/monitor/statistics' endpoint
I0310 01:04:31.810752 30492 slave.cpp:803] Agent terminating
[ OK ] Endpoint/SlaveEndpointTest.NoAuthorizer/0 (33 ms)
[ RUN ] Endpoint/SlaveEndpointTest.NoAuthorizer/1
I0310 01:04:31.822321 30461 containerizer.cpp:221] Using isolation: posix/cpu,posix/mem,filesystem/posix,network/cni
W0310 01:04:31.822748 30461 backend.cpp:76] Failed to create 'aufs' backend: AufsBackend requires root privileges
W0310 01:04:31.822836 30461 backend.cpp:76] Failed to create 'bind' backend: BindBackend requires root privileges
I0310 01:04:31.822865 30461 provisioner.cpp:249] Using default backend 'copy'
I0310 01:04:31.824338 30461 cluster.cpp:446] Creating default 'local' authorizer
I0310 01:04:31.826068 30482 slave.cpp:211] Mesos agent started on (702)@172.17.0.2:55954
I0310 01:04:31.826097 30482 slave.cpp:212] Flags at startup: --acls="" --appc_simple_discovery_uri_prefix="http://" --appc_store_dir="/tmp/mesos/store/appc" --authenticate_http_readonly="true" --authenticate_http_readwrite="true" --authenticatee="crammd5" --authentication_backoff_factor="1secs" --authorizer="local" --cgroups_cpu_enable_pids_and_tids_count="false" --cgroups_enable_cfs="false" --cgroups_hierarchy="/sys/fs/cgroup" --cgroups_limit_swap="false" --cgroups_root="mesos" --container_disk_watch_interval="15secs" --containerizers="mesos" --credential="/tmp/Endpoint_SlaveEndpointTest_NoAuthorizer_1_DWtUMv/credential" --default_role="*" --disk_watch_interval="1mins" --docker="docker" --docker_kill_orphans="true" --docker_registry="https://registry-1.docker.io" --docker_remove_delay="6hrs" --docker_socket="/var/run/docker.sock" --docker_stop_timeout="0ns" --docker_store_dir="/tmp/mesos/store/docker" --docker_volume_checkpoint_dir="/var/run/mesos/isolators/docker/volume" --enforce_container_disk_quota="false" --executor_registration_timeout="1mins" --executor_shutdown_grace_period="5secs" --fetcher_cache_dir="/tmp/Endpoint_SlaveEndpointTest_NoAuthorizer_1_DWtUMv/fetch" --fetcher_cache_size="2GB" --frameworks_home="" --gc_delay="1weeks" --gc_disk_headroom="0.1" --hadoop_home="" --help="false" --hostname_lookup="true" --http_authenticators="basic" --http_command_executor="false" --http_credentials="/tmp/Endpoint_SlaveEndpointTest_NoAuthorizer_1_DWtUMv/http_credentials" --http_heartbeat_interval="30secs" --initialize_driver_logging="true" --isolation="posix/cpu,posix/mem" --launcher="posix" --launcher_dir="/mesos/mesos-1.2.1/_build/src" --logbufsecs="0" --logging_level="INFO" --max_completed_executors_per_framework="150" --oversubscribed_resources_interval="15secs" --perf_duration="10secs" --perf_interval="1mins" --qos_correction_interval_min="0ns" --quiet="false" --recover="reconnect" --recovery_timeout="15mins" --registration_backoff_factor="10ms" --resources="cpus:2;gpus:0;mem:1024;disk:1024;ports:[31000-32000]" --revocable_cpu_low_priority="true" --runtime_dir="/tmp/Endpoint_SlaveEndpointTest_NoAuthorizer_1_DWtUMv" --sandbox_directory="/mnt/mesos/sandbox" --strict="true" --switch_user="true" --systemd_enable_support="true" --systemd_runtime_directory="/run/systemd/system" --version="false" --work_dir="/tmp/Endpoint_SlaveEndpointTest_NoAuthorizer_1_8emDV7"
I0310 01:04:31.826803 30482 credentials.hpp:86] Loading credential for authentication from '/tmp/Endpoint_SlaveEndpointTest_NoAuthorizer_1_DWtUMv/credential'
I0310 01:04:31.826979 30482 slave.cpp:354] Agent using credential for: test-principal
I0310 01:04:31.827006 30482 credentials.hpp:37] Loading credentials for authentication from '/tmp/Endpoint_SlaveEndpointTest_NoAuthorizer_1_DWtUMv/http_credentials'
I0310 01:04:31.827280 30482 http.cpp:919] Using default 'basic' HTTP authenticator for realm 'mesos-agent-readonly'
I0310 01:04:31.827497 30482 http.cpp:919] Using default 'basic' HTTP authenticator for realm 'mesos-agent-readwrite'
I0310 01:04:31.829468 30482 slave.cpp:541] Agent resources: cpus(*):2; mem(*):1024; disk(*):1024; ports(*):[31000-32000]
I0310 01:04:31.829572 30482 slave.cpp:549] Agent attributes: [ ]
I0310 01:04:31.829586 30482 slave.cpp:554] Agent hostname: d230249975ec
I0310 01:04:31.829802 30480 status_update_manager.cpp:177] Pausing sending status updates
I0310 01:04:31.830873 30481 state.cpp:62] Recovering state from '/tmp/Endpoint_SlaveEndpointTest_NoAuthorizer_1_8emDV7/meta'
I0310 01:04:31.831466 30491 status_update_manager.cpp:203] Recovering status update manager
I0310 01:04:31.831807 30483 containerizer.cpp:600] Recovering containerizer
I0310 01:04:31.833902 30491 provisioner.cpp:410] Provisioner recovery complete
I0310 01:04:31.834434 30484 slave.cpp:5550] Finished recovery
I0310 01:04:31.834975 30484 slave.cpp:5724] Querying resource estimator for oversubscribable resources
I0310 01:04:31.835279 30494 slave.cpp:5738] Received oversubscribable resources {} from the resource estimator
I0310 01:04:31.837780 30484 process.cpp:3704] Handling HTTP event for process 'slave(702)' with path: '/slave(702)/monitor/statistics.json'
I0310 01:04:31.839229 30492 http.cpp:871] Authorizing principal 'test-principal' to GET the '/monitor/statistics.json' endpoint
I0310 01:04:31.843255 30495 slave.cpp:803] Agent terminating
[ OK ] Endpoint/SlaveEndpointTest.NoAuthorizer/1 (32 ms)
[ RUN ] Endpoint/SlaveEndpointTest.NoAuthorizer/2
I0310 01:04:31.855053 30461 containerizer.cpp:221] Using isolation: posix/cpu,posix/mem,filesystem/posix,network/cni
W0310 01:04:31.855639 30461 backend.cpp:76] Failed to create 'aufs' backend: AufsBackend requires root privileges
W0310 01:04:31.855756 30461 backend.cpp:76] Failed to create 'bind' backend: BindBackend requires root privileges
I0310 01:04:31.855803 30461 provisioner.cpp:249] Using default backend 'copy'
I0310 01:04:31.857693 30461 cluster.cpp:446] Creating default 'local' authorizer
I0310 01:04:31.859441 30494 slave.cpp:211] Mesos agent started on (703)@172.17.0.2:55954
I0310 01:04:31.859472 30494 slave.cpp:212] Flags at startup: --acls="" --appc_simple_discovery_uri_prefix="http://" --appc_store_dir="/tmp/mesos/store/appc" --authenticate_http_readonly="true" --authenticate_http_readwrite="true" --authenticatee="crammd5" --authentication_backoff_factor="1secs" --authorizer="local" --cgroups_cpu_enable_pids_and_tids_count="false" --cgroups_enable_cfs="false" --cgroups_hierarchy="/sys/fs/cgroup" --cgroups_limit_swap="false" --cgroups_root="mesos" --container_disk_watch_interval="15secs" --containerizers="mesos" --credential="/tmp/Endpoint_SlaveEndpointTest_NoAuthorizer_2_hsi7v3/credential" --default_role="*" --disk_watch_interval="1mins" --docker="docker" --docker_kill_orphans="true" --docker_registry="https://registry-1.docker.io" --docker_remove_delay="6hrs" --docker_socket="/var/run/docker.sock" --docker_stop_timeout="0ns" --docker_store_dir="/tmp/mesos/store/docker" --docker_volume_checkpoint_dir="/var/run/mesos/isolators/docker/volume" --enforce_container_disk_quota="false" --executor_registration_timeout="1mins" --executor_shutdown_grace_period="5secs" --fetcher_cache_dir="/tmp/Endpoint_SlaveEndpointTest_NoAuthorizer_2_hsi7v3/fetch" --fetcher_cache_size="2GB" --frameworks_home="" --gc_delay="1weeks" --gc_disk_headroom="0.1" --hadoop_home="" --help="false" --hostname_lookup="true" --http_authenticators="basic" --http_command_executor="false" --http_credentials="/tmp/Endpoint_SlaveEndpointTest_NoAuthorizer_2_hsi7v3/http_credentials" --http_heartbeat_interval="30secs" --initialize_driver_logging="true" --isolation="posix/cpu,posix/mem" --launcher="posix" --launcher_dir="/mesos/mesos-1.2.1/_build/src" --logbufsecs="0" --logging_level="INFO" --max_completed_executors_per_framework="150" --oversubscribed_resources_interval="15secs" --perf_duration="10secs" --perf_interval="1mins" --qos_correction_interval_min="0ns" --quiet="false" --recover="reconnect" --recovery_timeout="15mins" --registration_backoff_factor="10ms" --resources="cpus:2;gpus:0;mem:1024;disk:1024;ports:[31000-32000]" --revocable_cpu_low_priority="true" --runtime_dir="/tmp/Endpoint_SlaveEndpointTest_NoAuthorizer_2_hsi7v3" --sandbox_directory="/mnt/mesos/sandbox" --strict="true" --switch_user="true" --systemd_enable_support="true" --systemd_runtime_directory="/run/systemd/system" --version="false" --work_dir="/tmp/Endpoint_SlaveEndpointTest_NoAuthorizer_2_wCnwzF"
I0310 01:04:31.860157 30494 credentials.hpp:86] Loading credential for authentication from '/tmp/Endpoint_SlaveEndpointTest_NoAuthorizer_2_hsi7v3/credential'
I0310 01:04:31.860332 30494 slave.cpp:354] Agent using credential for: test-principal
I0310 01:04:31.860359 30494 credentials.hpp:37] Loading credentials for authentication from '/tmp/Endpoint_SlaveEndpointTest_NoAuthorizer_2_hsi7v3/http_credentials'
I0310 01:04:31.860647 30494 http.cpp:919] Using default 'basic' HTTP authenticator for realm 'mesos-agent-readonly'
I0310 01:04:31.860792 30494 http.cpp:919] Using default 'basic' HTTP authenticator for realm 'mesos-agent-readwrite'
I0310 01:04:31.862649 30494 slave.cpp:541] Agent resources: cpus(*):2; mem(*):1024; disk(*):1024; ports(*):[31000-32000]
I0310 01:04:31.862756 30494 slave.cpp:549] Agent attributes: [ ]
I0310 01:04:31.862771 30494 slave.cpp:554] Agent hostname: d230249975ec
I0310 01:04:31.862962 30480 status_update_manager.cpp:177] Pausing sending status updates
I0310 01:04:31.864336 30489 state.cpp:62] Recovering state from '/tmp/Endpoint_SlaveEndpointTest_NoAuthorizer_2_wCnwzF/meta'
I0310 01:04:31.864913 30493 status_update_manager.cpp:203] Recovering status update manager
I0310 01:04:31.865167 30484 containerizer.cpp:600] Recovering containerizer
I0310 01:04:31.866966 30493 provisioner.cpp:410] Provisioner recovery complete
I0310 01:04:31.867487 30487 slave.cpp:5550] Finished recovery
I0310 01:04:31.867995 30487 slave.cpp:5724] Querying resource estimator for oversubscribable resources
I0310 01:04:31.868279 30495 slave.cpp:5738] Received oversubscribable resources {} from the resource estimator
I0310 01:04:31.870767 30480 process.cpp:3704] Handling HTTP event for process 'slave(703)' with path: '/slave(703)/containers'
I0310 01:04:31.872195 30487 http.cpp:871] Authorizing principal 'test-principal' to GET the '/containers' endpoint
I0310 01:04:31.877079 30484 slave.cpp:803] Agent terminating
[ OK ] Endpoint/SlaveEndpointTest.NoAuthorizer/2 (33 ms)
[----------] 9 tests from Endpoint/SlaveEndpointTest (298 ms total)
[----------] Global test environment tear-down
[==========] 1494 tests from 168 test cases ran. (452036 ms total)
[ PASSED ] 1493 tests.
[ FAILED ] 1 test, listed below:
[ FAILED ] SlaveRecoveryTest/0.Reboot, where TypeParam = mesos::internal::slave::MesosContainerizer
1 FAILED TEST
YOU HAVE 11 DISABLED TESTS
make[4]: *** [check-local] Error 1
make[4]: Leaving directory `/mesos/mesos-1.2.1/_build/src'
make[3]: *** [check-am] Error 2
make[3]: Leaving directory `/mesos/mesos-1.2.1/_build/src'
make[2]: *** [check] Error 2
make[2]: Leaving directory `/mesos/mesos-1.2.1/_build/src'
make[1]: *** [check-recursive] Error 1
make[1]: Leaving directory `/mesos/mesos-1.2.1/_build'
make: *** [distcheck] Error 1
+ docker rmi mesos-1489105007-24395
Untagged: mesos-1489105007-24395:latest
Deleted: sha256:2b72756ee56c3064b292f603d538df084b1f450258bb0bb455d176bab45a4fa5
Deleted: sha256:ea785e733fd313c80ec7d2d29e323f19484a01118b1b9cc3b3f18eda1a160bb4
Deleted: sha256:f34b7e1b5169c79a93eb14d2e899ec6787626c005eba9df28102ffb98161b9ed
Deleted: sha256:72bfbf49b4aeab62a1c00dbaa44cedb20b9ab15dc8a8c40eaf6d59488b279c7a
Deleted: sha256:c98d565f25a08f9afceca8f54f3a6fe2fa9e82333ec45a3018569927f2bddbec
Deleted: sha256:d11c3b08e62a82125ccb5c55c249ee05767d7b2f05e008ae0d96673890cc95ea
Deleted: sha256:7fe844c52855aadf163e1ee1c1f1afc5b5b6e88bd3abf4902e4a8385c951adf5
Deleted: sha256:48d08b66e04ecd90a2bedf79342e4587ea5bcd82cfdc1ad34777c104f8136b1b
Deleted: sha256:4e7e3aa6299ae142579d2a7fe189f87c13c85eb1151e6429634305b909e9460f
Deleted: sha256:b1cd02bca9654aaa0b02ce75124edd86a049e9d7f108794037556bb033192cd0
Deleted: sha256:d20a0fc291d055f2309cbca1aac18954af37e493719832da89313ff8ee7c6e92
Deleted: sha256:06f3a3e064f27d2a1d1c92234fe4bfb0d26c6bdf448e0d574aabb148a4365be9
Deleted: sha256:c7e9e3e97fdd29e3072dcc915cf7a244ff77ae4f26b4b53bc1d5858e3eda553b
Deleted: sha256:613a15c92e4c344157fe67ee87affd2bd404b3a54a5776b9f1c6a9c3678165e2
Deleted: sha256:5cfd9d323d1a1acfac426a849f8a3525f75147e77c0c3aa3fde90d02c5c5bce7
Deleted: sha256:0743c247c2bee73b3219c0442878e69e9a63fb5609fc3b3b39a8f72c9767a476
Deleted: sha256:845b313e4599c57962798df5092814edb19deeb034dccd76dceb34f5b32e954e
Deleted: sha256:32711d00cac10f3f93652eed647ac8db968d10aa65896f318d12607ba88954d2
Deleted: sha256:ca24a950dd90ad60b9df2f6fd159d00f1f5c41c8d0e5611a234eb9a5d8f4339b
Deleted: sha256:e44ee060d0637f1a1c1fe58bdf0d80bc6d377f53df0a5c4d3300f8b6d2e7ec7e
Deleted: sha256:20c4e820b63c516c00a73f6acab26bb723f3a523fd22d263b3e17427de1521d8
Deleted: sha256:8217626f68a0f59fa5170f360530ed8f3c67eb0a385f0b40ec0560975833ebc9
Deleted: sha256:9839579f9e6b54c05a4e869246129a7cc10e1e113ac0f55e95954a524c246b3a
Deleted: sha256:bdefaa3e54524f7958347448b6a6e88195a2e5eb0e3223c321ba01c6fc90c0a0
Build step 'Execute shell' marked build as failure
Jenkins build is back to normal : Mesos-Buildbot » autotools,gcc,--verbose,GLOG_v=1 MESOS_VERBOSE=1,ubuntu:14.04,(docker||Hadoop)&&(!ubuntu-us1)&&(!ubuntu-eu2) #3356
Posted by Apache Jenkins Server <je...@builds.apache.org>.
See <https://builds.apache.org/job/Mesos-Buildbot/BUILDTOOL=autotools,COMPILER=gcc,CONFIGURATION=--verbose,ENVIRONMENT=GLOG_v=1%20MESOS_VERBOSE=1,OS=ubuntu%3A14.04,label_exp=(docker%7C%7CHadoop)&&(!ubuntu-us1)&&(!ubuntu-eu2)/3356/display/redirect?page=changes>