You are viewing a plain text version of this content. The canonical link for it is here.
Posted to commits@beam.apache.org by Apache Jenkins Server <je...@builds.apache.org> on 2017/04/13 00:04:56 UTC
Build failed in Jenkins: beam_PostCommit_Python_Verify #1837
See <https://builds.apache.org/job/beam_PostCommit_Python_Verify/1837/display/redirect?page=changes>
Changes:
[dhalperi] Move Triggers from sdk-core to runners-core-construction
------------------------------------------
[...truncated 725.83 KB...]
File "<https://builds.apache.org/job/beam_PostCommit_Python_Verify/ws/sdks/python/apache_beam/pipeline.py",> line 484, in visit
part.visit(visitor, pipeline, visited)
File "<https://builds.apache.org/job/beam_PostCommit_Python_Verify/ws/sdks/python/apache_beam/pipeline.py",> line 484, in visit
part.visit(visitor, pipeline, visited)
File "<https://builds.apache.org/job/beam_PostCommit_Python_Verify/ws/sdks/python/apache_beam/pipeline.py",> line 487, in visit
visitor.visit_transform(self)
File "<https://builds.apache.org/job/beam_PostCommit_Python_Verify/ws/sdks/python/apache_beam/pipeline.py",> line 319, in visit_transform
enable_trace=False),
File "<https://builds.apache.org/job/beam_PostCommit_Python_Verify/ws/sdks/python/apache_beam/internal/pickler.py",> line 186, in dumps
s = dill.dumps(o)
File "<https://builds.apache.org/job/beam_PostCommit_Python_Verify/ws/sdks/python/local/lib/python2.7/site-packages/dill/dill.py",> line 259, in dumps
dump(obj, file, protocol, byref, fmode, recurse)#, strictio)
File "<https://builds.apache.org/job/beam_PostCommit_Python_Verify/ws/sdks/python/local/lib/python2.7/site-packages/dill/dill.py",> line 252, in dump
pik.dump(obj)
File "/usr/lib/python2.7/pickle.py", line 224, in dump
self.save(obj)
File "/usr/lib/python2.7/pickle.py", line 331, in save
self.save_reduce(obj=obj, *rv)
File "/usr/lib/python2.7/pickle.py", line 419, in save_reduce
save(state)
File "/usr/lib/python2.7/pickle.py", line 286, in save
f(self, obj) # Call unbound method with explicit self
File "<https://builds.apache.org/job/beam_PostCommit_Python_Verify/ws/sdks/python/apache_beam/internal/pickler.py",> line 160, in new_save_module_dict
return old_save_module_dict(pickler, obj)
File "<https://builds.apache.org/job/beam_PostCommit_Python_Verify/ws/sdks/python/local/lib/python2.7/site-packages/dill/dill.py",> line 841, in save_module_dict
StockPickler.save_dict(pickler, obj)
File "/usr/lib/python2.7/pickle.py", line 649, in save_dict
self._batch_setitems(obj.iteritems())
File "/usr/lib/python2.7/pickle.py", line 681, in _batch_setitems
save(v)
File "/usr/lib/python2.7/pickle.py", line 331, in save
self.save_reduce(obj=obj, *rv)
File "/usr/lib/python2.7/pickle.py", line 419, in save_reduce
save(state)
File "/usr/lib/python2.7/pickle.py", line 286, in save
f(self, obj) # Call unbound method with explicit self
File "<https://builds.apache.org/job/beam_PostCommit_Python_Verify/ws/sdks/python/apache_beam/internal/pickler.py",> line 160, in new_save_module_dict
return old_save_module_dict(pickler, obj)
File "<https://builds.apache.org/job/beam_PostCommit_Python_Verify/ws/sdks/python/local/lib/python2.7/site-packages/dill/dill.py",> line 841, in save_module_dict
StockPickler.save_dict(pickler, obj)
File "/usr/lib/python2.7/pickle.py", line 649, in save_dict
self._batch_setitems(obj.iteritems())
File "/usr/lib/python2.7/pickle.py", line 681, in _batch_setitems
save(v)
File "/usr/lib/python2.7/pickle.py", line 286, in save
f(self, obj) # Call unbound method with explicit self
File "/usr/lib/python2.7/pickle.py", line 600, in save_list
self._batch_appends(iter(obj))
File "/usr/lib/python2.7/pickle.py", line 636, in _batch_appends
save(tmp[0])
File "/usr/lib/python2.7/pickle.py", line 331, in save
self.save_reduce(obj=obj, *rv)
File "/usr/lib/python2.7/pickle.py", line 419, in save_reduce
save(state)
File "/usr/lib/python2.7/pickle.py", line 286, in save
f(self, obj) # Call unbound method with explicit self
File "<https://builds.apache.org/job/beam_PostCommit_Python_Verify/ws/sdks/python/apache_beam/internal/pickler.py",> line 160, in new_save_module_dict
return old_save_module_dict(pickler, obj)
File "<https://builds.apache.org/job/beam_PostCommit_Python_Verify/ws/sdks/python/local/lib/python2.7/site-packages/dill/dill.py",> line 841, in save_module_dict
StockPickler.save_dict(pickler, obj)
File "/usr/lib/python2.7/pickle.py", line 649, in save_dict
self._batch_setitems(obj.iteritems())
File "/usr/lib/python2.7/pickle.py", line 681, in _batch_setitems
save(v)
File "/usr/lib/python2.7/pickle.py", line 286, in save
f(self, obj) # Call unbound method with explicit self
File "/usr/lib/python2.7/pickle.py", line 600, in save_list
self._batch_appends(iter(obj))
File "/usr/lib/python2.7/pickle.py", line 633, in _batch_appends
save(x)
File "/usr/lib/python2.7/pickle.py", line 331, in save
self.save_reduce(obj=obj, *rv)
File "/usr/lib/python2.7/pickle.py", line 419, in save_reduce
save(state)
File "/usr/lib/python2.7/pickle.py", line 286, in save
f(self, obj) # Call unbound method with explicit self
File "<https://builds.apache.org/job/beam_PostCommit_Python_Verify/ws/sdks/python/apache_beam/internal/pickler.py",> line 160, in new_save_module_dict
return old_save_module_dict(pickler, obj)
File "<https://builds.apache.org/job/beam_PostCommit_Python_Verify/ws/sdks/python/local/lib/python2.7/site-packages/dill/dill.py",> line 841, in save_module_dict
StockPickler.save_dict(pickler, obj)
File "/usr/lib/python2.7/pickle.py", line 649, in save_dict
self._batch_setitems(obj.iteritems())
File "/usr/lib/python2.7/pickle.py", line 681, in _batch_setitems
save(v)
File "/usr/lib/python2.7/pickle.py", line 286, in save
f(self, obj) # Call unbound method with explicit self
File "/usr/lib/python2.7/pickle.py", line 600, in save_list
self._batch_appends(iter(obj))
File "/usr/lib/python2.7/pickle.py", line 633, in _batch_appends
save(x)
File "/usr/lib/python2.7/pickle.py", line 331, in save
self.save_reduce(obj=obj, *rv)
File "/usr/lib/python2.7/pickle.py", line 419, in save_reduce
save(state)
File "/usr/lib/python2.7/pickle.py", line 286, in save
f(self, obj) # Call unbound method with explicit self
File "<https://builds.apache.org/job/beam_PostCommit_Python_Verify/ws/sdks/python/apache_beam/internal/pickler.py",> line 160, in new_save_module_dict
return old_save_module_dict(pickler, obj)
File "<https://builds.apache.org/job/beam_PostCommit_Python_Verify/ws/sdks/python/local/lib/python2.7/site-packages/dill/dill.py",> line 841, in save_module_dict
StockPickler.save_dict(pickler, obj)
File "/usr/lib/python2.7/pickle.py", line 649, in save_dict
self._batch_setitems(obj.iteritems())
File "/usr/lib/python2.7/pickle.py", line 681, in _batch_setitems
save(v)
File "/usr/lib/python2.7/pickle.py", line 331, in save
self.save_reduce(obj=obj, *rv)
File "/usr/lib/python2.7/pickle.py", line 419, in save_reduce
save(state)
File "/usr/lib/python2.7/pickle.py", line 286, in save
f(self, obj) # Call unbound method with explicit self
File "<https://builds.apache.org/job/beam_PostCommit_Python_Verify/ws/sdks/python/apache_beam/internal/pickler.py",> line 160, in new_save_module_dict
return old_save_module_dict(pickler, obj)
File "<https://builds.apache.org/job/beam_PostCommit_Python_Verify/ws/sdks/python/local/lib/python2.7/site-packages/dill/dill.py",> line 841, in save_module_dict
StockPickler.save_dict(pickler, obj)
File "/usr/lib/python2.7/pickle.py", line 649, in save_dict
self._batch_setitems(obj.iteritems())
File "/usr/lib/python2.7/pickle.py", line 681, in _batch_setitems
save(v)
File "/usr/lib/python2.7/pickle.py", line 331, in save
self.save_reduce(obj=obj, *rv)
File "/usr/lib/python2.7/pickle.py", line 419, in save_reduce
save(state)
File "/usr/lib/python2.7/pickle.py", line 286, in save
f(self, obj) # Call unbound method with explicit self
File "<https://builds.apache.org/job/beam_PostCommit_Python_Verify/ws/sdks/python/apache_beam/internal/pickler.py",> line 160, in new_save_module_dict
return old_save_module_dict(pickler, obj)
File "<https://builds.apache.org/job/beam_PostCommit_Python_Verify/ws/sdks/python/local/lib/python2.7/site-packages/dill/dill.py",> line 841, in save_module_dict
StockPickler.save_dict(pickler, obj)
File "/usr/lib/python2.7/pickle.py", line 649, in save_dict
self._batch_setitems(obj.iteritems())
File "/usr/lib/python2.7/pickle.py", line 686, in _batch_setitems
save(v)
File "/usr/lib/python2.7/pickle.py", line 331, in save
self.save_reduce(obj=obj, *rv)
File "/usr/lib/python2.7/pickle.py", line 419, in save_reduce
save(state)
File "/usr/lib/python2.7/pickle.py", line 286, in save
f(self, obj) # Call unbound method with explicit self
File "<https://builds.apache.org/job/beam_PostCommit_Python_Verify/ws/sdks/python/apache_beam/internal/pickler.py",> line 160, in new_save_module_dict
return old_save_module_dict(pickler, obj)
File "<https://builds.apache.org/job/beam_PostCommit_Python_Verify/ws/sdks/python/local/lib/python2.7/site-packages/dill/dill.py",> line 841, in save_module_dict
StockPickler.save_dict(pickler, obj)
File "/usr/lib/python2.7/pickle.py", line 649, in save_dict
self._batch_setitems(obj.iteritems())
File "/usr/lib/python2.7/pickle.py", line 681, in _batch_setitems
save(v)
File "/usr/lib/python2.7/pickle.py", line 331, in save
self.save_reduce(obj=obj, *rv)
File "/usr/lib/python2.7/pickle.py", line 419, in save_reduce
save(state)
File "/usr/lib/python2.7/pickle.py", line 286, in save
f(self, obj) # Call unbound method with explicit self
File "<https://builds.apache.org/job/beam_PostCommit_Python_Verify/ws/sdks/python/apache_beam/internal/pickler.py",> line 160, in new_save_module_dict
return old_save_module_dict(pickler, obj)
File "<https://builds.apache.org/job/beam_PostCommit_Python_Verify/ws/sdks/python/local/lib/python2.7/site-packages/dill/dill.py",> line 841, in save_module_dict
StockPickler.save_dict(pickler, obj)
File "/usr/lib/python2.7/pickle.py", line 649, in save_dict
self._batch_setitems(obj.iteritems())
File "/usr/lib/python2.7/pickle.py", line 667, in _batch_setitems
r = xrange(self._BATCHSIZE)
File "<https://builds.apache.org/job/beam_PostCommit_Python_Verify/ws/sdks/python/nose-1.3.7-py2.7.egg/nose/plugins/multiprocess.py",> line 276, in signalhandler
raise TimedOutException()
TimedOutException: 'test_iterable_side_input (apache_beam.transforms.sideinputs_test.SideInputsTest)'
======================================================================
ERROR: test_multi_valued_singleton_side_input (apache_beam.transforms.sideinputs_test.SideInputsTest)
----------------------------------------------------------------------
Traceback (most recent call last):
File "<https://builds.apache.org/job/beam_PostCommit_Python_Verify/ws/sdks/python/nose-1.3.7-py2.7.egg/nose/plugins/multiprocess.py",> line 812, in run
test(orig)
File "<https://builds.apache.org/job/beam_PostCommit_Python_Verify/ws/sdks/python/nose-1.3.7-py2.7.egg/nose/case.py",> line 45, in __call__
return self.run(*arg, **kwarg)
File "<https://builds.apache.org/job/beam_PostCommit_Python_Verify/ws/sdks/python/nose-1.3.7-py2.7.egg/nose/case.py",> line 133, in run
self.runTest(result)
File "<https://builds.apache.org/job/beam_PostCommit_Python_Verify/ws/sdks/python/nose-1.3.7-py2.7.egg/nose/case.py",> line 151, in runTest
test(result)
File "/usr/lib/python2.7/unittest/case.py", line 395, in __call__
return self.run(*args, **kwds)
File "/usr/lib/python2.7/unittest/case.py", line 331, in run
testMethod()
File "<https://builds.apache.org/job/beam_PostCommit_Python_Verify/ws/sdks/python/apache_beam/transforms/sideinputs_test.py",> line 156, in test_multi_valued_singleton_side_input
pipeline.run()
File "<https://builds.apache.org/job/beam_PostCommit_Python_Verify/ws/sdks/python/apache_beam/test_pipeline.py",> line 91, in run
result = super(TestPipeline, self).run()
File "<https://builds.apache.org/job/beam_PostCommit_Python_Verify/ws/sdks/python/apache_beam/pipeline.py",> line 169, in run
return self.runner.run(self)
File "<https://builds.apache.org/job/beam_PostCommit_Python_Verify/ws/sdks/python/apache_beam/runners/dataflow/test_dataflow_runner.py",> line 39, in run
self.result = super(TestDataflowRunner, self).run(pipeline)
File "<https://builds.apache.org/job/beam_PostCommit_Python_Verify/ws/sdks/python/apache_beam/runners/dataflow/dataflow_runner.py",> line 170, in run
pipeline.options, job_version)
File "<https://builds.apache.org/job/beam_PostCommit_Python_Verify/ws/sdks/python/apache_beam/runners/dataflow/internal/apiclient.py",> line 370, in __init__
credentials = get_service_credentials()
File "<https://builds.apache.org/job/beam_PostCommit_Python_Verify/ws/sdks/python/apache_beam/internal/gcp/auth.py",> line 173, in get_service_credentials
credentials.get_access_token()
File "<https://builds.apache.org/job/beam_PostCommit_Python_Verify/ws/sdks/python/local/lib/python2.7/site-packages/oauth2client/client.py",> line 677, in get_access_token
self.refresh(http)
File "<https://builds.apache.org/job/beam_PostCommit_Python_Verify/ws/sdks/python/local/lib/python2.7/site-packages/oauth2client/client.py",> line 560, in refresh
self._refresh(http.request)
File "<https://builds.apache.org/job/beam_PostCommit_Python_Verify/ws/sdks/python/apache_beam/internal/gcp/auth.py",> line 115, in _refresh
output, _ = gcloud_process.communicate()
File "/usr/lib/python2.7/subprocess.py", line 791, in communicate
stdout = _eintr_retry_call(self.stdout.read)
File "/usr/lib/python2.7/subprocess.py", line 476, in _eintr_retry_call
return func(*args)
File "<https://builds.apache.org/job/beam_PostCommit_Python_Verify/ws/sdks/python/nose-1.3.7-py2.7.egg/nose/plugins/multiprocess.py",> line 276, in signalhandler
raise TimedOutException()
TimedOutException: 'test_multi_valued_singleton_side_input (apache_beam.transforms.sideinputs_test.SideInputsTest)'
======================================================================
ERROR: test_as_list_twice (apache_beam.transforms.sideinputs_test.SideInputsTest)
----------------------------------------------------------------------
Traceback (most recent call last):
File "<https://builds.apache.org/job/beam_PostCommit_Python_Verify/ws/sdks/python/nose-1.3.7-py2.7.egg/nose/plugins/multiprocess.py",> line 812, in run
test(orig)
File "<https://builds.apache.org/job/beam_PostCommit_Python_Verify/ws/sdks/python/nose-1.3.7-py2.7.egg/nose/case.py",> line 45, in __call__
return self.run(*arg, **kwarg)
File "<https://builds.apache.org/job/beam_PostCommit_Python_Verify/ws/sdks/python/nose-1.3.7-py2.7.egg/nose/case.py",> line 133, in run
self.runTest(result)
File "<https://builds.apache.org/job/beam_PostCommit_Python_Verify/ws/sdks/python/nose-1.3.7-py2.7.egg/nose/case.py",> line 151, in runTest
test(result)
File "/usr/lib/python2.7/unittest/case.py", line 395, in __call__
return self.run(*args, **kwds)
File "/usr/lib/python2.7/unittest/case.py", line 331, in run
testMethod()
File "<https://builds.apache.org/job/beam_PostCommit_Python_Verify/ws/sdks/python/apache_beam/transforms/sideinputs_test.py",> line 269, in test_as_list_twice
pipeline.run()
File "<https://builds.apache.org/job/beam_PostCommit_Python_Verify/ws/sdks/python/apache_beam/test_pipeline.py",> line 91, in run
result = super(TestPipeline, self).run()
File "<https://builds.apache.org/job/beam_PostCommit_Python_Verify/ws/sdks/python/apache_beam/pipeline.py",> line 169, in run
return self.runner.run(self)
File "<https://builds.apache.org/job/beam_PostCommit_Python_Verify/ws/sdks/python/apache_beam/runners/dataflow/test_dataflow_runner.py",> line 48, in run
self.result.wait_until_finish()
File "<https://builds.apache.org/job/beam_PostCommit_Python_Verify/ws/sdks/python/apache_beam/runners/dataflow/dataflow_runner.py",> line 690, in wait_until_finish
time.sleep(5.0)
File "<https://builds.apache.org/job/beam_PostCommit_Python_Verify/ws/sdks/python/nose-1.3.7-py2.7.egg/nose/plugins/multiprocess.py",> line 276, in signalhandler
raise TimedOutException()
TimedOutException: 'test_as_list_twice (apache_beam.transforms.sideinputs_test.SideInputsTest)'
----------------------------------------------------------------------
Ran 14 tests in 1362.297s
FAILED (errors=6)
Found: https://console.cloud.google.com/dataflow/job/2017-04-12_16_32_10-6976307932669879889?project=apache-beam-testing
Found: https://console.cloud.google.com/dataflow/job/2017-04-12_16_38_17-4795238263765164720?project=apache-beam-testing
Found: https://console.cloud.google.com/dataflow/job/2017-04-12_16_44_05-10185107867053893805?project=apache-beam-testing
Found: https://console.cloud.google.com/dataflow/job/2017-04-12_16_32_11-18031983583771529864?project=apache-beam-testing
Found: https://console.cloud.google.com/dataflow/job/2017-04-12_16_40_08-9312480651070776428?project=apache-beam-testing
Found: https://console.cloud.google.com/dataflow/job/2017-04-12_16_48_46-9894053766805007597?project=apache-beam-testing
Build step 'Execute shell' marked build as failure
Jenkins build is back to normal : beam_PostCommit_Python_Verify
#1838
Posted by Apache Jenkins Server <je...@builds.apache.org>.
See <https://builds.apache.org/job/beam_PostCommit_Python_Verify/1838/display/redirect>