You are viewing a plain text version of this content. The canonical link for it is here.
Posted to builds@cassandra.apache.org by Apache Jenkins Server <je...@builds.apache.org> on 2022/07/21 07:03:58 UTC
Build complete: Cassandra-4.1 #111 [UNSTABLE] b4e58d83fc72f8babf61367aad23a9499df69881
-------------------------------------------------------------------------------
Build Cassandra-4.1 #111 Still Unstable
URL: https://ci-cassandra.apache.org/job/Cassandra-4.1/111/
-------------------------------------------------------------------------------
Changes:
No changes
-------------------------------------------------------------------------------
Failed Tests:
3 tests failed.
FAILED: dtest-upgrade.upgrade_tests.drop_compact_storage_upgrade_test.TestDropCompactStorage.test_drop_compact_storage_mixed_cluster
FAILED: org.apache.cassandra.distributed.test.GroupByTest.groupByWithDeletesAndSrpOnRows
FAILED: org.apache.cassandra.tools.TopPartitionsTest.testServiceTopPartitionsSingleTable-cdc
-------------------------------------------------------------------------------
For complete test report and logs see https://nightlies.apache.org/cassandra/Cassandra-4.1/111/