You are viewing a plain text version of this content. The canonical link for it is here.
Posted to notifications@logging.apache.org by Apache Jenkins Server <je...@builds.apache.org> on 2019/05/13 11:01:28 UTC
Build failed in Jenkins: Log4j 2 2.x #3893
See <https://builds.apache.org/job/Log4j%202%202.x/3893/display/redirect>
------------------------------------------
[...truncated 687.58 KB...]
[INFO] Downloading: https://repo.maven.apache.org/maven2/org/apache/logging/log4j/log4j-jcl/maven-metadata.xml
[INFO] Downloading: http://repository.apache.org/snapshots/org/apache/logging/log4j/log4j-jcl/maven-metadata.xml
[INFO] Downloaded: https://repo.maven.apache.org/maven2/org/apache/logging/log4j/log4j-jcl/maven-metadata.xml (2 KB at 9.4 KB/sec)
[INFO] Downloaded: http://repository.apache.org/snapshots/org/apache/logging/log4j/log4j-jcl/maven-metadata.xml (855 B at 2.8 KB/sec)
[INFO] Comparing [org.apache.logging.log4j:log4j-jcl:jar:2.11.2] against [org.apache.logging.log4j:log4j-jcl:jar:2.12.0-SNAPSHOT].
[INFO] API checks completed without failures.
[INFO]
[INFO] --- maven-install-plugin:2.5.2:install (default-install) @ log4j-jcl ---
[INFO] Installing <https://builds.apache.org/job/Log4j%202%202.x/ws/log4j-jcl/target/log4j-jcl-2.12.0-SNAPSHOT.jar> to /home/jenkins/jenkins-slave/maven-repositories/1/org/apache/logging/log4j/log4j-jcl/2.12.0-SNAPSHOT/log4j-jcl-2.12.0-SNAPSHOT.jar
[INFO] Installing <https://builds.apache.org/job/Log4j%202%202.x/ws/log4j-jcl/pom.xml> to /home/jenkins/jenkins-slave/maven-repositories/1/org/apache/logging/log4j/log4j-jcl/2.12.0-SNAPSHOT/log4j-jcl-2.12.0-SNAPSHOT.pom
[INFO] Installing <https://builds.apache.org/job/Log4j%202%202.x/ws/log4j-jcl/target/log4j-jcl-2.12.0-SNAPSHOT-sources.jar> to /home/jenkins/jenkins-slave/maven-repositories/1/org/apache/logging/log4j/log4j-jcl/2.12.0-SNAPSHOT/log4j-jcl-2.12.0-SNAPSHOT-sources.jar
[INFO] Installing <https://builds.apache.org/job/Log4j%202%202.x/ws/log4j-jcl/target/log4j-jcl-2.12.0-SNAPSHOT-test-sources.jar> to /home/jenkins/jenkins-slave/maven-repositories/1/org/apache/logging/log4j/log4j-jcl/2.12.0-SNAPSHOT/log4j-jcl-2.12.0-SNAPSHOT-test-sources.jar
[INFO]
[INFO] ------------------------------------------------------------------------
[INFO] Building Apache Log4j Flume Bridge 2.12.0-SNAPSHOT
[INFO] ------------------------------------------------------------------------
[INFO]
[INFO] --- maven-clean-plugin:3.1.0:clean (default-clean) @ log4j-flume-ng ---
[INFO]
[INFO] --- maven-enforcer-plugin:1.4.1:enforce (enforce-maven-version) @ log4j-flume-ng ---
[INFO]
[INFO] --- maven-toolchains-plugin:1.1:toolchain (default) @ log4j-flume-ng ---
[INFO] Required toolchain: jdk [ version='1.7' ]
[INFO] Found matching toolchain for type jdk: JDK[/home/jenkins/tools/java/latest1.7]
[INFO]
[INFO] --- maven-remote-resources-plugin:1.5:process (process-resource-bundles) @ log4j-flume-ng ---
[INFO]
[INFO] --- maven-remote-resources-plugin:1.5:process (default) @ log4j-flume-ng ---
[INFO]
[INFO] --- maven-resources-plugin:3.0.2:resources (default-resources) @ log4j-flume-ng ---
[INFO] Using 'UTF-8' encoding to copy filtered resources.
[INFO] skip non existing resourceDirectory <https://builds.apache.org/job/Log4j%202%202.x/ws/log4j-flume-ng/src/main/resources>
[INFO] Copying 3 resources
[INFO] Copying 3 resources
[INFO]
[INFO] --- maven-compiler-plugin:3.8.1:compile (default-compile) @ log4j-flume-ng ---
[INFO] Toolchain in maven-compiler-plugin: JDK[/home/jenkins/tools/java/latest1.7]
[INFO] Changes detected - recompiling the module!
[INFO] Compiling 11 source files to <https://builds.apache.org/job/Log4j%202%202.x/ws/log4j-flume-ng/target/classes>
[WARNING] [path] bad path element "/home/jenkins/jenkins-slave/maven-repositories/1/org/apache/derby/derby/10.11.1.1/derbyLocale_cs.jar": no such file or directory
[WARNING] [path] bad path element "/home/jenkins/jenkins-slave/maven-repositories/1/org/apache/derby/derby/10.11.1.1/derbyLocale_de_DE.jar": no such file or directory
[WARNING] [path] bad path element "/home/jenkins/jenkins-slave/maven-repositories/1/org/apache/derby/derby/10.11.1.1/derbyLocale_es.jar": no such file or directory
[WARNING] [path] bad path element "/home/jenkins/jenkins-slave/maven-repositories/1/org/apache/derby/derby/10.11.1.1/derbyLocale_fr.jar": no such file or directory
[WARNING] [path] bad path element "/home/jenkins/jenkins-slave/maven-repositories/1/org/apache/derby/derby/10.11.1.1/derbyLocale_hu.jar": no such file or directory
[WARNING] [path] bad path element "/home/jenkins/jenkins-slave/maven-repositories/1/org/apache/derby/derby/10.11.1.1/derbyLocale_it.jar": no such file or directory
[WARNING] [path] bad path element "/home/jenkins/jenkins-slave/maven-repositories/1/org/apache/derby/derby/10.11.1.1/derbyLocale_ja_JP.jar": no such file or directory
[WARNING] [path] bad path element "/home/jenkins/jenkins-slave/maven-repositories/1/org/apache/derby/derby/10.11.1.1/derbyLocale_ko_KR.jar": no such file or directory
[WARNING] [path] bad path element "/home/jenkins/jenkins-slave/maven-repositories/1/org/apache/derby/derby/10.11.1.1/derbyLocale_pl.jar": no such file or directory
[WARNING] [path] bad path element "/home/jenkins/jenkins-slave/maven-repositories/1/org/apache/derby/derby/10.11.1.1/derbyLocale_pt_BR.jar": no such file or directory
[WARNING] [path] bad path element "/home/jenkins/jenkins-slave/maven-repositories/1/org/apache/derby/derby/10.11.1.1/derbyLocale_ru.jar": no such file or directory
[WARNING] [path] bad path element "/home/jenkins/jenkins-slave/maven-repositories/1/org/apache/derby/derby/10.11.1.1/derbyLocale_zh_CN.jar": no such file or directory
[WARNING] [path] bad path element "/home/jenkins/jenkins-slave/maven-repositories/1/org/apache/derby/derby/10.11.1.1/derbyLocale_zh_TW.jar": no such file or directory
[WARNING] Processing annotations
Annotations processed
Processing annotations
No elements to process
<https://builds.apache.org/job/Log4j%202%202.x/ws/log4j-flume-ng/src/main/java/org/apache/logging/log4j/flume/appender/FlumeEvent.java>:[339,31] [deprecation] getContextMap() in LogEvent has been deprecated
[WARNING] <https://builds.apache.org/job/Log4j%202%202.x/ws/log4j-flume-ng/src/main/java/org/apache/logging/log4j/flume/appender/FlumeAppender.java>:[305,40] non-varargs call of varargs method with inexact argument type for last parameter;
cast to Object for a varargs call
cast to Object[] for a non-varargs call and to suppress this warning
[INFO]
[INFO] --- maven-bundle-plugin:3.5.0:manifest (default) @ log4j-flume-ng ---
[INFO]
[INFO] --- maven-resources-plugin:3.0.2:testResources (default-testResources) @ log4j-flume-ng ---
[INFO] Using 'UTF-8' encoding to copy filtered resources.
[INFO] Copying 3 resources
[INFO] Copying 3 resources
[INFO] Copying 3 resources
[INFO]
[INFO] --- maven-compiler-plugin:3.8.1:testCompile (default-testCompile) @ log4j-flume-ng ---
[INFO] Toolchain in maven-compiler-plugin: JDK[/home/jenkins/tools/java/latest1.7]
[INFO] Changes detected - recompiling the module!
[INFO] Compiling 6 source files to <https://builds.apache.org/job/Log4j%202%202.x/ws/log4j-flume-ng/target/test-classes>
[WARNING] [path] bad path element "/home/jenkins/jenkins-slave/maven-repositories/1/org/apache/derby/derby/10.11.1.1/derbyLocale_cs.jar": no such file or directory
[WARNING] [path] bad path element "/home/jenkins/jenkins-slave/maven-repositories/1/org/apache/derby/derby/10.11.1.1/derbyLocale_de_DE.jar": no such file or directory
[WARNING] [path] bad path element "/home/jenkins/jenkins-slave/maven-repositories/1/org/apache/derby/derby/10.11.1.1/derbyLocale_es.jar": no such file or directory
[WARNING] [path] bad path element "/home/jenkins/jenkins-slave/maven-repositories/1/org/apache/derby/derby/10.11.1.1/derbyLocale_fr.jar": no such file or directory
[WARNING] [path] bad path element "/home/jenkins/jenkins-slave/maven-repositories/1/org/apache/derby/derby/10.11.1.1/derbyLocale_hu.jar": no such file or directory
[WARNING] [path] bad path element "/home/jenkins/jenkins-slave/maven-repositories/1/org/apache/derby/derby/10.11.1.1/derbyLocale_it.jar": no such file or directory
[WARNING] [path] bad path element "/home/jenkins/jenkins-slave/maven-repositories/1/org/apache/derby/derby/10.11.1.1/derbyLocale_ja_JP.jar": no such file or directory
[WARNING] [path] bad path element "/home/jenkins/jenkins-slave/maven-repositories/1/org/apache/derby/derby/10.11.1.1/derbyLocale_ko_KR.jar": no such file or directory
[WARNING] [path] bad path element "/home/jenkins/jenkins-slave/maven-repositories/1/org/apache/derby/derby/10.11.1.1/derbyLocale_pl.jar": no such file or directory
[WARNING] [path] bad path element "/home/jenkins/jenkins-slave/maven-repositories/1/org/apache/derby/derby/10.11.1.1/derbyLocale_pt_BR.jar": no such file or directory
[WARNING] [path] bad path element "/home/jenkins/jenkins-slave/maven-repositories/1/org/apache/derby/derby/10.11.1.1/derbyLocale_ru.jar": no such file or directory
[WARNING] [path] bad path element "/home/jenkins/jenkins-slave/maven-repositories/1/org/apache/derby/derby/10.11.1.1/derbyLocale_zh_CN.jar": no such file or directory
[WARNING] [path] bad path element "/home/jenkins/jenkins-slave/maven-repositories/1/org/apache/derby/derby/10.11.1.1/derbyLocale_zh_TW.jar": no such file or directory
[WARNING] [path] bad path element "/home/jenkins/jenkins-slave/maven-repositories/1/com/sun/xml/bind/jaxb-impl/2.2.3-1/jaxb-api.jar": no such file or directory
[WARNING] [path] bad path element "/home/jenkins/jenkins-slave/maven-repositories/1/com/sun/xml/bind/jaxb-impl/2.2.3-1/activation.jar": no such file or directory
[WARNING] [path] bad path element "/home/jenkins/jenkins-slave/maven-repositories/1/com/sun/xml/bind/jaxb-impl/2.2.3-1/jsr173_1.0_api.jar": no such file or directory
[WARNING] [path] bad path element "/home/jenkins/jenkins-slave/maven-repositories/1/com/sun/xml/bind/jaxb-impl/2.2.3-1/jaxb1-impl.jar": no such file or directory
[INFO]
[INFO] --- maven-surefire-plugin:2.22.2:test (default-test) @ log4j-flume-ng ---
[INFO] Toolchain in maven-surefire-plugin: JDK[/home/jenkins/tools/java/latest1.7]
[INFO]
[INFO] -------------------------------------------------------
[INFO] T E S T S
[INFO] -------------------------------------------------------
[INFO] Running org.apache.logging.log4j.flume.appender.FlumeAppenderTest
[INFO] Tests run: 10, Failures: 0, Errors: 0, Skipped: 0, Time elapsed: 5.619 s - in org.apache.logging.log4j.flume.appender.FlumeAppenderTest
[INFO] Running org.apache.logging.log4j.flume.appender.FlumePersistentAppenderTest
ERROR StatusLogger No Log4j 2 configuration file found. Using default configuration (logging only errors to the console), or user programmatically provided configurations. Set system property 'log4j2.debug' to show Log4j 2 internal initialization logging. See https://logging.apache.org/log4j/2.x/manual/configuration.html for instructions on how to configure Log4j 2
2019-05-13 07:21:41,474 main ERROR No Log4j 2 configuration file found. Using default configuration (logging only errors to the console), or user programmatically provided configurations. Set system property 'log4j2.debug' to show Log4j 2 internal initialization logging. See https://logging.apache.org/log4j/2.x/manual/configuration.html for instructions on how to configure Log4j 2
2019-05-13 07:21:41,475 main INFO Log4j appears to be running in a Servlet environment, but there's no log4j-web module available. If you want better web container support, please add the log4j-web JAR to your web archive or server lib directory.
2019-05-13 07:21:41,668 main INFO Log4j appears to be running in a Servlet environment, but there's no log4j-web module available. If you want better web container support, please add the log4j-web JAR to your web archive or server lib directory.
2019-05-13 07:25:32,475 main ERROR No Log4j 2 configuration file found. Using default configuration (logging only errors to the console), or user programmatically provided configurations. Set system property 'log4j2.debug' to show Log4j 2 internal initialization logging. See https://logging.apache.org/log4j/2.x/manual/configuration.html for instructions on how to configure Log4j 2
2019-05-13 07:25:32,478 main INFO Log4j appears to be running in a Servlet environment, but there's no log4j-web module available. If you want better web container support, please add the log4j-web JAR to your web archive or server lib directory.
2019-05-13 07:25:32,625 main INFO Log4j appears to be running in a Servlet environment, but there's no log4j-web module available. If you want better web container support, please add the log4j-web JAR to your web archive or server lib directory.
2019-05-13 07:25:33,392 main ERROR No Log4j 2 configuration file found. Using default configuration (logging only errors to the console), or user programmatically provided configurations. Set system property 'log4j2.debug' to show Log4j 2 internal initialization logging. See https://logging.apache.org/log4j/2.x/manual/configuration.html for instructions on how to configure Log4j 2
2019-05-13 07:25:33,394 main INFO Log4j appears to be running in a Servlet environment, but there's no log4j-web module available. If you want better web container support, please add the log4j-web JAR to your web archive or server lib directory.
2019-05-13 07:25:33,504 main INFO Log4j appears to be running in a Servlet environment, but there's no log4j-web module available. If you want better web container support, please add the log4j-web JAR to your web archive or server lib directory.
2019-05-13 07:25:35,190 main ERROR No Log4j 2 configuration file found. Using default configuration (logging only errors to the console), or user programmatically provided configurations. Set system property 'log4j2.debug' to show Log4j 2 internal initialization logging. See https://logging.apache.org/log4j/2.x/manual/configuration.html for instructions on how to configure Log4j 2
2019-05-13 07:25:35,192 main INFO Log4j appears to be running in a Servlet environment, but there's no log4j-web module available. If you want better web container support, please add the log4j-web JAR to your web archive or server lib directory.
2019-05-13 07:25:35,320 main INFO Log4j appears to be running in a Servlet environment, but there's no log4j-web module available. If you want better web container support, please add the log4j-web JAR to your web archive or server lib directory.
2019-05-13 07:25:36,002 main ERROR No Log4j 2 configuration file found. Using default configuration (logging only errors to the console), or user programmatically provided configurations. Set system property 'log4j2.debug' to show Log4j 2 internal initialization logging. See https://logging.apache.org/log4j/2.x/manual/configuration.html for instructions on how to configure Log4j 2
2019-05-13 07:25:36,003 main INFO Log4j appears to be running in a Servlet environment, but there's no log4j-web module available. If you want better web container support, please add the log4j-web JAR to your web archive or server lib directory.
2019-05-13 07:25:36,149 main INFO Log4j appears to be running in a Servlet environment, but there's no log4j-web module available. If you want better web container support, please add the log4j-web JAR to your web archive or server lib directory.
2019-05-13 07:25:36,888 main ERROR No Log4j 2 configuration file found. Using default configuration (logging only errors to the console), or user programmatically provided configurations. Set system property 'log4j2.debug' to show Log4j 2 internal initialization logging. See https://logging.apache.org/log4j/2.x/manual/configuration.html for instructions on how to configure Log4j 2
2019-05-13 07:25:36,889 main INFO Log4j appears to be running in a Servlet environment, but there's no log4j-web module available. If you want better web container support, please add the log4j-web JAR to your web archive or server lib directory.
2019-05-13 07:25:36,993 main INFO Log4j appears to be running in a Servlet environment, but there's no log4j-web module available. If you want better web container support, please add the log4j-web JAR to your web archive or server lib directory.
2019-05-13 07:25:37,176 main ERROR No Log4j 2 configuration file found. Using default configuration (logging only errors to the console), or user programmatically provided configurations. Set system property 'log4j2.debug' to show Log4j 2 internal initialization logging. See https://logging.apache.org/log4j/2.x/manual/configuration.html for instructions on how to configure Log4j 2
2019-05-13 07:25:37,178 main INFO Log4j appears to be running in a Servlet environment, but there's no log4j-web module available. If you want better web container support, please add the log4j-web JAR to your web archive or server lib directory.
[INFO] Tests run: 7, Failures: 0, Errors: 0, Skipped: 0, Time elapsed: 238.182 s - in org.apache.logging.log4j.flume.appender.FlumePersistentAppenderTest
[INFO] Running org.apache.logging.log4j.flume.appender.FlumeEmbeddedAgentTest
ERROR StatusLogger No Log4j 2 configuration file found. Using default configuration (logging only errors to the console), or user programmatically provided configurations. Set system property 'log4j2.debug' to show Log4j 2 internal initialization logging. See https://logging.apache.org/log4j/2.x/manual/configuration.html for instructions on how to configure Log4j 2
2019-05-13 07:25:39,881 main ERROR No Log4j 2 configuration file found. Using default configuration (logging only errors to the console), or user programmatically provided configurations. Set system property 'log4j2.debug' to show Log4j 2 internal initialization logging. See https://logging.apache.org/log4j/2.x/manual/configuration.html for instructions on how to configure Log4j 2
2019-05-13 07:25:40,605 SinkRunner-PollingRunner-FailoverSinkProcessor - [WARN] org.apache.flume.sink.FailoverSinkProcessor Sink agent0 failed and has been sent to failover list
org.apache.flume.EventDeliveryException: Failed to send events
at org.apache.flume.sink.AbstractRpcSink.process(AbstractRpcSink.java:389) ~[flume-ng-core-1.7.0.jar:1.7.0]
at org.apache.flume.sink.FailoverSinkProcessor.process(FailoverSinkProcessor.java:185) [flume-ng-core-1.7.0.jar:1.7.0]
at org.apache.flume.SinkRunner$PollingRunner.run(SinkRunner.java:145) [flume-ng-core-1.7.0.jar:1.7.0]
at java.lang.Thread.run(Thread.java:745) [?:1.7.0_80]
Caused by: org.apache.flume.EventDeliveryException: NettyAvroRpcClient { host: localhost, port: 1103 }: Failed to send batch
at org.apache.flume.api.NettyAvroRpcClient.appendBatch(NettyAvroRpcClient.java:314) ~[flume-ng-sdk-1.7.0.jar:1.7.0]
at org.apache.flume.sink.AbstractRpcSink.process(AbstractRpcSink.java:373) ~[flume-ng-core-1.7.0.jar:1.7.0]
... 3 more
Caused by: org.apache.flume.EventDeliveryException: NettyAvroRpcClient { host: localhost, port: 1103 }: RPC request exception
at org.apache.flume.api.NettyAvroRpcClient.appendBatch(NettyAvroRpcClient.java:364) ~[flume-ng-sdk-1.7.0.jar:1.7.0]
at org.apache.flume.api.NettyAvroRpcClient.appendBatch(NettyAvroRpcClient.java:302) ~[flume-ng-sdk-1.7.0.jar:1.7.0]
at org.apache.flume.sink.AbstractRpcSink.process(AbstractRpcSink.java:373) ~[flume-ng-core-1.7.0.jar:1.7.0]
... 3 more
Caused by: java.util.concurrent.ExecutionException: java.io.IOException: Error connecting to localhost/127.0.0.1:1103
at java.util.concurrent.FutureTask.report(FutureTask.java:122) ~[?:1.7.0_80]
at java.util.concurrent.FutureTask.get(FutureTask.java:202) ~[?:1.7.0_80]
at org.apache.flume.api.NettyAvroRpcClient.appendBatch(NettyAvroRpcClient.java:356) ~[flume-ng-sdk-1.7.0.jar:1.7.0]
at org.apache.flume.api.NettyAvroRpcClient.appendBatch(NettyAvroRpcClient.java:302) ~[flume-ng-sdk-1.7.0.jar:1.7.0]
at org.apache.flume.sink.AbstractRpcSink.process(AbstractRpcSink.java:373) ~[flume-ng-core-1.7.0.jar:1.7.0]
... 3 more
Caused by: java.io.IOException: Error connecting to localhost/127.0.0.1:1103
at org.apache.avro.ipc.NettyTransceiver.getChannel(NettyTransceiver.java:261) ~[avro-ipc-1.7.4.jar:1.7.4]
at org.apache.avro.ipc.NettyTransceiver.getRemoteName(NettyTransceiver.java:386) ~[avro-ipc-1.7.4.jar:1.7.4]
at org.apache.avro.ipc.Requestor.writeHandshake(Requestor.java:202) ~[avro-ipc-1.7.4.jar:1.7.4]
at org.apache.avro.ipc.Requestor.access$300(Requestor.java:52) ~[avro-ipc-1.7.4.jar:1.7.4]
at org.apache.avro.ipc.Requestor$Request.getBytes(Requestor.java:478) ~[avro-ipc-1.7.4.jar:1.7.4]
at org.apache.avro.ipc.Requestor.request(Requestor.java:147) ~[avro-ipc-1.7.4.jar:1.7.4]
at org.apache.avro.ipc.Requestor.request(Requestor.java:129) ~[avro-ipc-1.7.4.jar:1.7.4]
at org.apache.avro.ipc.specific.SpecificRequestor.invoke(SpecificRequestor.java:84) ~[avro-ipc-1.7.4.jar:1.7.4]
at com.sun.proxy.$Proxy20.appendBatch(Unknown Source) ~[?:?]
at org.apache.flume.api.NettyAvroRpcClient$2.call(NettyAvroRpcClient.java:347) ~[flume-ng-sdk-1.7.0.jar:1.7.0]
at org.apache.flume.api.NettyAvroRpcClient$2.call(NettyAvroRpcClient.java:343) ~[flume-ng-sdk-1.7.0.jar:1.7.0]
at java.util.concurrent.FutureTask.run(FutureTask.java:262) ~[?:1.7.0_80]
at java.util.concurrent.ThreadPoolExecutor.runWorker(ThreadPoolExecutor.java:1145) ~[?:1.7.0_80]
at java.util.concurrent.ThreadPoolExecutor$Worker.run(ThreadPoolExecutor.java:615) ~[?:1.7.0_80]
... 1 more
Caused by: java.net.ConnectException: Connection refused: localhost/127.0.0.1:1103
at sun.nio.ch.SocketChannelImpl.checkConnect(Native Method) ~[?:1.7.0_80]
at sun.nio.ch.SocketChannelImpl.finishConnect(SocketChannelImpl.java:744) ~[?:1.7.0_80]
at org.jboss.netty.channel.socket.nio.NioClientBoss.connect(NioClientBoss.java:152) ~[netty-3.9.4.Final.jar:?]
at org.jboss.netty.channel.socket.nio.NioClientBoss.processSelectedKeys(NioClientBoss.java:105) ~[netty-3.9.4.Final.jar:?]
at org.jboss.netty.channel.socket.nio.NioClientBoss.process(NioClientBoss.java:79) ~[netty-3.9.4.Final.jar:?]
at org.jboss.netty.channel.socket.nio.AbstractNioSelector.run(AbstractNioSelector.java:318) ~[netty-3.9.4.Final.jar:?]
at org.jboss.netty.channel.socket.nio.NioClientBoss.run(NioClientBoss.java:42) ~[netty-3.9.4.Final.jar:?]
at org.jboss.netty.util.ThreadRenamingRunnable.run(ThreadRenamingRunnable.java:108) ~[netty-3.9.4.Final.jar:?]
at org.jboss.netty.util.internal.DeadLockProofWorker$1.run(DeadLockProofWorker.java:42) ~[netty-3.9.4.Final.jar:?]
at java.util.concurrent.ThreadPoolExecutor.runWorker(ThreadPoolExecutor.java:1145) ~[?:1.7.0_80]
at java.util.concurrent.ThreadPoolExecutor$Worker.run(ThreadPoolExecutor.java:615) ~[?:1.7.0_80]
... 1 more
2019-05-13 07:25:40,664 main ERROR No Log4j 2 configuration file found. Using default configuration (logging only errors to the console), or user programmatically provided configurations. Set system property 'log4j2.debug' to show Log4j 2 internal initialization logging. See https://logging.apache.org/log4j/2.x/manual/configuration.html for instructions on how to configure Log4j 2
2019-05-13 07:25:40,841 main ERROR No Log4j 2 configuration file found. Using default configuration (logging only errors to the console), or user programmatically provided configurations. Set system property 'log4j2.debug' to show Log4j 2 internal initialization logging. See https://logging.apache.org/log4j/2.x/manual/configuration.html for instructions on how to configure Log4j 2
[INFO] Tests run: 3, Failures: 0, Errors: 0, Skipped: 0, Time elapsed: 2.788 s - in org.apache.logging.log4j.flume.appender.FlumeEmbeddedAgentTest
[INFO] Running org.apache.logging.log4j.flume.appender.FlumeEmbeddedAppenderTest
ERROR StatusLogger No Log4j 2 configuration file found. Using default configuration (logging only errors to the console), or user programmatically provided configurations. Set system property 'log4j2.debug' to show Log4j 2 internal initialization logging. See https://logging.apache.org/log4j/2.x/manual/configuration.html for instructions on how to configure Log4j 2
Collector listening on port 1101
Collector listening on port 1102
2019-05-13 07:25:43,341 main ERROR No Log4j 2 configuration file found. Using default configuration (logging only errors to the console), or user programmatically provided configurations. Set system property 'log4j2.debug' to show Log4j 2 internal initialization logging. See https://logging.apache.org/log4j/2.x/manual/configuration.html for instructions on how to configure Log4j 2
Collector listening on port 1103
Collector listening on port 1104
2019-05-13 07:25:44,065 [WARN] org.apache.flume.sink.FailoverSinkProcessor Sink agent1 failed and has been sent to failover list
org.apache.flume.EventDeliveryException: Failed to send events
at org.apache.flume.sink.AbstractRpcSink.process(AbstractRpcSink.java:389) ~[flume-ng-core-1.7.0.jar:1.7.0]
at org.apache.flume.sink.FailoverSinkProcessor.process(FailoverSinkProcessor.java:185) [flume-ng-core-1.7.0.jar:1.7.0]
at org.apache.flume.SinkRunner$PollingRunner.run(SinkRunner.java:145) [flume-ng-core-1.7.0.jar:1.7.0]
at java.lang.Thread.run(Thread.java:745) [?:1.7.0_80]
Caused by: org.apache.flume.EventDeliveryException: NettyAvroRpcClient { host: localhost, port: 1103 }: Failed to send batch
at org.apache.flume.api.NettyAvroRpcClient.appendBatch(NettyAvroRpcClient.java:314) ~[flume-ng-sdk-1.7.0.jar:1.7.0]
at org.apache.flume.sink.AbstractRpcSink.process(AbstractRpcSink.java:373) ~[flume-ng-core-1.7.0.jar:1.7.0]
... 3 more
Caused by: org.apache.flume.EventDeliveryException: NettyAvroRpcClient { host: localhost, port: 1103 }: RPC request exception
at org.apache.flume.api.NettyAvroRpcClient.appendBatch(NettyAvroRpcClient.java:364) ~[flume-ng-sdk-1.7.0.jar:1.7.0]
at org.apache.flume.api.NettyAvroRpcClient.appendBatch(NettyAvroRpcClient.java:302) ~[flume-ng-sdk-1.7.0.jar:1.7.0]
at org.apache.flume.sink.AbstractRpcSink.process(AbstractRpcSink.java:373) ~[flume-ng-core-1.7.0.jar:1.7.0]
... 3 more
Caused by: java.util.concurrent.ExecutionException: java.io.IOException: Error connecting to localhost/127.0.0.1:1103
at java.util.concurrent.FutureTask.report(FutureTask.java:122) ~[?:1.7.0_80]
at java.util.concurrent.FutureTask.get(FutureTask.java:202) ~[?:1.7.0_80]
at org.apache.flume.api.NettyAvroRpcClient.appendBatch(NettyAvroRpcClient.java:356) ~[flume-ng-sdk-1.7.0.jar:1.7.0]
at org.apache.flume.api.NettyAvroRpcClient.appendBatch(NettyAvroRpcClient.java:302) ~[flume-ng-sdk-1.7.0.jar:1.7.0]
at org.apache.flume.sink.AbstractRpcSink.process(AbstractRpcSink.java:373) ~[flume-ng-core-1.7.0.jar:1.7.0]
... 3 more
Caused by: java.io.IOException: Error connecting to localhost/127.0.0.1:1103
at org.apache.avro.ipc.NettyTransceiver.getChannel(NettyTransceiver.java:261) ~[avro-ipc-1.7.4.jar:1.7.4]
at org.apache.avro.ipc.NettyTransceiver.getRemoteName(NettyTransceiver.java:386) ~[avro-ipc-1.7.4.jar:1.7.4]
at org.apache.avro.ipc.Requestor.writeHandshake(Requestor.java:202) ~[avro-ipc-1.7.4.jar:1.7.4]
at org.apache.avro.ipc.Requestor.access$300(Requestor.java:52) ~[avro-ipc-1.7.4.jar:1.7.4]
at org.apache.avro.ipc.Requestor$Request.getBytes(Requestor.java:478) ~[avro-ipc-1.7.4.jar:1.7.4]
at org.apache.avro.ipc.Requestor.request(Requestor.java:147) ~[avro-ipc-1.7.4.jar:1.7.4]
at org.apache.avro.ipc.Requestor.request(Requestor.java:129) ~[avro-ipc-1.7.4.jar:1.7.4]
at org.apache.avro.ipc.specific.SpecificRequestor.invoke(SpecificRequestor.java:84) ~[avro-ipc-1.7.4.jar:1.7.4]
at com.sun.proxy.$Proxy21.appendBatch(Unknown Source) ~[?:?]
at org.apache.flume.api.NettyAvroRpcClient$2.call(NettyAvroRpcClient.java:347) ~[flume-ng-sdk-1.7.0.jar:1.7.0]
at org.apache.flume.api.NettyAvroRpcClient$2.call(NettyAvroRpcClient.java:343) ~[flume-ng-sdk-1.7.0.jar:1.7.0]
at java.util.concurrent.FutureTask.run(FutureTask.java:262) ~[?:1.7.0_80]
at java.util.concurrent.ThreadPoolExecutor.runWorker(ThreadPoolExecutor.java:1145) ~[?:1.7.0_80]
at java.util.concurrent.ThreadPoolExecutor$Worker.run(ThreadPoolExecutor.java:615) ~[?:1.7.0_80]
... 1 more
Caused by: java.net.ConnectException: Connection refused: localhost/127.0.0.1:1103
at sun.nio.ch.SocketChannelImpl.checkConnect(Native Method) ~[?:1.7.0_80]
at sun.nio.ch.SocketChannelImpl.finishConnect(SocketChannelImpl.java:744) ~[?:1.7.0_80]
at org.jboss.netty.channel.socket.nio.NioClientBoss.connect(NioClientBoss.java:152) ~[netty-3.9.4.Final.jar:?]
at org.jboss.netty.channel.socket.nio.NioClientBoss.processSelectedKeys(NioClientBoss.java:105) ~[netty-3.9.4.Final.jar:?]
at org.jboss.netty.channel.socket.nio.NioClientBoss.process(NioClientBoss.java:79) ~[netty-3.9.4.Final.jar:?]
at org.jboss.netty.channel.socket.nio.AbstractNioSelector.run(AbstractNioSelector.java:318) ~[netty-3.9.4.Final.jar:?]
at org.jboss.netty.channel.socket.nio.NioClientBoss.run(NioClientBoss.java:42) ~[netty-3.9.4.Final.jar:?]
at org.jboss.netty.util.ThreadRenamingRunnable.run(ThreadRenamingRunnable.java:108) ~[netty-3.9.4.Final.jar:?]
at org.jboss.netty.util.internal.DeadLockProofWorker$1.run(DeadLockProofWorker.java:42) ~[netty-3.9.4.Final.jar:?]
at java.util.concurrent.ThreadPoolExecutor.runWorker(ThreadPoolExecutor.java:1145) ~[?:1.7.0_80]
at java.util.concurrent.ThreadPoolExecutor$Worker.run(ThreadPoolExecutor.java:615) ~[?:1.7.0_80]
... 1 more
2019-05-13 07:25:44,117 main ERROR No Log4j 2 configuration file found. Using default configuration (logging only errors to the console), or user programmatically provided configurations. Set system property 'log4j2.debug' to show Log4j 2 internal initialization logging. See https://logging.apache.org/log4j/2.x/manual/configuration.html for instructions on how to configure Log4j 2
Collector listening on port 1105
Collector listening on port 1106
2019-05-13 07:25:44,292 main ERROR No Log4j 2 configuration file found. Using default configuration (logging only errors to the console), or user programmatically provided configurations. Set system property 'log4j2.debug' to show Log4j 2 internal initialization logging. See https://logging.apache.org/log4j/2.x/manual/configuration.html for instructions on how to configure Log4j 2
[INFO] Tests run: 3, Failures: 0, Errors: 0, Skipped: 0, Time elapsed: 2.721 s - in org.apache.logging.log4j.flume.appender.FlumeEmbeddedAppenderTest
[INFO]
[INFO] Results:
[INFO]
[INFO] Tests run: 23, Failures: 0, Errors: 0, Skipped: 0
[INFO]
Build timed out (after 240 minutes). Marking the build as failed.
Build was aborted
Jenkins build is back to normal : Log4j 2 2.x #3894
Posted by Apache Jenkins Server <je...@builds.apache.org>.
See <https://builds.apache.org/job/Log4j%202%202.x/3894/display/redirect?page=changes>