You are viewing a plain text version of this content. The canonical link for it is here.
Posted to commits@tuscany.apache.org by Apache Hudson Server <hu...@hudson.zones.apache.org> on 2009/11/21 01:47:11 UTC
Build failed in Hudson: Tuscany-SCA-J-CAA #36
See <http://hudson.zones.apache.org/hudson/job/Tuscany-SCA-J-CAA/36/>
------------------------------------------
[...truncated 5569 lines...]
[INFO] Building jar: <http://hudson.zones.apache.org/hudson/job/Tuscany-SCA-J-CAA/ws/scajcaa/sca-java-caa/JCA_10052/target/JCA_10052.jar>
[INFO] [assembly:single {execution: make-assembly}]
[INFO] Reading assembly descriptor: ../tozip.xml
[INFO] Building zip: <http://hudson.zones.apache.org/hudson/job/Tuscany-SCA-J-CAA/ws/scajcaa/sca-java-caa/JCA_10052/target/JCA_10052.zip>
[WARNING] Configuration options: 'appendAssemblyId' is set to false, and 'classifier' is missing.
Instead of attaching the assembly file: <http://hudson.zones.apache.org/hudson/job/Tuscany-SCA-J-CAA/ws/scajcaa/sca-java-caa/JCA_10052/target/JCA_10052.zip,> it will become the file for main project artifact.
NOTE: If multiple descriptors or descriptor-formats are provided for this project, the value of this file will be non-deterministic!
[WARNING] Replacing pre-existing project main-artifact file: <http://hudson.zones.apache.org/hudson/job/Tuscany-SCA-J-CAA/ws/scajcaa/sca-java-caa/JCA_10052/target/JCA_10052.jar>
with assembly file: <http://hudson.zones.apache.org/hudson/job/Tuscany-SCA-J-CAA/ws/scajcaa/sca-java-caa/JCA_10052/target/JCA_10052.zip>
[INFO] [install:install]
[INFO] Installing <http://hudson.zones.apache.org/hudson/job/Tuscany-SCA-J-CAA/ws/scajcaa/sca-java-caa/JCA_10052/target/JCA_10052.zip> to /export/home/hudson/.m2/repository/org/oasis-open/sca/j/JCA_10052/1.0/JCA_10052-1.0.jar
[HUDSON] Archiving <http://hudson.zones.apache.org/hudson/job/Tuscany-SCA-J-CAA/ws/scajcaa/sca-java-caa/JCA_10052/pom.xml> to /export/home/hudson/hudson/jobs/Tuscany-SCA-J-CAA/modules/org.oasis-open.sca.j$JCA_10052/builds/2009-11-21_00-36-32/archive/org.oasis-open.sca.j/JCA_10052/1.0/pom.xml
[HUDSON] Archiving <http://hudson.zones.apache.org/hudson/job/Tuscany-SCA-J-CAA/ws/scajcaa/sca-java-caa/JCA_10052/target/JCA_10052.zip> to /export/home/hudson/hudson/jobs/Tuscany-SCA-J-CAA/modules/org.oasis-open.sca.j$JCA_10052/builds/2009-11-21_00-36-32/archive/org.oasis-open.sca.j/JCA_10052/1.0/JCA_10052.zip
[INFO] ------------------------------------------------------------------------
[INFO] Building OASIS Java CAA TestCases - Contribution JCA_11005
[INFO] task-segment: [clean, install]
[INFO] ------------------------------------------------------------------------
[INFO] [clean:clean]
[INFO] Deleting directory <http://hudson.zones.apache.org/hudson/job/Tuscany-SCA-J-CAA/ws/scajcaa/sca-java-caa/JCA_11005/target>
[INFO] [resources:resources]
[INFO] Using default encoding to copy filtered resources.
[INFO] [compiler:compile]
[INFO] Compiling 2 source files to <http://hudson.zones.apache.org/hudson/job/Tuscany-SCA-J-CAA/ws/scajcaa/sca-java-caa/JCA_11005/target/classes>
[INFO] [resources:testResources]
[INFO] Using default encoding to copy filtered resources.
[INFO] [compiler:testCompile]
[INFO] No sources to compile
[INFO] [surefire:test]
[INFO] No tests to run.
[HUDSON] Recording test results
[INFO] [jar:jar]
[INFO] Building jar: <http://hudson.zones.apache.org/hudson/job/Tuscany-SCA-J-CAA/ws/scajcaa/sca-java-caa/JCA_11005/target/JCA_11005.jar>
[INFO] [assembly:single {execution: make-assembly}]
[INFO] Reading assembly descriptor: ../tozip.xml
[INFO] Building zip: <http://hudson.zones.apache.org/hudson/job/Tuscany-SCA-J-CAA/ws/scajcaa/sca-java-caa/JCA_11005/target/JCA_11005.zip>
[WARNING] Configuration options: 'appendAssemblyId' is set to false, and 'classifier' is missing.
Instead of attaching the assembly file: <http://hudson.zones.apache.org/hudson/job/Tuscany-SCA-J-CAA/ws/scajcaa/sca-java-caa/JCA_11005/target/JCA_11005.zip,> it will become the file for main project artifact.
NOTE: If multiple descriptors or descriptor-formats are provided for this project, the value of this file will be non-deterministic!
[WARNING] Replacing pre-existing project main-artifact file: <http://hudson.zones.apache.org/hudson/job/Tuscany-SCA-J-CAA/ws/scajcaa/sca-java-caa/JCA_11005/target/JCA_11005.jar>
with assembly file: <http://hudson.zones.apache.org/hudson/job/Tuscany-SCA-J-CAA/ws/scajcaa/sca-java-caa/JCA_11005/target/JCA_11005.zip>
[INFO] [install:install]
[INFO] Installing <http://hudson.zones.apache.org/hudson/job/Tuscany-SCA-J-CAA/ws/scajcaa/sca-java-caa/JCA_11005/target/JCA_11005.zip> to /export/home/hudson/.m2/repository/org/oasis-open/sca/j/JCA_11005/1.0/JCA_11005-1.0.jar
[HUDSON] Archiving <http://hudson.zones.apache.org/hudson/job/Tuscany-SCA-J-CAA/ws/scajcaa/sca-java-caa/JCA_11005/pom.xml> to /export/home/hudson/hudson/jobs/Tuscany-SCA-J-CAA/modules/org.oasis-open.sca.j$JCA_11005/builds/2009-11-21_00-36-32/archive/org.oasis-open.sca.j/JCA_11005/1.0/pom.xml
[HUDSON] Archiving <http://hudson.zones.apache.org/hudson/job/Tuscany-SCA-J-CAA/ws/scajcaa/sca-java-caa/JCA_11005/target/JCA_11005.zip> to /export/home/hudson/hudson/jobs/Tuscany-SCA-J-CAA/modules/org.oasis-open.sca.j$JCA_11005/builds/2009-11-21_00-36-32/archive/org.oasis-open.sca.j/JCA_11005/1.0/JCA_11005.zip
[INFO] ------------------------------------------------------------------------
[INFO] Building OASIS Java CAA TestCases - Contribution JCA_11006
[INFO] task-segment: [clean, install]
[INFO] ------------------------------------------------------------------------
[INFO] [clean:clean]
[INFO] Deleting directory <http://hudson.zones.apache.org/hudson/job/Tuscany-SCA-J-CAA/ws/scajcaa/sca-java-caa/JCA_11006/target>
[INFO] [resources:resources]
[INFO] Using default encoding to copy filtered resources.
[INFO] [compiler:compile]
[INFO] Compiling 1 source file to <http://hudson.zones.apache.org/hudson/job/Tuscany-SCA-J-CAA/ws/scajcaa/sca-java-caa/JCA_11006/target/classes>
[INFO] [resources:testResources]
[INFO] Using default encoding to copy filtered resources.
[INFO] [compiler:testCompile]
[INFO] No sources to compile
[INFO] [surefire:test]
[INFO] No tests to run.
[HUDSON] Recording test results
[INFO] [jar:jar]
[INFO] Building jar: <http://hudson.zones.apache.org/hudson/job/Tuscany-SCA-J-CAA/ws/scajcaa/sca-java-caa/JCA_11006/target/JCA_11006.jar>
[INFO] [assembly:single {execution: make-assembly}]
[INFO] Reading assembly descriptor: ../tozip.xml
[INFO] Building zip: <http://hudson.zones.apache.org/hudson/job/Tuscany-SCA-J-CAA/ws/scajcaa/sca-java-caa/JCA_11006/target/JCA_11006.zip>
[WARNING] Configuration options: 'appendAssemblyId' is set to false, and 'classifier' is missing.
Instead of attaching the assembly file: <http://hudson.zones.apache.org/hudson/job/Tuscany-SCA-J-CAA/ws/scajcaa/sca-java-caa/JCA_11006/target/JCA_11006.zip,> it will become the file for main project artifact.
NOTE: If multiple descriptors or descriptor-formats are provided for this project, the value of this file will be non-deterministic!
[WARNING] Replacing pre-existing project main-artifact file: <http://hudson.zones.apache.org/hudson/job/Tuscany-SCA-J-CAA/ws/scajcaa/sca-java-caa/JCA_11006/target/JCA_11006.jar>
with assembly file: <http://hudson.zones.apache.org/hudson/job/Tuscany-SCA-J-CAA/ws/scajcaa/sca-java-caa/JCA_11006/target/JCA_11006.zip>
[INFO] [install:install]
[INFO] Installing <http://hudson.zones.apache.org/hudson/job/Tuscany-SCA-J-CAA/ws/scajcaa/sca-java-caa/JCA_11006/target/JCA_11006.zip> to /export/home/hudson/.m2/repository/org/oasis-open/sca/j/JCA_11006/1.0/JCA_11006-1.0.jar
[HUDSON] Archiving <http://hudson.zones.apache.org/hudson/job/Tuscany-SCA-J-CAA/ws/scajcaa/sca-java-caa/JCA_11006/pom.xml> to /export/home/hudson/hudson/jobs/Tuscany-SCA-J-CAA/modules/org.oasis-open.sca.j$JCA_11006/builds/2009-11-21_00-36-32/archive/org.oasis-open.sca.j/JCA_11006/1.0/pom.xml
[HUDSON] Archiving <http://hudson.zones.apache.org/hudson/job/Tuscany-SCA-J-CAA/ws/scajcaa/sca-java-caa/JCA_11006/target/JCA_11006.zip> to /export/home/hudson/hudson/jobs/Tuscany-SCA-J-CAA/modules/org.oasis-open.sca.j$JCA_11006/builds/2009-11-21_00-36-32/archive/org.oasis-open.sca.j/JCA_11006/1.0/JCA_11006.zip
[INFO] ------------------------------------------------------------------------
[INFO] Building OASIS Java CAA TestCases - Contribution JCA_11007
[INFO] task-segment: [clean, install]
[INFO] ------------------------------------------------------------------------
[INFO] [clean:clean]
[INFO] Deleting directory <http://hudson.zones.apache.org/hudson/job/Tuscany-SCA-J-CAA/ws/scajcaa/sca-java-caa/JCA_11007/target>
[INFO] [resources:resources]
[INFO] Using default encoding to copy filtered resources.
[INFO] [compiler:compile]
[INFO] Compiling 1 source file to <http://hudson.zones.apache.org/hudson/job/Tuscany-SCA-J-CAA/ws/scajcaa/sca-java-caa/JCA_11007/target/classes>
[INFO] [resources:testResources]
[INFO] Using default encoding to copy filtered resources.
[INFO] [compiler:testCompile]
[INFO] No sources to compile
[INFO] [surefire:test]
[INFO] No tests to run.
[HUDSON] Recording test results
[INFO] [jar:jar]
[INFO] Building jar: <http://hudson.zones.apache.org/hudson/job/Tuscany-SCA-J-CAA/ws/scajcaa/sca-java-caa/JCA_11007/target/JCA_11007.jar>
[INFO] [assembly:single {execution: make-assembly}]
[INFO] Reading assembly descriptor: ../tozip.xml
[INFO] Building zip: <http://hudson.zones.apache.org/hudson/job/Tuscany-SCA-J-CAA/ws/scajcaa/sca-java-caa/JCA_11007/target/JCA_11007.zip>
[WARNING] Configuration options: 'appendAssemblyId' is set to false, and 'classifier' is missing.
Instead of attaching the assembly file: <http://hudson.zones.apache.org/hudson/job/Tuscany-SCA-J-CAA/ws/scajcaa/sca-java-caa/JCA_11007/target/JCA_11007.zip,> it will become the file for main project artifact.
NOTE: If multiple descriptors or descriptor-formats are provided for this project, the value of this file will be non-deterministic!
[WARNING] Replacing pre-existing project main-artifact file: <http://hudson.zones.apache.org/hudson/job/Tuscany-SCA-J-CAA/ws/scajcaa/sca-java-caa/JCA_11007/target/JCA_11007.jar>
with assembly file: <http://hudson.zones.apache.org/hudson/job/Tuscany-SCA-J-CAA/ws/scajcaa/sca-java-caa/JCA_11007/target/JCA_11007.zip>
[INFO] [install:install]
[INFO] Installing <http://hudson.zones.apache.org/hudson/job/Tuscany-SCA-J-CAA/ws/scajcaa/sca-java-caa/JCA_11007/target/JCA_11007.zip> to /export/home/hudson/.m2/repository/org/oasis-open/sca/j/JCA_11007/1.0/JCA_11007-1.0.jar
[HUDSON] Archiving <http://hudson.zones.apache.org/hudson/job/Tuscany-SCA-J-CAA/ws/scajcaa/sca-java-caa/JCA_11007/pom.xml> to /export/home/hudson/hudson/jobs/Tuscany-SCA-J-CAA/modules/org.oasis-open.sca.j$JCA_11007/builds/2009-11-21_00-36-32/archive/org.oasis-open.sca.j/JCA_11007/1.0/pom.xml
[HUDSON] Archiving <http://hudson.zones.apache.org/hudson/job/Tuscany-SCA-J-CAA/ws/scajcaa/sca-java-caa/JCA_11007/target/JCA_11007.zip> to /export/home/hudson/hudson/jobs/Tuscany-SCA-J-CAA/modules/org.oasis-open.sca.j$JCA_11007/builds/2009-11-21_00-36-32/archive/org.oasis-open.sca.j/JCA_11007/1.0/JCA_11007.zip
[INFO] ------------------------------------------------------------------------
[INFO] Building OASIS Java CAA TestCases - Contribution JCA_11008
[INFO] task-segment: [clean, install]
[INFO] ------------------------------------------------------------------------
[INFO] [clean:clean]
[INFO] Deleting directory <http://hudson.zones.apache.org/hudson/job/Tuscany-SCA-J-CAA/ws/scajcaa/sca-java-caa/JCA_11008/target>
[INFO] [resources:resources]
[INFO] Using default encoding to copy filtered resources.
[INFO] [compiler:compile]
[INFO] Compiling 1 source file to <http://hudson.zones.apache.org/hudson/job/Tuscany-SCA-J-CAA/ws/scajcaa/sca-java-caa/JCA_11008/target/classes>
[INFO] [resources:testResources]
[INFO] Using default encoding to copy filtered resources.
[INFO] [compiler:testCompile]
[INFO] No sources to compile
[INFO] [surefire:test]
[INFO] No tests to run.
[HUDSON] Recording test results
[INFO] [jar:jar]
[INFO] Building jar: <http://hudson.zones.apache.org/hudson/job/Tuscany-SCA-J-CAA/ws/scajcaa/sca-java-caa/JCA_11008/target/JCA_11008.jar>
[INFO] [assembly:single {execution: make-assembly}]
[INFO] Reading assembly descriptor: ../tozip.xml
[INFO] Building zip: <http://hudson.zones.apache.org/hudson/job/Tuscany-SCA-J-CAA/ws/scajcaa/sca-java-caa/JCA_11008/target/JCA_11008.zip>
[WARNING] Configuration options: 'appendAssemblyId' is set to false, and 'classifier' is missing.
Instead of attaching the assembly file: <http://hudson.zones.apache.org/hudson/job/Tuscany-SCA-J-CAA/ws/scajcaa/sca-java-caa/JCA_11008/target/JCA_11008.zip,> it will become the file for main project artifact.
NOTE: If multiple descriptors or descriptor-formats are provided for this project, the value of this file will be non-deterministic!
[WARNING] Replacing pre-existing project main-artifact file: <http://hudson.zones.apache.org/hudson/job/Tuscany-SCA-J-CAA/ws/scajcaa/sca-java-caa/JCA_11008/target/JCA_11008.jar>
with assembly file: <http://hudson.zones.apache.org/hudson/job/Tuscany-SCA-J-CAA/ws/scajcaa/sca-java-caa/JCA_11008/target/JCA_11008.zip>
[INFO] [install:install]
[INFO] Installing <http://hudson.zones.apache.org/hudson/job/Tuscany-SCA-J-CAA/ws/scajcaa/sca-java-caa/JCA_11008/target/JCA_11008.zip> to /export/home/hudson/.m2/repository/org/oasis-open/sca/j/JCA_11008/1.0/JCA_11008-1.0.jar
[HUDSON] Archiving <http://hudson.zones.apache.org/hudson/job/Tuscany-SCA-J-CAA/ws/scajcaa/sca-java-caa/JCA_11008/pom.xml> to /export/home/hudson/hudson/jobs/Tuscany-SCA-J-CAA/modules/org.oasis-open.sca.j$JCA_11008/builds/2009-11-21_00-36-32/archive/org.oasis-open.sca.j/JCA_11008/1.0/pom.xml
[HUDSON] Archiving <http://hudson.zones.apache.org/hudson/job/Tuscany-SCA-J-CAA/ws/scajcaa/sca-java-caa/JCA_11008/target/JCA_11008.zip> to /export/home/hudson/hudson/jobs/Tuscany-SCA-J-CAA/modules/org.oasis-open.sca.j$JCA_11008/builds/2009-11-21_00-36-32/archive/org.oasis-open.sca.j/JCA_11008/1.0/JCA_11008.zip
[INFO] ------------------------------------------------------------------------
[INFO] Building OASIS Java CAA TestCases - Test Client
[INFO] task-segment: [clean, install]
[INFO] ------------------------------------------------------------------------
[INFO] [clean:clean]
[INFO] Deleting directory <http://hudson.zones.apache.org/hudson/job/Tuscany-SCA-J-CAA/ws/scajcaa/sca-java-caa/Test_Client_JavaCAA/target>
[INFO] [resources:resources]
[INFO] Using default encoding to copy filtered resources.
[INFO] [compiler:compile]
[INFO] Compiling 79 source files to <http://hudson.zones.apache.org/hudson/job/Tuscany-SCA-J-CAA/ws/scajcaa/sca-java-caa/Test_Client_JavaCAA/target/classes>
[INFO] [resources:testResources]
[INFO] Using default encoding to copy filtered resources.
[INFO] [compiler:testCompile]
[INFO] No sources to compile
[INFO] [surefire:test]
[INFO] No tests to run.
[HUDSON] Recording test results
[INFO] [jar:jar]
[INFO] Building jar: <http://hudson.zones.apache.org/hudson/job/Tuscany-SCA-J-CAA/ws/scajcaa/sca-java-caa/Test_Client_JavaCAA/target/Test_Client_JavaCAA.jar>
[INFO] [install:install]
[INFO] Installing <http://hudson.zones.apache.org/hudson/job/Tuscany-SCA-J-CAA/ws/scajcaa/sca-java-caa/Test_Client_JavaCAA/target/Test_Client_JavaCAA.jar> to /export/home/hudson/.m2/repository/org/oasis-open/sca/j/Test_Client_JavaCAA/1.0/Test_Client_JavaCAA-1.0.jar
[HUDSON] Archiving <http://hudson.zones.apache.org/hudson/job/Tuscany-SCA-J-CAA/ws/scajcaa/sca-java-caa/Test_Client_JavaCAA/pom.xml> to /export/home/hudson/hudson/jobs/Tuscany-SCA-J-CAA/modules/org.oasis-open.sca.j$Test_Client_JavaCAA/builds/2009-11-21_00-36-32/archive/org.oasis-open.sca.j/Test_Client_JavaCAA/1.0/pom.xml
[HUDSON] Archiving <http://hudson.zones.apache.org/hudson/job/Tuscany-SCA-J-CAA/ws/scajcaa/sca-java-caa/Test_Client_JavaCAA/target/Test_Client_JavaCAA.jar> to /export/home/hudson/hudson/jobs/Tuscany-SCA-J-CAA/modules/org.oasis-open.sca.j$Test_Client_JavaCAA/builds/2009-11-21_00-36-32/archive/org.oasis-open.sca.j/Test_Client_JavaCAA/1.0/Test_Client_JavaCAA.jar
[INFO] ------------------------------------------------------------------------
[INFO] Building Apache Tuscany SCA Specification Tests for SCA-J CAA
[INFO] task-segment: [clean, install]
[INFO] ------------------------------------------------------------------------
[INFO] [clean:clean]
[INFO] [build-helper:add-test-source {execution: add-test-source}]
[INFO] Test Source directory: <http://hudson.zones.apache.org/hudson/job/Tuscany-SCA-J-CAA/ws/scajcaa/tuscany-java-caa-test-runner/src/test/tjava> added.
[INFO] snapshot org.apache.tuscany.sca:tuscany-binding-ws-axis2:2.0-SNAPSHOT: checking for updates from apache.snapshots
[INFO] snapshot org.apache.tuscany.sca:tuscany-databinding-axiom:2.0-SNAPSHOT: checking for updates from apache.snapshots
[INFO] snapshot org.apache.tuscany.sca:tuscany-binding-ws-axis2-policy:2.0-SNAPSHOT: checking for updates from apache.snapshots
Downloading: http://repo2.maven.org/maven2/org/apache/santuario/xmlsec/1.4.0/xmlsec-1.4.0.pom
Downloading: http://people.apache.org/repo/m2-incubating-repository/org/apache/santuario/xmlsec/1.4.0/xmlsec-1.4.0.pom
Downloading: http://svn.apache.org/repos/asf/tuscany/maven/org/apache/santuario/xmlsec/1.4.0/xmlsec-1.4.0.pom
Downloading: http://ws.zones.apache.org/repository2/org/apache/santuario/xmlsec/1.4.0/xmlsec-1.4.0.pom
Downloading: http://ftp.ussg.iu.edu/eclipse/modeling/emf/emf/maven2//org/apache/santuario/xmlsec/1.4.0/xmlsec-1.4.0.pom
Downloading: http://ftp.osuosl.org/pub/eclipse/tools/emf/maven2/org/apache/santuario/xmlsec/1.4.0/xmlsec-1.4.0.pom
Downloading: http://www.intalio.org/public/maven2/org/apache/santuario/xmlsec/1.4.0/xmlsec-1.4.0.pom
Downloading: http://download.java.net/maven/1/org.apache.santuario/poms/xmlsec-1.4.0.pom
Downloading: http://download.java.net/maven/2/org/apache/santuario/xmlsec/1.4.0/xmlsec-1.4.0.pom
Downloading: http://repo1.maven.org/maven2/org/apache/santuario/xmlsec/1.4.0/xmlsec-1.4.0.pom
Downloading: http://repo2.maven.org/maven2/opensaml/opensaml/1.1/opensaml-1.1.pom
Downloading: http://people.apache.org/repo/m2-incubating-repository/opensaml/opensaml/1.1/opensaml-1.1.pom
Downloading: http://svn.apache.org/repos/asf/tuscany/maven/opensaml/opensaml/1.1/opensaml-1.1.pom
Downloading: http://ws.zones.apache.org/repository2/opensaml/opensaml/1.1/opensaml-1.1.pom
Downloading: http://ftp.ussg.iu.edu/eclipse/modeling/emf/emf/maven2//opensaml/opensaml/1.1/opensaml-1.1.pom
Downloading: http://ftp.osuosl.org/pub/eclipse/tools/emf/maven2/opensaml/opensaml/1.1/opensaml-1.1.pom
Downloading: http://www.intalio.org/public/maven2/opensaml/opensaml/1.1/opensaml-1.1.pom
Downloading: http://download.java.net/maven/1/opensaml/poms/opensaml-1.1.pom
Downloading: http://download.java.net/maven/2/opensaml/opensaml/1.1/opensaml-1.1.pom
Downloading: http://repo1.maven.org/maven2/opensaml/opensaml/1.1/opensaml-1.1.pom
Downloading: http://repo2.maven.org/maven2/org/apache/santuario/xmlsec/1.4.1/xmlsec-1.4.1.pom
Downloading: http://people.apache.org/repo/m2-incubating-repository/org/apache/santuario/xmlsec/1.4.1/xmlsec-1.4.1.pom
Downloading: http://svn.apache.org/repos/asf/tuscany/maven/org/apache/santuario/xmlsec/1.4.1/xmlsec-1.4.1.pom
Downloading: http://ws.zones.apache.org/repository2/org/apache/santuario/xmlsec/1.4.1/xmlsec-1.4.1.pom
Downloading: http://ftp.ussg.iu.edu/eclipse/modeling/emf/emf/maven2//org/apache/santuario/xmlsec/1.4.1/xmlsec-1.4.1.pom
Downloading: http://ftp.osuosl.org/pub/eclipse/tools/emf/maven2/org/apache/santuario/xmlsec/1.4.1/xmlsec-1.4.1.pom
Downloading: http://www.intalio.org/public/maven2/org/apache/santuario/xmlsec/1.4.1/xmlsec-1.4.1.pom
Downloading: http://download.java.net/maven/1/org.apache.santuario/poms/xmlsec-1.4.1.pom
Downloading: http://download.java.net/maven/2/org/apache/santuario/xmlsec/1.4.1/xmlsec-1.4.1.pom
Downloading: http://repo1.maven.org/maven2/org/apache/santuario/xmlsec/1.4.1/xmlsec-1.4.1.pom
[INFO] snapshot org.apache.tuscany.sca:tuscany-xsd:2.0-SNAPSHOT: checking for updates from apache.snapshots
[INFO] snapshot org.apache.tuscany.sca:tuscany-xsd:2.0-SNAPSHOT: checking for updates from apache.ws
[WARNING] repository metadata for: 'snapshot org.apache.tuscany.sca:tuscany-xsd:2.0-SNAPSHOT' could not be retrieved from repository: apache.ws due to an error: Error transferring file
[INFO] Repository 'apache.ws' will be blacklisted
[INFO] snapshot org.apache.tuscany.sca:tuscany-interface-wsdl:2.0-SNAPSHOT: checking for updates from apache.snapshots
[INFO] snapshot org.apache.tuscany.sca:tuscany-binding-ws:2.0-SNAPSHOT: checking for updates from apache.snapshots
[INFO] snapshot org.apache.tuscany.sca:tuscany-binding-ws-wsdlgen:2.0-SNAPSHOT: checking for updates from apache.snapshots
[INFO] snapshot org.apache.tuscany.sca:tuscany-databinding-jaxb-axiom:2.0-SNAPSHOT: checking for updates from apache.snapshots
[INFO] snapshot org.apache.tuscany.sca:tuscany-host-http:2.0-SNAPSHOT: checking for updates from apache.snapshots
[INFO] snapshot org.apache.tuscany.sca:tuscany-policy-security:2.0-SNAPSHOT: checking for updates from apache.snapshots
[INFO] snapshot org.apache.tuscany.sca:tuscany-policy-xml-ws:2.0-SNAPSHOT: checking for updates from apache.snapshots
[INFO] [antrun:run {execution: copy-files-from-svn}]
[INFO] Executing tasks
copyResourceDir:
copySourceDir:
[sync] Removed 1 dangling directory from <http://hudson.zones.apache.org/hudson/job/Tuscany-SCA-J-CAA/ws/scajcaa/tuscany-java-caa-test-runner/src/test/java>
[sync] Removed 8 dangling files from <http://hudson.zones.apache.org/hudson/job/Tuscany-SCA-J-CAA/ws/scajcaa/tuscany-java-caa-test-runner/src/test/java>
copySourceDir:
[sync] Copying 8 files to <http://hudson.zones.apache.org/hudson/job/Tuscany-SCA-J-CAA/ws/scajcaa/tuscany-java-caa-test-runner/src/test/java/testClient>
[sync] Copying <http://hudson.zones.apache.org/hudson/job/Tuscany-SCA-J-CAA/ws/scajcaa/sca-assembly/Test_Client/src/main/java/testClient/InvokeTest.java> to <http://hudson.zones.apache.org/hudson/job/Tuscany-SCA-J-CAA/ws/scajcaa/tuscany-java-caa-test-runner/src/test/java/testClient/InvokeTest.java>
[sync] Copying <http://hudson.zones.apache.org/hudson/job/Tuscany-SCA-J-CAA/ws/scajcaa/sca-assembly/Test_Client/src/main/java/testClient/TestInvocationService.java> to <http://hudson.zones.apache.org/hudson/job/Tuscany-SCA-J-CAA/ws/scajcaa/tuscany-java-caa-test-runner/src/test/java/testClient/TestInvocationService.java>
[sync] Copying <http://hudson.zones.apache.org/hudson/job/Tuscany-SCA-J-CAA/ws/scajcaa/sca-assembly/Test_Client/src/main/java/testClient/InvokeTestResponse.java> to <http://hudson.zones.apache.org/hudson/job/Tuscany-SCA-J-CAA/ws/scajcaa/tuscany-java-caa-test-runner/src/test/java/testClient/InvokeTestResponse.java>
[sync] Copying <http://hudson.zones.apache.org/hudson/job/Tuscany-SCA-J-CAA/ws/scajcaa/sca-assembly/Test_Client/src/main/java/testClient/package-info.java> to <http://hudson.zones.apache.org/hudson/job/Tuscany-SCA-J-CAA/ws/scajcaa/tuscany-java-caa-test-runner/src/test/java/testClient/package-info.java>
[sync] Copying <http://hudson.zones.apache.org/hudson/job/Tuscany-SCA-J-CAA/ws/scajcaa/sca-assembly/Test_Client/src/main/java/testClient/TestException.java> to <http://hudson.zones.apache.org/hudson/job/Tuscany-SCA-J-CAA/ws/scajcaa/tuscany-java-caa-test-runner/src/test/java/testClient/TestException.java>
[sync] Copying <http://hudson.zones.apache.org/hudson/job/Tuscany-SCA-J-CAA/ws/scajcaa/sca-assembly/Test_Client/src/main/java/testClient/ObjectFactory.java> to <http://hudson.zones.apache.org/hudson/job/Tuscany-SCA-J-CAA/ws/scajcaa/tuscany-java-caa-test-runner/src/test/java/testClient/ObjectFactory.java>
[sync] Copying <http://hudson.zones.apache.org/hudson/job/Tuscany-SCA-J-CAA/ws/scajcaa/sca-assembly/Test_Client/src/main/java/testClient/TestInvocation.java> to <http://hudson.zones.apache.org/hudson/job/Tuscany-SCA-J-CAA/ws/scajcaa/tuscany-java-caa-test-runner/src/test/java/testClient/TestInvocation.java>
[sync] Copying <http://hudson.zones.apache.org/hudson/job/Tuscany-SCA-J-CAA/ws/scajcaa/sca-assembly/Test_Client/src/main/java/testClient/TestException_Exception.java> to <http://hudson.zones.apache.org/hudson/job/Tuscany-SCA-J-CAA/ws/scajcaa/tuscany-java-caa-test-runner/src/test/java/testClient/TestException_Exception.java>
copyFile:
[HUDSON] Archiving <http://hudson.zones.apache.org/hudson/job/Tuscany-SCA-J-CAA/ws/scajcaa/tuscany-java-caa-test-runner/pom.xml> to /export/home/hudson/hudson/jobs/Tuscany-SCA-J-CAA/modules/org.apache.tuscany.sca$tuscany-otests-sca-j-caa-tests/builds/2009-11-21_00-36-32/archive/org.apache.tuscany.sca/tuscany-otests-sca-j-caa-tests/2.0-SNAPSHOT/pom.xml
[INFO] ------------------------------------------------------------------------
[ERROR] BUILD ERROR
[INFO] ------------------------------------------------------------------------
[INFO] An Ant BuildException has occured: The following error occurred while executing this line:
<http://hudson.zones.apache.org/hudson/job/Tuscany-SCA-J-CAA/ws/scajcaa/build.xml>:53: Warning: Could not find file <http://hudson.zones.apache.org/hudson/job/Tuscany-SCA-J-CAA/ws/scajcaa/sca-assembly/Test_Client/src/main/java/client/BaseJAXWSTestCase.java> to copy.
[INFO] ------------------------------------------------------------------------
[INFO] For more information, run Maven with the -e switch
[INFO] ------------------------------------------------------------------------
[INFO] Total time: 9 minutes 40 seconds
[INFO] Finished at: Sat Nov 21 00:46:30 UTC 2009
[INFO] Final Memory: 140M/742M
[INFO] ------------------------------------------------------------------------
Waiting for Hudson to finish collecting data
Sending e-mails to: commits@tuscany.apache.org
channel stopped
Hudson build is back to normal: Tuscany-SCA-J-CAA #46
Posted by Apache Hudson Server <hu...@hudson.zones.apache.org>.
See <http://hudson.zones.apache.org/hudson/job/Tuscany-SCA-J-CAA/46/>
Build failed in Hudson: Tuscany-SCA-J-CAA #45
Posted by Apache Hudson Server <hu...@hudson.zones.apache.org>.
See <http://hudson.zones.apache.org/hudson/job/Tuscany-SCA-J-CAA/45/changes>
Changes:
[antelder] Another try at correcting the svn externals
------------------------------------------
[...truncated 19 lines...]
At revision 884885
Fetching 'https://svn.apache.org/repos/asf/tuscany/sca-java-2.x/trunk/modules/common-java' at -1 into '/zonestorage/hudson/home/hudson/hudson/jobs/Tuscany-SCA-J-CAA/workspace/scajcaa/common-java'
At revision 884885
Fetching 'https://svn.apache.org/repos/asf/tuscany/sca-java-2.x/trunk/modules/common-xml' at -1 into '/zonestorage/hudson/home/hudson/hudson/jobs/Tuscany-SCA-J-CAA/workspace/scajcaa/common-xml'
At revision 884885
Fetching 'https://svn.apache.org/repos/asf/tuscany/sca-java-2.x/trunk/modules/contribution' at -1 into '/zonestorage/hudson/home/hudson/hudson/jobs/Tuscany-SCA-J-CAA/workspace/scajcaa/contribution'
At revision 884885
Fetching 'https://svn.apache.org/repos/asf/tuscany/sca-java-2.x/trunk/modules/core' at -1 into '/zonestorage/hudson/home/hudson/hudson/jobs/Tuscany-SCA-J-CAA/workspace/scajcaa/core'
At revision 884885
Fetching 'https://svn.apache.org/repos/asf/tuscany/sca-java-2.x/trunk/modules/core-databinding' at -1 into '/zonestorage/hudson/home/hudson/hudson/jobs/Tuscany-SCA-J-CAA/workspace/scajcaa/core-databinding'
At revision 884885
Fetching 'https://svn.apache.org/repos/asf/tuscany/sca-java-2.x/trunk/modules/core-spi' at -1 into '/zonestorage/hudson/home/hudson/hudson/jobs/Tuscany-SCA-J-CAA/workspace/scajcaa/core-spi'
At revision 884885
Fetching 'https://svn.apache.org/repos/asf/tuscany/sca-java-2.x/trunk/modules/databinding' at -1 into '/zonestorage/hudson/home/hudson/hudson/jobs/Tuscany-SCA-J-CAA/workspace/scajcaa/databinding'
At revision 884885
Fetching 'https://svn.apache.org/repos/asf/tuscany/sca-java-2.x/trunk/modules/databinding-axiom' at -1 into '/zonestorage/hudson/home/hudson/hudson/jobs/Tuscany-SCA-J-CAA/workspace/scajcaa/databinding-axiom'
At revision 884885
Fetching 'https://svn.apache.org/repos/asf/tuscany/sca-java-2.x/trunk/modules/databinding-jaxb' at -1 into '/zonestorage/hudson/home/hudson/hudson/jobs/Tuscany-SCA-J-CAA/workspace/scajcaa/databinding-jaxb'
At revision 884885
Fetching 'https://svn.apache.org/repos/asf/tuscany/sca-java-2.x/trunk/modules/deployment' at -1 into '/zonestorage/hudson/home/hudson/hudson/jobs/Tuscany-SCA-J-CAA/workspace/scajcaa/deployment'
At revision 884885
Fetching 'https://svn.apache.org/repos/asf/tuscany/sca-java-2.x/trunk/modules/domain-node' at -1 into '/zonestorage/hudson/home/hudson/hudson/jobs/Tuscany-SCA-J-CAA/workspace/scajcaa/domain-node'
At revision 884885
Fetching 'https://svn.apache.org/repos/asf/tuscany/sca-java-2.x/trunk/modules/endpoint-tribes' at -1 into '/zonestorage/hudson/home/hudson/hudson/jobs/Tuscany-SCA-J-CAA/workspace/scajcaa/endpoint-tribes'
At revision 884885
Fetching 'https://svn.apache.org/repos/asf/tuscany/sca-java-2.x/trunk/modules/extensibility' at -1 into '/zonestorage/hudson/home/hudson/hudson/jobs/Tuscany-SCA-J-CAA/workspace/scajcaa/extensibility'
At revision 884885
Fetching 'https://svn.apache.org/repos/asf/tuscany/sca-java-2.x/trunk/modules/host-http' at -1 into '/zonestorage/hudson/home/hudson/hudson/jobs/Tuscany-SCA-J-CAA/workspace/scajcaa/host-http'
At revision 884885
Fetching 'https://svn.apache.org/repos/asf/tuscany/sca-java-2.x/trunk/modules/host-jetty' at -1 into '/zonestorage/hudson/home/hudson/hudson/jobs/Tuscany-SCA-J-CAA/workspace/scajcaa/host-jetty'
At revision 884885
Fetching 'https://svn.apache.org/repos/asf/tuscany/sca-java-2.x/trunk/modules/implementation-java' at -1 into '/zonestorage/hudson/home/hudson/hudson/jobs/Tuscany-SCA-J-CAA/workspace/scajcaa/implementation-java'
At revision 884885
Fetching 'https://svn.apache.org/repos/asf/tuscany/sca-java-2.x/trunk/modules/implementation-java-runtime' at -1 into '/zonestorage/hudson/home/hudson/hudson/jobs/Tuscany-SCA-J-CAA/workspace/scajcaa/implementation-java-runtime'
At revision 884886
Fetching 'https://svn.apache.org/repos/asf/tuscany/sca-java-2.x/trunk/modules/implementation-web' at -1 into '/zonestorage/hudson/home/hudson/hudson/jobs/Tuscany-SCA-J-CAA/workspace/scajcaa/implementation-web'
At revision 884886
Fetching 'https://svn.apache.org/repos/asf/tuscany/sca-java-2.x/trunk/modules/implementation-web-runtime' at -1 into '/zonestorage/hudson/home/hudson/hudson/jobs/Tuscany-SCA-J-CAA/workspace/scajcaa/implementation-web-runtime'
At revision 884886
Fetching 'https://svn.apache.org/repos/asf/tuscany/sca-java-2.x/trunk/modules/interface-java' at -1 into '/zonestorage/hudson/home/hudson/hudson/jobs/Tuscany-SCA-J-CAA/workspace/scajcaa/interface-java'
At revision 884886
Fetching 'https://svn.apache.org/repos/asf/tuscany/sca-java-2.x/trunk/modules/interface-java-jaxws' at -1 into '/zonestorage/hudson/home/hudson/hudson/jobs/Tuscany-SCA-J-CAA/workspace/scajcaa/interface-java-jaxws'
At revision 884886
Fetching 'https://svn.apache.org/repos/asf/tuscany/sca-java-2.x/trunk/modules/interface-wsdl' at -1 into '/zonestorage/hudson/home/hudson/hudson/jobs/Tuscany-SCA-J-CAA/workspace/scajcaa/interface-wsdl'
At revision 884886
Fetching 'https://svn.apache.org/repos/asf/tuscany/sca-java-2.x/trunk/modules/monitor' at -1 into '/zonestorage/hudson/home/hudson/hudson/jobs/Tuscany-SCA-J-CAA/workspace/scajcaa/monitor'
At revision 884886
Fetching 'https://svn.apache.org/repos/asf/tuscany/sca-java-2.x/trunk/modules/node-api' at -1 into '/zonestorage/hudson/home/hudson/hudson/jobs/Tuscany-SCA-J-CAA/workspace/scajcaa/node-api'
At revision 884886
Fetching 'https://svn.apache.org/repos/asf/tuscany/sca-java-2.x/trunk/modules/node-impl' at -1 into '/zonestorage/hudson/home/hudson/hudson/jobs/Tuscany-SCA-J-CAA/workspace/scajcaa/node-impl'
At revision 884886
Fetching 'https://svn.apache.org/repos/asf/tuscany/sca-java-2.x/trunk/modules/policy-security' at -1 into '/zonestorage/hudson/home/hudson/hudson/jobs/Tuscany-SCA-J-CAA/workspace/scajcaa/policy-security'
At revision 884886
Fetching 'https://svn.apache.org/repos/asf/tuscany/sca-java-2.x/trunk/modules/sca-api' at -1 into '/zonestorage/hudson/home/hudson/hudson/jobs/Tuscany-SCA-J-CAA/workspace/scajcaa/sca-api'
At revision 884886
Fetching 'https://svn.apache.org/repos/asf/tuscany/sca-java-2.x/trunk/modules/xsd' at -1 into '/zonestorage/hudson/home/hudson/hudson/jobs/Tuscany-SCA-J-CAA/workspace/scajcaa/xsd'
At revision 884886
Fetching 'https://svn.apache.org/repos/asf/tuscany/sca-java-2.x/trunk/modules/databinding-jaxb-axiom' at -1 into '/zonestorage/hudson/home/hudson/hudson/jobs/Tuscany-SCA-J-CAA/workspace/scajcaa/databinding-jaxb-axiom'
At revision 884886
Fetching 'https://svn.apache.org/repos/asf/tuscany/sca-java-2.x/trunk/modules/policy-xml-ws' at -1 into '/zonestorage/hudson/home/hudson/hudson/jobs/Tuscany-SCA-J-CAA/workspace/scajcaa/policy-xml-ws'
At revision 884886
Fetching 'https://svn.apache.org/repos/asf/tuscany/sca-java-2.x/trunk/modules/binding-ws-axis2' at -1 into '/zonestorage/hudson/home/hudson/hudson/jobs/Tuscany-SCA-J-CAA/workspace/scajcaa/binding-ws-axis2'
At revision 884886
Fetching 'https://svn.apache.org/repos/asf/tuscany/sca-java-2.x/trunk/modules/extensibility-equinox' at -1 into '/zonestorage/hudson/home/hudson/hudson/jobs/Tuscany-SCA-J-CAA/workspace/scajcaa/extensibility-equinox'
At revision 884886
Fetching 'https://svn.apache.org/repos/asf/tuscany/sca-java-2.x/trunk/modules/node-launcher-equinox' at -1 into '/zonestorage/hudson/home/hudson/hudson/jobs/Tuscany-SCA-J-CAA/workspace/scajcaa/node-launcher-equinox'
At revision 884886
Fetching 'http://tools.oasis-open.org/version-control/svn/sca-j/TestCases' at -1 into '/zonestorage/hudson/home/hudson/hudson/jobs/Tuscany-SCA-J-CAA/workspace/scajcaa/sca-java-caa'
At revision 118
Fetching 'https://svn.apache.org/repos/asf/tuscany/otest/newlayout/tuscany-java-caa-test-runner' at -1 into '/zonestorage/hudson/home/hudson/hudson/jobs/Tuscany-SCA-J-CAA/workspace/scajcaa/tuscany-java-caa-test-runner'
At revision 884886
Fetching 'https://svn.apache.org/repos/asf/tuscany/sca-java-2.x/trunk/modules/binding-sca-runtime-rmi' at -1 into '/zonestorage/hudson/home/hudson/hudson/jobs/Tuscany-SCA-J-CAA/workspace/scajcaa/binding-sca-runtime-rmi'
A binding-sca-runtime-rmi/META-INF
A binding-sca-runtime-rmi/META-INF/MANIFEST.MF
A binding-sca-runtime-rmi/NOTICE
A binding-sca-runtime-rmi/LICENSE
A binding-sca-runtime-rmi/src
A binding-sca-runtime-rmi/src/test
A binding-sca-runtime-rmi/src/test/java
A binding-sca-runtime-rmi/src/test/java/org
A binding-sca-runtime-rmi/src/test/java/org/apache
A binding-sca-runtime-rmi/src/test/java/org/apache/tuscany
A binding-sca-runtime-rmi/src/test/java/org/apache/tuscany/sca
A binding-sca-runtime-rmi/src/test/java/org/apache/tuscany/sca/binding
A binding-sca-runtime-rmi/src/test/java/org/apache/tuscany/sca/binding/sca
A binding-sca-runtime-rmi/src/test/java/org/apache/tuscany/sca/binding/sca/rmi
A binding-sca-runtime-rmi/src/test/java/org/apache/tuscany/sca/binding/sca/rmi/AsynchTestCase.java
A binding-sca-runtime-rmi/src/test/java/org/apache/tuscany/sca/binding/sca/rmi/PromotionTestCase.java
A binding-sca-runtime-rmi/src/test/java/org/apache/tuscany/sca/binding/sca/rmi/SimpleTestCase.java
A binding-sca-runtime-rmi/src/test/java/org/apache/tuscany/sca/binding/sca/rmi/CallbackTestCase.java
A binding-sca-runtime-rmi/src/test/java/org/apache/tuscany/sca/binding/sca/rmi/helloworld
A binding-sca-runtime-rmi/src/test/java/org/apache/tuscany/sca/binding/sca/rmi/helloworld/impl
A binding-sca-runtime-rmi/src/test/java/org/apache/tuscany/sca/binding/sca/rmi/helloworld/impl/HelloWorldClientCallbackRemoteImpl.java
A binding-sca-runtime-rmi/src/test/java/org/apache/tuscany/sca/binding/sca/rmi/helloworld/impl/HelloWorldClientLocalImpl.java
A binding-sca-runtime-rmi/src/test/java/org/apache/tuscany/sca/binding/sca/rmi/helloworld/impl/HelloWorldServiceCallbackRemoteImpl.java
A binding-sca-runtime-rmi/src/test/java/org/apache/tuscany/sca/binding/sca/rmi/helloworld/impl/HelloWorldClientCallbackOnewayRemoteImpl.java
A binding-sca-runtime-rmi/src/test/java/org/apache/tuscany/sca/binding/sca/rmi/helloworld/impl/HelloWorldClientRemoteImpl.java
A binding-sca-runtime-rmi/src/test/java/org/apache/tuscany/sca/binding/sca/rmi/helloworld/impl/HelloWorldServiceLocalImpl.java
A binding-sca-runtime-rmi/src/test/java/org/apache/tuscany/sca/binding/sca/rmi/helloworld/impl/HelloWorldClientRemote2Impl.java
A binding-sca-runtime-rmi/src/test/java/org/apache/tuscany/sca/binding/sca/rmi/helloworld/impl/HelloWorldServiceCallbackOnewayRemoteImpl.java
A binding-sca-runtime-rmi/src/test/java/org/apache/tuscany/sca/binding/sca/rmi/helloworld/impl/HelloWorldServiceRemoteImpl.java
A binding-sca-runtime-rmi/src/test/java/org/apache/tuscany/sca/binding/sca/rmi/helloworld/impl/HelloWorldServiceMultipleServicesImpl.java
A binding-sca-runtime-rmi/src/test/java/org/apache/tuscany/sca/binding/sca/rmi/helloworld/HelloWorldCallbackRemote.java
A binding-sca-runtime-rmi/src/test/java/org/apache/tuscany/sca/binding/sca/rmi/helloworld/HelloWorldServiceCallbackRemote.java
A binding-sca-runtime-rmi/src/test/java/org/apache/tuscany/sca/binding/sca/rmi/helloworld/HelloWorldServiceLocal.java
A binding-sca-runtime-rmi/src/test/java/org/apache/tuscany/sca/binding/sca/rmi/helloworld/HelloWorldServiceCallbackOnewayRemote.java
A binding-sca-runtime-rmi/src/test/java/org/apache/tuscany/sca/binding/sca/rmi/helloworld/HelloWorldServiceRemote.java
A binding-sca-runtime-rmi/src/test/java/org/apache/tuscany/sca/binding/sca/rmi/helloworld/HelloWorldClient.java
A binding-sca-runtime-rmi/src/test/java/org/apache/tuscany/sca/binding/sca/rmi/helloworld/HelloWorldServiceRemote2.java
A binding-sca-runtime-rmi/src/test/resources
A binding-sca-runtime-rmi/src/test/resources/asynchReference
A binding-sca-runtime-rmi/src/test/resources/asynchReference/META-INF
A binding-sca-runtime-rmi/src/test/resources/asynchReference/META-INF/sca-contribution.xml
A binding-sca-runtime-rmi/src/test/resources/asynchReference/HelloWorld.composite
A binding-sca-runtime-rmi/src/test/resources/promotionReference
A binding-sca-runtime-rmi/src/test/resources/promotionReference/HelloWorldComponent.composite
A binding-sca-runtime-rmi/src/test/resources/promotionReference/META-INF
A binding-sca-runtime-rmi/src/test/resources/promotionReference/META-INF/sca-contribution.xml
A binding-sca-runtime-rmi/src/test/resources/promotionReference/HelloWorld.composite
A binding-sca-runtime-rmi/src/test/resources/asynchService
A binding-sca-runtime-rmi/src/test/resources/asynchService/META-INF
A binding-sca-runtime-rmi/src/test/resources/asynchService/META-INF/sca-contribution.xml
A binding-sca-runtime-rmi/src/test/resources/asynchService/HelloWorld.composite
A binding-sca-runtime-rmi/src/test/resources/promotionService
A binding-sca-runtime-rmi/src/test/resources/promotionService/HelloWorldComponent.composite
A binding-sca-runtime-rmi/src/test/resources/promotionService/META-INF
A binding-sca-runtime-rmi/src/test/resources/promotionService/META-INF/sca-contribution.xml
A binding-sca-runtime-rmi/src/test/resources/promotionService/HelloWorld.composite
A binding-sca-runtime-rmi/src/test/resources/simpleReference
A binding-sca-runtime-rmi/src/test/resources/simpleReference/META-INF
A binding-sca-runtime-rmi/src/test/resources/simpleReference/META-INF/sca-contribution.xml
A binding-sca-runtime-rmi/src/test/resources/simpleReference/HelloWorld.composite
A binding-sca-runtime-rmi/src/test/resources/simpleService
A binding-sca-runtime-rmi/src/test/resources/simpleService/META-INF
A binding-sca-runtime-rmi/src/test/resources/simpleService/META-INF/sca-contribution.xml
A binding-sca-runtime-rmi/src/test/resources/simpleService/HelloWorld.composite
A binding-sca-runtime-rmi/src/test/resources/callbackReference
A binding-sca-runtime-rmi/src/test/resources/callbackReference/META-INF
A binding-sca-runtime-rmi/src/test/resources/callbackReference/META-INF/sca-contribution.xml
A binding-sca-runtime-rmi/src/test/resources/callbackReference/HelloWorld.composite
A binding-sca-runtime-rmi/src/test/resources/callbackService
A binding-sca-runtime-rmi/src/test/resources/callbackService/META-INF
A binding-sca-runtime-rmi/src/test/resources/callbackService/META-INF/sca-contribution.xml
A binding-sca-runtime-rmi/src/test/resources/callbackService/HelloWorld.composite
A binding-sca-runtime-rmi/src/main
A binding-sca-runtime-rmi/src/main/java
A binding-sca-runtime-rmi/src/main/java/org
A binding-sca-runtime-rmi/src/main/java/org/apache
A binding-sca-runtime-rmi/src/main/java/org/apache/tuscany
A binding-sca-runtime-rmi/src/main/java/org/apache/tuscany/sca
A binding-sca-runtime-rmi/src/main/java/org/apache/tuscany/sca/binding
A binding-sca-runtime-rmi/src/main/java/org/apache/tuscany/sca/binding/sca
A binding-sca-runtime-rmi/src/main/java/org/apache/tuscany/sca/binding/sca/rmi
A binding-sca-runtime-rmi/src/main/java/org/apache/tuscany/sca/binding/sca/rmi/RMISCAReferenceBindingProvider.java
A binding-sca-runtime-rmi/src/main/java/org/apache/tuscany/sca/binding/sca/rmi/RMISCAServiceBindingProvider.java
A binding-sca-runtime-rmi/src/main/java/org/apache/tuscany/sca/binding/sca/rmi/RMISCABindingProviderFactory.java
A binding-sca-runtime-rmi/src/main/resources
A binding-sca-runtime-rmi/src/main/resources/META-INF
A binding-sca-runtime-rmi/src/main/resources/META-INF/services
A binding-sca-runtime-rmi/src/main/resources/META-INF/services/org.apache.tuscany.sca.provider.BindingProviderFactory
A binding-sca-runtime-rmi/pom.xml
U binding-sca-runtime-rmi
At revision 884886
Fetching 'https://svn.apache.org/repos/asf/tuscany/sca-java-2.x/trunk/modules/sca-client-rmi' at -1 into '/zonestorage/hudson/home/hudson/hudson/jobs/Tuscany-SCA-J-CAA/workspace/scajcaa/sca-client-rmi'
A sca-client-rmi/META-INF
A sca-client-rmi/META-INF/MANIFEST.MF
A sca-client-rmi/NOTICE
A sca-client-rmi/LICENSE
A sca-client-rmi/src
A sca-client-rmi/src/test
A sca-client-rmi/src/test/java
A sca-client-rmi/src/test/java/org
A sca-client-rmi/src/test/java/org/apache
A sca-client-rmi/src/test/java/org/apache/tuscany
A sca-client-rmi/src/test/java/org/apache/tuscany/sca
A sca-client-rmi/src/test/java/org/apache/tuscany/sca/client
A sca-client-rmi/src/test/java/org/apache/tuscany/sca/client/rmi
A sca-client-rmi/src/test/java/org/apache/tuscany/sca/client/rmi/HJJTestcase.java
A sca-client-rmi/src/test/java/calculator
A sca-client-rmi/src/test/java/calculator/CalculatorService.java
A sca-client-rmi/src/test/resources
A sca-client-rmi/src/main
A sca-client-rmi/src/main/java
A sca-client-rmi/src/main/java/org
A sca-client-rmi/src/main/java/org/apache
A sca-client-rmi/src/main/java/org/apache/tuscany
A sca-client-rmi/src/main/java/org/apache/tuscany/sca
A sca-client-rmi/src/main/java/org/apache/tuscany/sca/client
A sca-client-rmi/src/main/java/org/apache/tuscany/sca/client/rmi
A sca-client-rmi/src/main/java/org/apache/tuscany/sca/client/rmi/SCAClientFactoryImpl.java
A sca-client-rmi/src/main/java/org/apache/tuscany/sca/client/rmi/SCAClientProxyHandler.java
A sca-client-rmi/src/main/resources
A sca-client-rmi/src/main/resources/META-INF
A sca-client-rmi/src/main/resources/META-INF/services
A sca-client-rmi/src/main/resources/META-INF/services/org.oasisopen.sca.client.SCAClientFactory
A sca-client-rmi/pom.xml
U sca-client-rmi
At revision 884886
Fetching 'http://tools.oasis-open.org/version-control/svn/sca-assembly/TestCases/Test_Client' at -1 into '/zonestorage/hudson/home/hudson/hudson/jobs/Tuscany-SCA-J-CAA/workspace/scajcaa/sca-assembly/Test_Client'
At revision 421
At revision 884884
no change for https://svn.apache.org/repos/asf/tuscany/sca-java-2.x/trunk/modules/assembly since the previous build
no change for https://svn.apache.org/repos/asf/tuscany/sca-java-2.x/trunk/modules/assembly-xml since the previous build
no change for https://svn.apache.org/repos/asf/tuscany/sca-java-2.x/trunk/modules/assembly-xsd since the previous build
no change for https://svn.apache.org/repos/asf/tuscany/sca-java-2.x/trunk/modules/binding-sca-runtime since the previous build
no change for https://svn.apache.org/repos/asf/tuscany/sca-java-2.x/trunk/modules/binding-ws since the previous build
no change for https://svn.apache.org/repos/asf/tuscany/sca-java-2.x/trunk/modules/binding-ws-axis2-policy since the previous build
no change for https://svn.apache.org/repos/asf/tuscany/sca-java-2.x/trunk/modules/binding-ws-wsdlgen since the previous build
no change for https://svn.apache.org/repos/asf/tuscany/sca-java-2.x/trunk/modules/builder since the previous build
no change for https://svn.apache.org/repos/asf/tuscany/sca-java-2.x/trunk/modules/common-java since the previous build
no change for https://svn.apache.org/repos/asf/tuscany/sca-java-2.x/trunk/modules/common-xml since the previous build
no change for https://svn.apache.org/repos/asf/tuscany/sca-java-2.x/trunk/modules/contribution since the previous build
no change for https://svn.apache.org/repos/asf/tuscany/sca-java-2.x/trunk/modules/core since the previous build
no change for https://svn.apache.org/repos/asf/tuscany/sca-java-2.x/trunk/modules/core-databinding since the previous build
no change for https://svn.apache.org/repos/asf/tuscany/sca-java-2.x/trunk/modules/core-spi since the previous build
no change for https://svn.apache.org/repos/asf/tuscany/sca-java-2.x/trunk/modules/databinding since the previous build
no change for https://svn.apache.org/repos/asf/tuscany/sca-java-2.x/trunk/modules/databinding-axiom since the previous build
no change for https://svn.apache.org/repos/asf/tuscany/sca-java-2.x/trunk/modules/databinding-jaxb since the previous build
no change for https://svn.apache.org/repos/asf/tuscany/sca-java-2.x/trunk/modules/deployment since the previous build
no change for https://svn.apache.org/repos/asf/tuscany/sca-java-2.x/trunk/modules/domain-node since the previous build
no change for https://svn.apache.org/repos/asf/tuscany/sca-java-2.x/trunk/modules/endpoint-tribes since the previous build
no change for https://svn.apache.org/repos/asf/tuscany/sca-java-2.x/trunk/modules/extensibility since the previous build
no change for https://svn.apache.org/repos/asf/tuscany/sca-java-2.x/trunk/modules/host-http since the previous build
no change for https://svn.apache.org/repos/asf/tuscany/sca-java-2.x/trunk/modules/host-jetty since the previous build
no change for https://svn.apache.org/repos/asf/tuscany/sca-java-2.x/trunk/modules/implementation-java since the previous build
no change for https://svn.apache.org/repos/asf/tuscany/sca-java-2.x/trunk/modules/implementation-java-runtime since the previous build
no change for https://svn.apache.org/repos/asf/tuscany/sca-java-2.x/trunk/modules/implementation-web since the previous build
no change for https://svn.apache.org/repos/asf/tuscany/sca-java-2.x/trunk/modules/implementation-web-runtime since the previous build
no change for https://svn.apache.org/repos/asf/tuscany/sca-java-2.x/trunk/modules/interface-java since the previous build
no change for https://svn.apache.org/repos/asf/tuscany/sca-java-2.x/trunk/modules/interface-java-jaxws since the previous build
no change for https://svn.apache.org/repos/asf/tuscany/sca-java-2.x/trunk/modules/interface-wsdl since the previous build
no change for https://svn.apache.org/repos/asf/tuscany/sca-java-2.x/trunk/modules/monitor since the previous build
no change for https://svn.apache.org/repos/asf/tuscany/sca-java-2.x/trunk/modules/node-api since the previous build
no change for https://svn.apache.org/repos/asf/tuscany/sca-java-2.x/trunk/modules/node-impl since the previous build
no change for https://svn.apache.org/repos/asf/tuscany/sca-java-2.x/trunk/modules/policy-security since the previous build
no change for https://svn.apache.org/repos/asf/tuscany/sca-java-2.x/trunk/modules/sca-api since the previous build
no change for https://svn.apache.org/repos/asf/tuscany/sca-java-2.x/trunk/modules/xsd since the previous build
no change for https://svn.apache.org/repos/asf/tuscany/sca-java-2.x/trunk/modules/databinding-jaxb-axiom since the previous build
no change for https://svn.apache.org/repos/asf/tuscany/sca-java-2.x/trunk/modules/policy-xml-ws since the previous build
no change for https://svn.apache.org/repos/asf/tuscany/sca-java-2.x/trunk/modules/binding-ws-axis2 since the previous build
no change for https://svn.apache.org/repos/asf/tuscany/sca-java-2.x/trunk/modules/extensibility-equinox since the previous build
no change for https://svn.apache.org/repos/asf/tuscany/sca-java-2.x/trunk/modules/node-launcher-equinox since the previous build
no change for http://tools.oasis-open.org/version-control/svn/sca-j/TestCases since the previous build
no change for https://svn.apache.org/repos/asf/tuscany/otest/newlayout/tuscany-java-caa-test-runner since the previous build
no revision recorded for https://svn.apache.org/repos/asf/tuscany/sca-java-2.x/trunk/modules/binding-sca-runtime-rmi in the previous build
no revision recorded for https://svn.apache.org/repos/asf/tuscany/sca-java-2.x/trunk/modules/sca-client-rmi in the previous build
no change for http://tools.oasis-open.org/version-control/svn/sca-assembly/TestCases/Test_Client since the previous build
Parsing POMs
ERROR: <http://hudson.zones.apache.org/hudson/job/Tuscany-SCA-J-CAA/ws/scajcaa/tuscany-java-caa-test-runner/pom.xml> is referenced from <http://hudson.zones.apache.org/hudson/job/Tuscany-SCA-J-CAA/ws/scajcaa/pom.xml> but it doesn't exist
Build failed in Hudson: Tuscany-SCA-J-CAA #44
Posted by Apache Hudson Server <hu...@hudson.zones.apache.org>.
See <http://hudson.zones.apache.org/hudson/job/Tuscany-SCA-J-CAA/44/changes>
Changes:
[kelvingoodson] add conformance statement number to error messages for ASM50001
[kelvingoodson] temporary fix to message, it should be moved into the message properties file
[antelder] Addclient and endpoint modules as theyre transitive dependencies
[antelder] Use specific column number as *** doesn't work here yet
[ramkumar] Fixesfor change in BaseJAXWSTestRunner name from BaseJAXWSTestCase
[antelder] Make the xml column references generic to cope with different xml parsers
[antelder] Try out moving the otests out of 2.x trunk by copying the tuscany/sca/java/otest folder to tuscany/otest. - A copy not a move so the old one can continued to be used. Can worry about the name tuscany/otest later
------------------------------------------
Started by user antelder
Building on master
Updating https://svn.apache.org/repos/asf/tuscany/sandbox/scajcaa
U pom.xml
U .
Fetching 'https://svn.apache.org/repos/asf/tuscany/sca-java-2.x/trunk/modules/assembly' at -1 into '/zonestorage/hudson/home/hudson/hudson/jobs/Tuscany-SCA-J-CAA/workspace/scajcaa/assembly'
U assembly/src/main/resources/org/apache/tuscany/sca/assembly/builder/assembly-validation-messages.properties
At revision 884862
Fetching 'https://svn.apache.org/repos/asf/tuscany/sca-java-2.x/trunk/modules/assembly-xml' at -1 into '/zonestorage/hudson/home/hudson/hudson/jobs/Tuscany-SCA-J-CAA/workspace/scajcaa/assembly-xml'
U assembly-xml/src/main/java/org/apache/tuscany/sca/assembly/xml/BaseAssemblyProcessor.java
At revision 884862
Fetching 'https://svn.apache.org/repos/asf/tuscany/sca-java-2.x/trunk/modules/assembly-xsd' at -1 into '/zonestorage/hudson/home/hudson/hudson/jobs/Tuscany-SCA-J-CAA/workspace/scajcaa/assembly-xsd'
At revision 884862
Fetching 'https://svn.apache.org/repos/asf/tuscany/sca-java-2.x/trunk/modules/binding-sca-runtime' at -1 into '/zonestorage/hudson/home/hudson/hudson/jobs/Tuscany-SCA-J-CAA/workspace/scajcaa/binding-sca-runtime'
At revision 884862
Fetching 'https://svn.apache.org/repos/asf/tuscany/sca-java-2.x/trunk/modules/binding-ws' at -1 into '/zonestorage/hudson/home/hudson/hudson/jobs/Tuscany-SCA-J-CAA/workspace/scajcaa/binding-ws'
At revision 884862
Fetching 'https://svn.apache.org/repos/asf/tuscany/sca-java-2.x/trunk/modules/binding-ws-axis2-policy' at -1 into '/zonestorage/hudson/home/hudson/hudson/jobs/Tuscany-SCA-J-CAA/workspace/scajcaa/binding-ws-axis2-policy'
At revision 884862
Fetching 'https://svn.apache.org/repos/asf/tuscany/sca-java-2.x/trunk/modules/binding-ws-wsdlgen' at -1 into '/zonestorage/hudson/home/hudson/hudson/jobs/Tuscany-SCA-J-CAA/workspace/scajcaa/binding-ws-wsdlgen'
At revision 884862
Fetching 'https://svn.apache.org/repos/asf/tuscany/sca-java-2.x/trunk/modules/builder' at -1 into '/zonestorage/hudson/home/hudson/hudson/jobs/Tuscany-SCA-J-CAA/workspace/scajcaa/builder'
At revision 884862
Fetching 'https://svn.apache.org/repos/asf/tuscany/sca-java-2.x/trunk/modules/common-java' at -1 into '/zonestorage/hudson/home/hudson/hudson/jobs/Tuscany-SCA-J-CAA/workspace/scajcaa/common-java'
At revision 884862
Fetching 'https://svn.apache.org/repos/asf/tuscany/sca-java-2.x/trunk/modules/common-xml' at -1 into '/zonestorage/hudson/home/hudson/hudson/jobs/Tuscany-SCA-J-CAA/workspace/scajcaa/common-xml'
At revision 884862
Fetching 'https://svn.apache.org/repos/asf/tuscany/sca-java-2.x/trunk/modules/contribution' at -1 into '/zonestorage/hudson/home/hudson/hudson/jobs/Tuscany-SCA-J-CAA/workspace/scajcaa/contribution'
At revision 884862
Fetching 'https://svn.apache.org/repos/asf/tuscany/sca-java-2.x/trunk/modules/core' at -1 into '/zonestorage/hudson/home/hudson/hudson/jobs/Tuscany-SCA-J-CAA/workspace/scajcaa/core'
At revision 884862
Fetching 'https://svn.apache.org/repos/asf/tuscany/sca-java-2.x/trunk/modules/core-databinding' at -1 into '/zonestorage/hudson/home/hudson/hudson/jobs/Tuscany-SCA-J-CAA/workspace/scajcaa/core-databinding'
At revision 884862
Fetching 'https://svn.apache.org/repos/asf/tuscany/sca-java-2.x/trunk/modules/core-spi' at -1 into '/zonestorage/hudson/home/hudson/hudson/jobs/Tuscany-SCA-J-CAA/workspace/scajcaa/core-spi'
At revision 884862
Fetching 'https://svn.apache.org/repos/asf/tuscany/sca-java-2.x/trunk/modules/databinding' at -1 into '/zonestorage/hudson/home/hudson/hudson/jobs/Tuscany-SCA-J-CAA/workspace/scajcaa/databinding'
At revision 884862
Fetching 'https://svn.apache.org/repos/asf/tuscany/sca-java-2.x/trunk/modules/databinding-axiom' at -1 into '/zonestorage/hudson/home/hudson/hudson/jobs/Tuscany-SCA-J-CAA/workspace/scajcaa/databinding-axiom'
At revision 884862
Fetching 'https://svn.apache.org/repos/asf/tuscany/sca-java-2.x/trunk/modules/databinding-jaxb' at -1 into '/zonestorage/hudson/home/hudson/hudson/jobs/Tuscany-SCA-J-CAA/workspace/scajcaa/databinding-jaxb'
At revision 884862
Fetching 'https://svn.apache.org/repos/asf/tuscany/sca-java-2.x/trunk/modules/deployment' at -1 into '/zonestorage/hudson/home/hudson/hudson/jobs/Tuscany-SCA-J-CAA/workspace/scajcaa/deployment'
At revision 884862
Fetching 'https://svn.apache.org/repos/asf/tuscany/sca-java-2.x/trunk/modules/domain-node' at -1 into '/zonestorage/hudson/home/hudson/hudson/jobs/Tuscany-SCA-J-CAA/workspace/scajcaa/domain-node'
At revision 884862
Fetching 'https://svn.apache.org/repos/asf/tuscany/sca-java-2.x/trunk/modules/endpoint-tribes' at -1 into '/zonestorage/hudson/home/hudson/hudson/jobs/Tuscany-SCA-J-CAA/workspace/scajcaa/endpoint-tribes'
At revision 884862
Fetching 'https://svn.apache.org/repos/asf/tuscany/sca-java-2.x/trunk/modules/extensibility' at -1 into '/zonestorage/hudson/home/hudson/hudson/jobs/Tuscany-SCA-J-CAA/workspace/scajcaa/extensibility'
At revision 884862
Fetching 'https://svn.apache.org/repos/asf/tuscany/sca-java-2.x/trunk/modules/host-http' at -1 into '/zonestorage/hudson/home/hudson/hudson/jobs/Tuscany-SCA-J-CAA/workspace/scajcaa/host-http'
At revision 884862
Fetching 'https://svn.apache.org/repos/asf/tuscany/sca-java-2.x/trunk/modules/host-jetty' at -1 into '/zonestorage/hudson/home/hudson/hudson/jobs/Tuscany-SCA-J-CAA/workspace/scajcaa/host-jetty'
At revision 884862
Fetching 'https://svn.apache.org/repos/asf/tuscany/sca-java-2.x/trunk/modules/implementation-java' at -1 into '/zonestorage/hudson/home/hudson/hudson/jobs/Tuscany-SCA-J-CAA/workspace/scajcaa/implementation-java'
At revision 884862
Fetching 'https://svn.apache.org/repos/asf/tuscany/sca-java-2.x/trunk/modules/implementation-java-runtime' at -1 into '/zonestorage/hudson/home/hudson/hudson/jobs/Tuscany-SCA-J-CAA/workspace/scajcaa/implementation-java-runtime'
At revision 884862
Fetching 'https://svn.apache.org/repos/asf/tuscany/sca-java-2.x/trunk/modules/implementation-web' at -1 into '/zonestorage/hudson/home/hudson/hudson/jobs/Tuscany-SCA-J-CAA/workspace/scajcaa/implementation-web'
At revision 884862
Fetching 'https://svn.apache.org/repos/asf/tuscany/sca-java-2.x/trunk/modules/implementation-web-runtime' at -1 into '/zonestorage/hudson/home/hudson/hudson/jobs/Tuscany-SCA-J-CAA/workspace/scajcaa/implementation-web-runtime'
At revision 884862
Fetching 'https://svn.apache.org/repos/asf/tuscany/sca-java-2.x/trunk/modules/interface-java' at -1 into '/zonestorage/hudson/home/hudson/hudson/jobs/Tuscany-SCA-J-CAA/workspace/scajcaa/interface-java'
At revision 884862
Fetching 'https://svn.apache.org/repos/asf/tuscany/sca-java-2.x/trunk/modules/interface-java-jaxws' at -1 into '/zonestorage/hudson/home/hudson/hudson/jobs/Tuscany-SCA-J-CAA/workspace/scajcaa/interface-java-jaxws'
At revision 884862
Fetching 'https://svn.apache.org/repos/asf/tuscany/sca-java-2.x/trunk/modules/interface-wsdl' at -1 into '/zonestorage/hudson/home/hudson/hudson/jobs/Tuscany-SCA-J-CAA/workspace/scajcaa/interface-wsdl'
At revision 884862
Fetching 'https://svn.apache.org/repos/asf/tuscany/sca-java-2.x/trunk/modules/monitor' at -1 into '/zonestorage/hudson/home/hudson/hudson/jobs/Tuscany-SCA-J-CAA/workspace/scajcaa/monitor'
At revision 884862
Fetching 'https://svn.apache.org/repos/asf/tuscany/sca-java-2.x/trunk/modules/node-api' at -1 into '/zonestorage/hudson/home/hudson/hudson/jobs/Tuscany-SCA-J-CAA/workspace/scajcaa/node-api'
At revision 884862
Fetching 'https://svn.apache.org/repos/asf/tuscany/sca-java-2.x/trunk/modules/node-impl' at -1 into '/zonestorage/hudson/home/hudson/hudson/jobs/Tuscany-SCA-J-CAA/workspace/scajcaa/node-impl'
At revision 884862
Fetching 'https://svn.apache.org/repos/asf/tuscany/sca-java-2.x/trunk/modules/policy-security' at -1 into '/zonestorage/hudson/home/hudson/hudson/jobs/Tuscany-SCA-J-CAA/workspace/scajcaa/policy-security'
At revision 884862
Fetching 'https://svn.apache.org/repos/asf/tuscany/sca-java-2.x/trunk/modules/sca-api' at -1 into '/zonestorage/hudson/home/hudson/hudson/jobs/Tuscany-SCA-J-CAA/workspace/scajcaa/sca-api'
At revision 884862
Fetching 'https://svn.apache.org/repos/asf/tuscany/sca-java-2.x/trunk/modules/sca-client-impl' at -1 into '/zonestorage/hudson/home/hudson/hudson/jobs/Tuscany-SCA-J-CAA/workspace/scajcaa/sca-client-impl'
At revision 884862
Fetching 'https://svn.apache.org/repos/asf/tuscany/sca-java-2.x/trunk/modules/xsd' at -1 into '/zonestorage/hudson/home/hudson/hudson/jobs/Tuscany-SCA-J-CAA/workspace/scajcaa/xsd'
At revision 884862
Fetching 'https://svn.apache.org/repos/asf/tuscany/sca-java-2.x/trunk/modules/databinding-jaxb-axiom' at -1 into '/zonestorage/hudson/home/hudson/hudson/jobs/Tuscany-SCA-J-CAA/workspace/scajcaa/databinding-jaxb-axiom'
At revision 884862
Fetching 'https://svn.apache.org/repos/asf/tuscany/sca-java-2.x/trunk/modules/policy-xml-ws' at -1 into '/zonestorage/hudson/home/hudson/hudson/jobs/Tuscany-SCA-J-CAA/workspace/scajcaa/policy-xml-ws'
At revision 884862
Fetching 'https://svn.apache.org/repos/asf/tuscany/sca-java-2.x/trunk/modules/binding-ws-axis2' at -1 into '/zonestorage/hudson/home/hudson/hudson/jobs/Tuscany-SCA-J-CAA/workspace/scajcaa/binding-ws-axis2'
At revision 884862
Fetching 'https://svn.apache.org/repos/asf/tuscany/sca-java-2.x/trunk/modules/extensibility-equinox' at -1 into '/zonestorage/hudson/home/hudson/hudson/jobs/Tuscany-SCA-J-CAA/workspace/scajcaa/extensibility-equinox'
At revision 884862
Fetching 'https://svn.apache.org/repos/asf/tuscany/sca-java-2.x/trunk/modules/node-launcher-equinox' at -1 into '/zonestorage/hudson/home/hudson/hudson/jobs/Tuscany-SCA-J-CAA/workspace/scajcaa/node-launcher-equinox'
At revision 884862
Fetching 'http://tools.oasis-open.org/version-control/svn/sca-j/TestCases' at -1 into '/zonestorage/hudson/home/hudson/hudson/jobs/Tuscany-SCA-J-CAA/workspace/scajcaa/sca-java-caa'
At revision 118
Fetching 'https://svn.apache.org/repos/asf/tuscany/otest/newlayout/tuscany-java-caa-test-runner' at -1 into '/zonestorage/hudson/home/hudson/hudson/jobs/Tuscany-SCA-J-CAA/workspace/scajcaa/tuscany-java-caa-test-runner'
D tuscany-java-caa-test-runner/src/test/resources
D tuscany-java-caa-test-runner/src/test/tjava
U tuscany-java-caa-test-runner/src/test
D tuscany-java-caa-test-runner/src/main
D tuscany-java-caa-test-runner/pom.xml
U tuscany-java-caa-test-runner
At revision 884862
Fetching 'http://tools.oasis-open.org/version-control/svn/sca-assembly/TestCases/Test_Client' at -1 into '/zonestorage/hudson/home/hudson/hudson/jobs/Tuscany-SCA-J-CAA/workspace/scajcaa/sca-assembly/Test_Client'
At revision 421
At revision 884862
no change for https://svn.apache.org/repos/asf/tuscany/sca-java-2.x/trunk/modules/assembly-xsd since the previous build
no change for https://svn.apache.org/repos/asf/tuscany/sca-java-2.x/trunk/modules/binding-sca-runtime since the previous build
no change for https://svn.apache.org/repos/asf/tuscany/sca-java-2.x/trunk/modules/binding-ws since the previous build
no change for https://svn.apache.org/repos/asf/tuscany/sca-java-2.x/trunk/modules/binding-ws-axis2-policy since the previous build
no change for https://svn.apache.org/repos/asf/tuscany/sca-java-2.x/trunk/modules/binding-ws-wsdlgen since the previous build
no change for https://svn.apache.org/repos/asf/tuscany/sca-java-2.x/trunk/modules/builder since the previous build
no change for https://svn.apache.org/repos/asf/tuscany/sca-java-2.x/trunk/modules/common-java since the previous build
no change for https://svn.apache.org/repos/asf/tuscany/sca-java-2.x/trunk/modules/common-xml since the previous build
no change for https://svn.apache.org/repos/asf/tuscany/sca-java-2.x/trunk/modules/contribution since the previous build
no change for https://svn.apache.org/repos/asf/tuscany/sca-java-2.x/trunk/modules/core since the previous build
no change for https://svn.apache.org/repos/asf/tuscany/sca-java-2.x/trunk/modules/core-databinding since the previous build
no change for https://svn.apache.org/repos/asf/tuscany/sca-java-2.x/trunk/modules/core-spi since the previous build
no change for https://svn.apache.org/repos/asf/tuscany/sca-java-2.x/trunk/modules/databinding since the previous build
no change for https://svn.apache.org/repos/asf/tuscany/sca-java-2.x/trunk/modules/databinding-axiom since the previous build
no change for https://svn.apache.org/repos/asf/tuscany/sca-java-2.x/trunk/modules/databinding-jaxb since the previous build
no change for https://svn.apache.org/repos/asf/tuscany/sca-java-2.x/trunk/modules/deployment since the previous build
no change for https://svn.apache.org/repos/asf/tuscany/sca-java-2.x/trunk/modules/domain-node since the previous build
no change for https://svn.apache.org/repos/asf/tuscany/sca-java-2.x/trunk/modules/endpoint-tribes since the previous build
no change for https://svn.apache.org/repos/asf/tuscany/sca-java-2.x/trunk/modules/extensibility since the previous build
no change for https://svn.apache.org/repos/asf/tuscany/sca-java-2.x/trunk/modules/host-http since the previous build
no change for https://svn.apache.org/repos/asf/tuscany/sca-java-2.x/trunk/modules/host-jetty since the previous build
no change for https://svn.apache.org/repos/asf/tuscany/sca-java-2.x/trunk/modules/implementation-java since the previous build
no change for https://svn.apache.org/repos/asf/tuscany/sca-java-2.x/trunk/modules/implementation-java-runtime since the previous build
no change for https://svn.apache.org/repos/asf/tuscany/sca-java-2.x/trunk/modules/implementation-web since the previous build
no change for https://svn.apache.org/repos/asf/tuscany/sca-java-2.x/trunk/modules/implementation-web-runtime since the previous build
no change for https://svn.apache.org/repos/asf/tuscany/sca-java-2.x/trunk/modules/interface-java since the previous build
no change for https://svn.apache.org/repos/asf/tuscany/sca-java-2.x/trunk/modules/interface-java-jaxws since the previous build
no change for https://svn.apache.org/repos/asf/tuscany/sca-java-2.x/trunk/modules/interface-wsdl since the previous build
no change for https://svn.apache.org/repos/asf/tuscany/sca-java-2.x/trunk/modules/monitor since the previous build
no change for https://svn.apache.org/repos/asf/tuscany/sca-java-2.x/trunk/modules/node-api since the previous build
no change for https://svn.apache.org/repos/asf/tuscany/sca-java-2.x/trunk/modules/node-impl since the previous build
no change for https://svn.apache.org/repos/asf/tuscany/sca-java-2.x/trunk/modules/policy-security since the previous build
no change for https://svn.apache.org/repos/asf/tuscany/sca-java-2.x/trunk/modules/sca-api since the previous build
no change for https://svn.apache.org/repos/asf/tuscany/sca-java-2.x/trunk/modules/sca-client-impl since the previous build
no change for https://svn.apache.org/repos/asf/tuscany/sca-java-2.x/trunk/modules/xsd since the previous build
no change for https://svn.apache.org/repos/asf/tuscany/sca-java-2.x/trunk/modules/databinding-jaxb-axiom since the previous build
no change for https://svn.apache.org/repos/asf/tuscany/sca-java-2.x/trunk/modules/policy-xml-ws since the previous build
no change for https://svn.apache.org/repos/asf/tuscany/sca-java-2.x/trunk/modules/binding-ws-axis2 since the previous build
no change for https://svn.apache.org/repos/asf/tuscany/sca-java-2.x/trunk/modules/extensibility-equinox since the previous build
no change for https://svn.apache.org/repos/asf/tuscany/sca-java-2.x/trunk/modules/node-launcher-equinox since the previous build
no change for http://tools.oasis-open.org/version-control/svn/sca-j/TestCases since the previous build
no change for http://tools.oasis-open.org/version-control/svn/sca-assembly/TestCases/Test_Client since the previous build
Parsing POMs
ERROR: <http://hudson.zones.apache.org/hudson/job/Tuscany-SCA-J-CAA/ws/scajcaa/sca-client-rmi> is referenced from <http://hudson.zones.apache.org/hudson/job/Tuscany-SCA-J-CAA/ws/scajcaa/pom.xml> but it doesn't exist
Build failed in Hudson: Tuscany-SCA-J-CAA #43
Posted by Apache Hudson Server <hu...@hudson.zones.apache.org>.
See <http://hudson.zones.apache.org/hudson/job/Tuscany-SCA-J-CAA/43/changes>
Changes:
[antelder] Update externals for svn moves
------------------------------------------
[...truncated 6090 lines...]
[INFO] [compiler:compile]
[INFO] Compiling 1 source file to <http://hudson.zones.apache.org/hudson/job/Tuscany-SCA-J-CAA/ws/scajcaa/sca-java-caa/JCA_10052/target/classes>
[INFO] [resources:testResources]
[INFO] Using default encoding to copy filtered resources.
[INFO] [compiler:testCompile]
[INFO] No sources to compile
[INFO] [surefire:test]
[INFO] No tests to run.
[HUDSON] Recording test results
[INFO] [jar:jar]
[INFO] Building jar: <http://hudson.zones.apache.org/hudson/job/Tuscany-SCA-J-CAA/ws/scajcaa/sca-java-caa/JCA_10052/target/JCA_10052.jar>
[INFO] [assembly:single {execution: make-assembly}]
[INFO] Reading assembly descriptor: ../tozip.xml
[INFO] Building zip: <http://hudson.zones.apache.org/hudson/job/Tuscany-SCA-J-CAA/ws/scajcaa/sca-java-caa/JCA_10052/target/JCA_10052.zip>
[WARNING] Configuration options: 'appendAssemblyId' is set to false, and 'classifier' is missing.
Instead of attaching the assembly file: <http://hudson.zones.apache.org/hudson/job/Tuscany-SCA-J-CAA/ws/scajcaa/sca-java-caa/JCA_10052/target/JCA_10052.zip,> it will become the file for main project artifact.
NOTE: If multiple descriptors or descriptor-formats are provided for this project, the value of this file will be non-deterministic!
[WARNING] Replacing pre-existing project main-artifact file: <http://hudson.zones.apache.org/hudson/job/Tuscany-SCA-J-CAA/ws/scajcaa/sca-java-caa/JCA_10052/target/JCA_10052.jar>
with assembly file: <http://hudson.zones.apache.org/hudson/job/Tuscany-SCA-J-CAA/ws/scajcaa/sca-java-caa/JCA_10052/target/JCA_10052.zip>
[INFO] [install:install]
[INFO] Installing <http://hudson.zones.apache.org/hudson/job/Tuscany-SCA-J-CAA/ws/scajcaa/sca-java-caa/JCA_10052/target/JCA_10052.zip> to /export/home/hudson/.m2/repository/org/oasis-open/sca/j/JCA_10052/1.0/JCA_10052-1.0.jar
[HUDSON] Archiving <http://hudson.zones.apache.org/hudson/job/Tuscany-SCA-J-CAA/ws/scajcaa/sca-java-caa/JCA_10052/pom.xml> to /export/home/hudson/hudson/jobs/Tuscany-SCA-J-CAA/modules/org.oasis-open.sca.j$JCA_10052/builds/2009-11-27_09-46-02/archive/org.oasis-open.sca.j/JCA_10052/1.0/pom.xml
[HUDSON] Archiving <http://hudson.zones.apache.org/hudson/job/Tuscany-SCA-J-CAA/ws/scajcaa/sca-java-caa/JCA_10052/target/JCA_10052.zip> to /export/home/hudson/hudson/jobs/Tuscany-SCA-J-CAA/modules/org.oasis-open.sca.j$JCA_10052/builds/2009-11-27_09-46-02/archive/org.oasis-open.sca.j/JCA_10052/1.0/JCA_10052.zip
[INFO] ------------------------------------------------------------------------
[INFO] Building OASIS Java CAA TestCases - Contribution JCA_11005
[INFO] task-segment: [clean, install]
[INFO] ------------------------------------------------------------------------
[INFO] [clean:clean]
[INFO] Deleting directory <http://hudson.zones.apache.org/hudson/job/Tuscany-SCA-J-CAA/ws/scajcaa/sca-java-caa/JCA_11005/target>
[INFO] [resources:resources]
[INFO] Using default encoding to copy filtered resources.
[INFO] [compiler:compile]
[INFO] Compiling 2 source files to <http://hudson.zones.apache.org/hudson/job/Tuscany-SCA-J-CAA/ws/scajcaa/sca-java-caa/JCA_11005/target/classes>
[INFO] [resources:testResources]
[INFO] Using default encoding to copy filtered resources.
[INFO] [compiler:testCompile]
[INFO] No sources to compile
[INFO] [surefire:test]
[INFO] No tests to run.
[HUDSON] Recording test results
[INFO] [jar:jar]
[INFO] Building jar: <http://hudson.zones.apache.org/hudson/job/Tuscany-SCA-J-CAA/ws/scajcaa/sca-java-caa/JCA_11005/target/JCA_11005.jar>
[INFO] [assembly:single {execution: make-assembly}]
[INFO] Reading assembly descriptor: ../tozip.xml
[INFO] Building zip: <http://hudson.zones.apache.org/hudson/job/Tuscany-SCA-J-CAA/ws/scajcaa/sca-java-caa/JCA_11005/target/JCA_11005.zip>
[WARNING] Configuration options: 'appendAssemblyId' is set to false, and 'classifier' is missing.
Instead of attaching the assembly file: <http://hudson.zones.apache.org/hudson/job/Tuscany-SCA-J-CAA/ws/scajcaa/sca-java-caa/JCA_11005/target/JCA_11005.zip,> it will become the file for main project artifact.
NOTE: If multiple descriptors or descriptor-formats are provided for this project, the value of this file will be non-deterministic!
[WARNING] Replacing pre-existing project main-artifact file: <http://hudson.zones.apache.org/hudson/job/Tuscany-SCA-J-CAA/ws/scajcaa/sca-java-caa/JCA_11005/target/JCA_11005.jar>
with assembly file: <http://hudson.zones.apache.org/hudson/job/Tuscany-SCA-J-CAA/ws/scajcaa/sca-java-caa/JCA_11005/target/JCA_11005.zip>
[INFO] [install:install]
[INFO] Installing <http://hudson.zones.apache.org/hudson/job/Tuscany-SCA-J-CAA/ws/scajcaa/sca-java-caa/JCA_11005/target/JCA_11005.zip> to /export/home/hudson/.m2/repository/org/oasis-open/sca/j/JCA_11005/1.0/JCA_11005-1.0.jar
[HUDSON] Archiving <http://hudson.zones.apache.org/hudson/job/Tuscany-SCA-J-CAA/ws/scajcaa/sca-java-caa/JCA_11005/pom.xml> to /export/home/hudson/hudson/jobs/Tuscany-SCA-J-CAA/modules/org.oasis-open.sca.j$JCA_11005/builds/2009-11-27_09-46-02/archive/org.oasis-open.sca.j/JCA_11005/1.0/pom.xml
[HUDSON] Archiving <http://hudson.zones.apache.org/hudson/job/Tuscany-SCA-J-CAA/ws/scajcaa/sca-java-caa/JCA_11005/target/JCA_11005.zip> to /export/home/hudson/hudson/jobs/Tuscany-SCA-J-CAA/modules/org.oasis-open.sca.j$JCA_11005/builds/2009-11-27_09-46-02/archive/org.oasis-open.sca.j/JCA_11005/1.0/JCA_11005.zip
[INFO] ------------------------------------------------------------------------
[INFO] Building OASIS Java CAA TestCases - Contribution JCA_11006
[INFO] task-segment: [clean, install]
[INFO] ------------------------------------------------------------------------
[INFO] [clean:clean]
[INFO] Deleting directory <http://hudson.zones.apache.org/hudson/job/Tuscany-SCA-J-CAA/ws/scajcaa/sca-java-caa/JCA_11006/target>
[INFO] [resources:resources]
[INFO] Using default encoding to copy filtered resources.
[INFO] [compiler:compile]
[INFO] Compiling 1 source file to <http://hudson.zones.apache.org/hudson/job/Tuscany-SCA-J-CAA/ws/scajcaa/sca-java-caa/JCA_11006/target/classes>
[INFO] [resources:testResources]
[INFO] Using default encoding to copy filtered resources.
[INFO] [compiler:testCompile]
[INFO] No sources to compile
[INFO] [surefire:test]
[INFO] No tests to run.
[HUDSON] Recording test results
[INFO] [jar:jar]
[INFO] Building jar: <http://hudson.zones.apache.org/hudson/job/Tuscany-SCA-J-CAA/ws/scajcaa/sca-java-caa/JCA_11006/target/JCA_11006.jar>
[INFO] [assembly:single {execution: make-assembly}]
[INFO] Reading assembly descriptor: ../tozip.xml
[INFO] Building zip: <http://hudson.zones.apache.org/hudson/job/Tuscany-SCA-J-CAA/ws/scajcaa/sca-java-caa/JCA_11006/target/JCA_11006.zip>
[WARNING] Configuration options: 'appendAssemblyId' is set to false, and 'classifier' is missing.
Instead of attaching the assembly file: <http://hudson.zones.apache.org/hudson/job/Tuscany-SCA-J-CAA/ws/scajcaa/sca-java-caa/JCA_11006/target/JCA_11006.zip,> it will become the file for main project artifact.
NOTE: If multiple descriptors or descriptor-formats are provided for this project, the value of this file will be non-deterministic!
[WARNING] Replacing pre-existing project main-artifact file: <http://hudson.zones.apache.org/hudson/job/Tuscany-SCA-J-CAA/ws/scajcaa/sca-java-caa/JCA_11006/target/JCA_11006.jar>
with assembly file: <http://hudson.zones.apache.org/hudson/job/Tuscany-SCA-J-CAA/ws/scajcaa/sca-java-caa/JCA_11006/target/JCA_11006.zip>
[INFO] [install:install]
[INFO] Installing <http://hudson.zones.apache.org/hudson/job/Tuscany-SCA-J-CAA/ws/scajcaa/sca-java-caa/JCA_11006/target/JCA_11006.zip> to /export/home/hudson/.m2/repository/org/oasis-open/sca/j/JCA_11006/1.0/JCA_11006-1.0.jar
[HUDSON] Archiving <http://hudson.zones.apache.org/hudson/job/Tuscany-SCA-J-CAA/ws/scajcaa/sca-java-caa/JCA_11006/pom.xml> to /export/home/hudson/hudson/jobs/Tuscany-SCA-J-CAA/modules/org.oasis-open.sca.j$JCA_11006/builds/2009-11-27_09-46-02/archive/org.oasis-open.sca.j/JCA_11006/1.0/pom.xml
[HUDSON] Archiving <http://hudson.zones.apache.org/hudson/job/Tuscany-SCA-J-CAA/ws/scajcaa/sca-java-caa/JCA_11006/target/JCA_11006.zip> to /export/home/hudson/hudson/jobs/Tuscany-SCA-J-CAA/modules/org.oasis-open.sca.j$JCA_11006/builds/2009-11-27_09-46-02/archive/org.oasis-open.sca.j/JCA_11006/1.0/JCA_11006.zip
[INFO] ------------------------------------------------------------------------
[INFO] Building OASIS Java CAA TestCases - Contribution JCA_11007
[INFO] task-segment: [clean, install]
[INFO] ------------------------------------------------------------------------
[INFO] [clean:clean]
[INFO] Deleting directory <http://hudson.zones.apache.org/hudson/job/Tuscany-SCA-J-CAA/ws/scajcaa/sca-java-caa/JCA_11007/target>
[INFO] [resources:resources]
[INFO] Using default encoding to copy filtered resources.
[INFO] [compiler:compile]
[INFO] Compiling 1 source file to <http://hudson.zones.apache.org/hudson/job/Tuscany-SCA-J-CAA/ws/scajcaa/sca-java-caa/JCA_11007/target/classes>
[INFO] [resources:testResources]
[INFO] Using default encoding to copy filtered resources.
[INFO] [compiler:testCompile]
[INFO] No sources to compile
[INFO] [surefire:test]
[INFO] No tests to run.
[HUDSON] Recording test results
[INFO] [jar:jar]
[INFO] Building jar: <http://hudson.zones.apache.org/hudson/job/Tuscany-SCA-J-CAA/ws/scajcaa/sca-java-caa/JCA_11007/target/JCA_11007.jar>
[INFO] [assembly:single {execution: make-assembly}]
[INFO] Reading assembly descriptor: ../tozip.xml
[INFO] Building zip: <http://hudson.zones.apache.org/hudson/job/Tuscany-SCA-J-CAA/ws/scajcaa/sca-java-caa/JCA_11007/target/JCA_11007.zip>
[WARNING] Configuration options: 'appendAssemblyId' is set to false, and 'classifier' is missing.
Instead of attaching the assembly file: <http://hudson.zones.apache.org/hudson/job/Tuscany-SCA-J-CAA/ws/scajcaa/sca-java-caa/JCA_11007/target/JCA_11007.zip,> it will become the file for main project artifact.
NOTE: If multiple descriptors or descriptor-formats are provided for this project, the value of this file will be non-deterministic!
[WARNING] Replacing pre-existing project main-artifact file: <http://hudson.zones.apache.org/hudson/job/Tuscany-SCA-J-CAA/ws/scajcaa/sca-java-caa/JCA_11007/target/JCA_11007.jar>
with assembly file: <http://hudson.zones.apache.org/hudson/job/Tuscany-SCA-J-CAA/ws/scajcaa/sca-java-caa/JCA_11007/target/JCA_11007.zip>
[INFO] [install:install]
[INFO] Installing <http://hudson.zones.apache.org/hudson/job/Tuscany-SCA-J-CAA/ws/scajcaa/sca-java-caa/JCA_11007/target/JCA_11007.zip> to /export/home/hudson/.m2/repository/org/oasis-open/sca/j/JCA_11007/1.0/JCA_11007-1.0.jar
[HUDSON] Archiving <http://hudson.zones.apache.org/hudson/job/Tuscany-SCA-J-CAA/ws/scajcaa/sca-java-caa/JCA_11007/pom.xml> to /export/home/hudson/hudson/jobs/Tuscany-SCA-J-CAA/modules/org.oasis-open.sca.j$JCA_11007/builds/2009-11-27_09-46-02/archive/org.oasis-open.sca.j/JCA_11007/1.0/pom.xml
[HUDSON] Archiving <http://hudson.zones.apache.org/hudson/job/Tuscany-SCA-J-CAA/ws/scajcaa/sca-java-caa/JCA_11007/target/JCA_11007.zip> to /export/home/hudson/hudson/jobs/Tuscany-SCA-J-CAA/modules/org.oasis-open.sca.j$JCA_11007/builds/2009-11-27_09-46-02/archive/org.oasis-open.sca.j/JCA_11007/1.0/JCA_11007.zip
[INFO] ------------------------------------------------------------------------
[INFO] Building OASIS Java CAA TestCases - Contribution JCA_11008
[INFO] task-segment: [clean, install]
[INFO] ------------------------------------------------------------------------
[INFO] [clean:clean]
[INFO] Deleting directory <http://hudson.zones.apache.org/hudson/job/Tuscany-SCA-J-CAA/ws/scajcaa/sca-java-caa/JCA_11008/target>
[INFO] [resources:resources]
[INFO] Using default encoding to copy filtered resources.
[INFO] [compiler:compile]
[INFO] Compiling 1 source file to <http://hudson.zones.apache.org/hudson/job/Tuscany-SCA-J-CAA/ws/scajcaa/sca-java-caa/JCA_11008/target/classes>
[INFO] [resources:testResources]
[INFO] Using default encoding to copy filtered resources.
[INFO] [compiler:testCompile]
[INFO] No sources to compile
[INFO] [surefire:test]
[INFO] No tests to run.
[HUDSON] Recording test results
[INFO] [jar:jar]
[INFO] Building jar: <http://hudson.zones.apache.org/hudson/job/Tuscany-SCA-J-CAA/ws/scajcaa/sca-java-caa/JCA_11008/target/JCA_11008.jar>
[INFO] [assembly:single {execution: make-assembly}]
[INFO] Reading assembly descriptor: ../tozip.xml
[INFO] Building zip: <http://hudson.zones.apache.org/hudson/job/Tuscany-SCA-J-CAA/ws/scajcaa/sca-java-caa/JCA_11008/target/JCA_11008.zip>
[WARNING] Configuration options: 'appendAssemblyId' is set to false, and 'classifier' is missing.
Instead of attaching the assembly file: <http://hudson.zones.apache.org/hudson/job/Tuscany-SCA-J-CAA/ws/scajcaa/sca-java-caa/JCA_11008/target/JCA_11008.zip,> it will become the file for main project artifact.
NOTE: If multiple descriptors or descriptor-formats are provided for this project, the value of this file will be non-deterministic!
[WARNING] Replacing pre-existing project main-artifact file: <http://hudson.zones.apache.org/hudson/job/Tuscany-SCA-J-CAA/ws/scajcaa/sca-java-caa/JCA_11008/target/JCA_11008.jar>
with assembly file: <http://hudson.zones.apache.org/hudson/job/Tuscany-SCA-J-CAA/ws/scajcaa/sca-java-caa/JCA_11008/target/JCA_11008.zip>
[INFO] [install:install]
[INFO] Installing <http://hudson.zones.apache.org/hudson/job/Tuscany-SCA-J-CAA/ws/scajcaa/sca-java-caa/JCA_11008/target/JCA_11008.zip> to /export/home/hudson/.m2/repository/org/oasis-open/sca/j/JCA_11008/1.0/JCA_11008-1.0.jar
[HUDSON] Archiving <http://hudson.zones.apache.org/hudson/job/Tuscany-SCA-J-CAA/ws/scajcaa/sca-java-caa/JCA_11008/pom.xml> to /export/home/hudson/hudson/jobs/Tuscany-SCA-J-CAA/modules/org.oasis-open.sca.j$JCA_11008/builds/2009-11-27_09-46-02/archive/org.oasis-open.sca.j/JCA_11008/1.0/pom.xml
[HUDSON] Archiving <http://hudson.zones.apache.org/hudson/job/Tuscany-SCA-J-CAA/ws/scajcaa/sca-java-caa/JCA_11008/target/JCA_11008.zip> to /export/home/hudson/hudson/jobs/Tuscany-SCA-J-CAA/modules/org.oasis-open.sca.j$JCA_11008/builds/2009-11-27_09-46-02/archive/org.oasis-open.sca.j/JCA_11008/1.0/JCA_11008.zip
[INFO] ------------------------------------------------------------------------
[INFO] Building OASIS Java CAA TestCases - Test Client
[INFO] task-segment: [clean, install]
[INFO] ------------------------------------------------------------------------
[INFO] [clean:clean]
[INFO] Deleting directory <http://hudson.zones.apache.org/hudson/job/Tuscany-SCA-J-CAA/ws/scajcaa/sca-java-caa/Test_Client_JavaCAA/target>
[INFO] [resources:resources]
[INFO] Using default encoding to copy filtered resources.
[INFO] [compiler:compile]
[INFO] Compiling 79 source files to <http://hudson.zones.apache.org/hudson/job/Tuscany-SCA-J-CAA/ws/scajcaa/sca-java-caa/Test_Client_JavaCAA/target/classes>
[INFO] [resources:testResources]
[INFO] Using default encoding to copy filtered resources.
[INFO] [compiler:testCompile]
[INFO] No sources to compile
[INFO] [surefire:test]
[INFO] No tests to run.
[HUDSON] Recording test results
[INFO] [jar:jar]
[INFO] Building jar: <http://hudson.zones.apache.org/hudson/job/Tuscany-SCA-J-CAA/ws/scajcaa/sca-java-caa/Test_Client_JavaCAA/target/Test_Client_JavaCAA.jar>
[INFO] [install:install]
[INFO] Installing <http://hudson.zones.apache.org/hudson/job/Tuscany-SCA-J-CAA/ws/scajcaa/sca-java-caa/Test_Client_JavaCAA/target/Test_Client_JavaCAA.jar> to /export/home/hudson/.m2/repository/org/oasis-open/sca/j/Test_Client_JavaCAA/1.0/Test_Client_JavaCAA-1.0.jar
[HUDSON] Archiving <http://hudson.zones.apache.org/hudson/job/Tuscany-SCA-J-CAA/ws/scajcaa/sca-java-caa/Test_Client_JavaCAA/pom.xml> to /export/home/hudson/hudson/jobs/Tuscany-SCA-J-CAA/modules/org.oasis-open.sca.j$Test_Client_JavaCAA/builds/2009-11-27_09-46-02/archive/org.oasis-open.sca.j/Test_Client_JavaCAA/1.0/pom.xml
[HUDSON] Archiving <http://hudson.zones.apache.org/hudson/job/Tuscany-SCA-J-CAA/ws/scajcaa/sca-java-caa/Test_Client_JavaCAA/target/Test_Client_JavaCAA.jar> to /export/home/hudson/hudson/jobs/Tuscany-SCA-J-CAA/modules/org.oasis-open.sca.j$Test_Client_JavaCAA/builds/2009-11-27_09-46-02/archive/org.oasis-open.sca.j/Test_Client_JavaCAA/1.0/Test_Client_JavaCAA.jar
[INFO] ------------------------------------------------------------------------
[INFO] Building Apache Tuscany SCA Specification Tests for SCA-J CAA
[INFO] task-segment: [clean, install]
[INFO] ------------------------------------------------------------------------
[INFO] [clean:clean]
[INFO] [build-helper:add-test-source {execution: add-test-source}]
[INFO] Test Source directory: <http://hudson.zones.apache.org/hudson/job/Tuscany-SCA-J-CAA/ws/scajcaa/tuscany-java-caa-test-runner/src/test/tjava> added.
Downloading: http://repo2.maven.org/maven2/org/apache/santuario/xmlsec/1.4.0/xmlsec-1.4.0.pom
Downloading: http://people.apache.org/repo/m2-incubating-repository/org/apache/santuario/xmlsec/1.4.0/xmlsec-1.4.0.pom
Downloading: http://svn.apache.org/repos/asf/tuscany/maven/org/apache/santuario/xmlsec/1.4.0/xmlsec-1.4.0.pom
Downloading: http://ws.zones.apache.org/repository2/org/apache/santuario/xmlsec/1.4.0/xmlsec-1.4.0.pom
Downloading: http://ftp.ussg.iu.edu/eclipse/modeling/emf/emf/maven2//org/apache/santuario/xmlsec/1.4.0/xmlsec-1.4.0.pom
Downloading: http://ftp.osuosl.org/pub/eclipse/tools/emf/maven2/org/apache/santuario/xmlsec/1.4.0/xmlsec-1.4.0.pom
Downloading: http://www.intalio.org/public/maven2/org/apache/santuario/xmlsec/1.4.0/xmlsec-1.4.0.pom
Downloading: http://download.java.net/maven/1/org.apache.santuario/poms/xmlsec-1.4.0.pom
Downloading: http://download.java.net/maven/2/org/apache/santuario/xmlsec/1.4.0/xmlsec-1.4.0.pom
Downloading: http://repo1.maven.org/maven2/org/apache/santuario/xmlsec/1.4.0/xmlsec-1.4.0.pom
Downloading: http://repo2.maven.org/maven2/opensaml/opensaml/1.1/opensaml-1.1.pom
Downloading: http://people.apache.org/repo/m2-incubating-repository/opensaml/opensaml/1.1/opensaml-1.1.pom
Downloading: http://svn.apache.org/repos/asf/tuscany/maven/opensaml/opensaml/1.1/opensaml-1.1.pom
Downloading: http://ws.zones.apache.org/repository2/opensaml/opensaml/1.1/opensaml-1.1.pom
Downloading: http://ftp.ussg.iu.edu/eclipse/modeling/emf/emf/maven2//opensaml/opensaml/1.1/opensaml-1.1.pom
Downloading: http://ftp.osuosl.org/pub/eclipse/tools/emf/maven2/opensaml/opensaml/1.1/opensaml-1.1.pom
Downloading: http://www.intalio.org/public/maven2/opensaml/opensaml/1.1/opensaml-1.1.pom
Downloading: http://download.java.net/maven/1/opensaml/poms/opensaml-1.1.pom
Downloading: http://download.java.net/maven/2/opensaml/opensaml/1.1/opensaml-1.1.pom
Downloading: http://repo1.maven.org/maven2/opensaml/opensaml/1.1/opensaml-1.1.pom
Downloading: http://repo2.maven.org/maven2/org/apache/santuario/xmlsec/1.4.1/xmlsec-1.4.1.pom
Downloading: http://people.apache.org/repo/m2-incubating-repository/org/apache/santuario/xmlsec/1.4.1/xmlsec-1.4.1.pom
Downloading: http://svn.apache.org/repos/asf/tuscany/maven/org/apache/santuario/xmlsec/1.4.1/xmlsec-1.4.1.pom
Downloading: http://ws.zones.apache.org/repository2/org/apache/santuario/xmlsec/1.4.1/xmlsec-1.4.1.pom
Downloading: http://ftp.ussg.iu.edu/eclipse/modeling/emf/emf/maven2//org/apache/santuario/xmlsec/1.4.1/xmlsec-1.4.1.pom
Downloading: http://ftp.osuosl.org/pub/eclipse/tools/emf/maven2/org/apache/santuario/xmlsec/1.4.1/xmlsec-1.4.1.pom
Downloading: http://www.intalio.org/public/maven2/org/apache/santuario/xmlsec/1.4.1/xmlsec-1.4.1.pom
Downloading: http://download.java.net/maven/1/org.apache.santuario/poms/xmlsec-1.4.1.pom
Downloading: http://download.java.net/maven/2/org/apache/santuario/xmlsec/1.4.1/xmlsec-1.4.1.pom
Downloading: http://repo1.maven.org/maven2/org/apache/santuario/xmlsec/1.4.1/xmlsec-1.4.1.pom
[INFO] snapshot org.apache.tuscany.sca:tuscany-xsd:2.0-SNAPSHOT: checking for updates from apache.ws
[WARNING] repository metadata for: 'snapshot org.apache.tuscany.sca:tuscany-xsd:2.0-SNAPSHOT' could not be retrieved from repository: apache.ws due to an error: Error transferring file
[INFO] Repository 'apache.ws' will be blacklisted
[INFO] [antrun:run {execution: copy-files-from-svn}]
[INFO] Executing tasks
copyResourceDir:
copySourceDir:
[sync] Removed 1 dangling directory from <http://hudson.zones.apache.org/hudson/job/Tuscany-SCA-J-CAA/ws/scajcaa/tuscany-java-caa-test-runner/src/test/java>
[sync] Removed 8 dangling files from <http://hudson.zones.apache.org/hudson/job/Tuscany-SCA-J-CAA/ws/scajcaa/tuscany-java-caa-test-runner/src/test/java>
copySourceDir:
[sync] Copying 8 files to <http://hudson.zones.apache.org/hudson/job/Tuscany-SCA-J-CAA/ws/scajcaa/tuscany-java-caa-test-runner/src/test/java/testClient>
[sync] Copying <http://hudson.zones.apache.org/hudson/job/Tuscany-SCA-J-CAA/ws/scajcaa/sca-assembly/Test_Client/src/main/java/testClient/InvokeTest.java> to <http://hudson.zones.apache.org/hudson/job/Tuscany-SCA-J-CAA/ws/scajcaa/tuscany-java-caa-test-runner/src/test/java/testClient/InvokeTest.java>
[sync] Copying <http://hudson.zones.apache.org/hudson/job/Tuscany-SCA-J-CAA/ws/scajcaa/sca-assembly/Test_Client/src/main/java/testClient/TestInvocationService.java> to <http://hudson.zones.apache.org/hudson/job/Tuscany-SCA-J-CAA/ws/scajcaa/tuscany-java-caa-test-runner/src/test/java/testClient/TestInvocationService.java>
[sync] Copying <http://hudson.zones.apache.org/hudson/job/Tuscany-SCA-J-CAA/ws/scajcaa/sca-assembly/Test_Client/src/main/java/testClient/InvokeTestResponse.java> to <http://hudson.zones.apache.org/hudson/job/Tuscany-SCA-J-CAA/ws/scajcaa/tuscany-java-caa-test-runner/src/test/java/testClient/InvokeTestResponse.java>
[sync] Copying <http://hudson.zones.apache.org/hudson/job/Tuscany-SCA-J-CAA/ws/scajcaa/sca-assembly/Test_Client/src/main/java/testClient/package-info.java> to <http://hudson.zones.apache.org/hudson/job/Tuscany-SCA-J-CAA/ws/scajcaa/tuscany-java-caa-test-runner/src/test/java/testClient/package-info.java>
[sync] Copying <http://hudson.zones.apache.org/hudson/job/Tuscany-SCA-J-CAA/ws/scajcaa/sca-assembly/Test_Client/src/main/java/testClient/TestException.java> to <http://hudson.zones.apache.org/hudson/job/Tuscany-SCA-J-CAA/ws/scajcaa/tuscany-java-caa-test-runner/src/test/java/testClient/TestException.java>
[sync] Copying <http://hudson.zones.apache.org/hudson/job/Tuscany-SCA-J-CAA/ws/scajcaa/sca-assembly/Test_Client/src/main/java/testClient/ObjectFactory.java> to <http://hudson.zones.apache.org/hudson/job/Tuscany-SCA-J-CAA/ws/scajcaa/tuscany-java-caa-test-runner/src/test/java/testClient/ObjectFactory.java>
[sync] Copying <http://hudson.zones.apache.org/hudson/job/Tuscany-SCA-J-CAA/ws/scajcaa/sca-assembly/Test_Client/src/main/java/testClient/TestInvocation.java> to <http://hudson.zones.apache.org/hudson/job/Tuscany-SCA-J-CAA/ws/scajcaa/tuscany-java-caa-test-runner/src/test/java/testClient/TestInvocation.java>
[sync] Copying <http://hudson.zones.apache.org/hudson/job/Tuscany-SCA-J-CAA/ws/scajcaa/sca-assembly/Test_Client/src/main/java/testClient/TestException_Exception.java> to <http://hudson.zones.apache.org/hudson/job/Tuscany-SCA-J-CAA/ws/scajcaa/tuscany-java-caa-test-runner/src/test/java/testClient/TestException_Exception.java>
copyFile:
[HUDSON] Archiving <http://hudson.zones.apache.org/hudson/job/Tuscany-SCA-J-CAA/ws/scajcaa/tuscany-java-caa-test-runner/pom.xml> to /export/home/hudson/hudson/jobs/Tuscany-SCA-J-CAA/modules/org.apache.tuscany.sca$tuscany-otests-sca-j-caa-tests/builds/2009-11-27_09-46-02/archive/org.apache.tuscany.sca/tuscany-otests-sca-j-caa-tests/2.0-SNAPSHOT/pom.xml
[INFO] ------------------------------------------------------------------------
[ERROR] BUILD ERROR
[INFO] ------------------------------------------------------------------------
[INFO] An Ant BuildException has occured: The following error occurred while executing this line:
<http://hudson.zones.apache.org/hudson/job/Tuscany-SCA-J-CAA/ws/scajcaa/build.xml>:53: Warning: Could not find file <http://hudson.zones.apache.org/hudson/job/Tuscany-SCA-J-CAA/ws/scajcaa/sca-assembly/Test_Client/src/main/java/client/BaseJAXWSTestCase.java> to copy.
[INFO] ------------------------------------------------------------------------
[INFO] For more information, run Maven with the -e switch
[INFO] ------------------------------------------------------------------------
[INFO] Total time: 44 minutes 1 second
[INFO] Finished at: Fri Nov 27 10:30:26 UTC 2009
[INFO] Final Memory: 144M/742M
[INFO] ------------------------------------------------------------------------
Waiting for Hudson to finish collecting data
Sending e-mails to: commits@tuscany.apache.org
Sending e-mails to: commits@tuscany.apache.org
channel stopped
Build failed in Hudson: Tuscany-SCA-J-CAA #42
Posted by Apache Hudson Server <hu...@hudson.zones.apache.org>.
See <http://hudson.zones.apache.org/hudson/job/Tuscany-SCA-J-CAA/42/>
------------------------------------------
[...truncated 5557 lines...]
[INFO] Building jar: <http://hudson.zones.apache.org/hudson/job/Tuscany-SCA-J-CAA/ws/scajcaa/sca-java-caa/JCA_10052/target/JCA_10052.jar>
[INFO] [assembly:single {execution: make-assembly}]
[INFO] Reading assembly descriptor: ../tozip.xml
[INFO] Building zip: <http://hudson.zones.apache.org/hudson/job/Tuscany-SCA-J-CAA/ws/scajcaa/sca-java-caa/JCA_10052/target/JCA_10052.zip>
[WARNING] Configuration options: 'appendAssemblyId' is set to false, and 'classifier' is missing.
Instead of attaching the assembly file: <http://hudson.zones.apache.org/hudson/job/Tuscany-SCA-J-CAA/ws/scajcaa/sca-java-caa/JCA_10052/target/JCA_10052.zip,> it will become the file for main project artifact.
NOTE: If multiple descriptors or descriptor-formats are provided for this project, the value of this file will be non-deterministic!
[WARNING] Replacing pre-existing project main-artifact file: <http://hudson.zones.apache.org/hudson/job/Tuscany-SCA-J-CAA/ws/scajcaa/sca-java-caa/JCA_10052/target/JCA_10052.jar>
with assembly file: <http://hudson.zones.apache.org/hudson/job/Tuscany-SCA-J-CAA/ws/scajcaa/sca-java-caa/JCA_10052/target/JCA_10052.zip>
[INFO] [install:install]
[INFO] Installing <http://hudson.zones.apache.org/hudson/job/Tuscany-SCA-J-CAA/ws/scajcaa/sca-java-caa/JCA_10052/target/JCA_10052.zip> to /export/home/hudson/.m2/repository/org/oasis-open/sca/j/JCA_10052/1.0/JCA_10052-1.0.jar
[HUDSON] Archiving <http://hudson.zones.apache.org/hudson/job/Tuscany-SCA-J-CAA/ws/scajcaa/sca-java-caa/JCA_10052/pom.xml> to /export/home/hudson/hudson/jobs/Tuscany-SCA-J-CAA/modules/org.oasis-open.sca.j$JCA_10052/builds/2009-11-27_00-51-04/archive/org.oasis-open.sca.j/JCA_10052/1.0/pom.xml
[HUDSON] Archiving <http://hudson.zones.apache.org/hudson/job/Tuscany-SCA-J-CAA/ws/scajcaa/sca-java-caa/JCA_10052/target/JCA_10052.zip> to /export/home/hudson/hudson/jobs/Tuscany-SCA-J-CAA/modules/org.oasis-open.sca.j$JCA_10052/builds/2009-11-27_00-51-04/archive/org.oasis-open.sca.j/JCA_10052/1.0/JCA_10052.zip
[INFO] ------------------------------------------------------------------------
[INFO] Building OASIS Java CAA TestCases - Contribution JCA_11005
[INFO] task-segment: [clean, install]
[INFO] ------------------------------------------------------------------------
[INFO] [clean:clean]
[INFO] Deleting directory <http://hudson.zones.apache.org/hudson/job/Tuscany-SCA-J-CAA/ws/scajcaa/sca-java-caa/JCA_11005/target>
[INFO] [resources:resources]
[INFO] Using default encoding to copy filtered resources.
[INFO] [compiler:compile]
[INFO] Compiling 2 source files to <http://hudson.zones.apache.org/hudson/job/Tuscany-SCA-J-CAA/ws/scajcaa/sca-java-caa/JCA_11005/target/classes>
[INFO] [resources:testResources]
[INFO] Using default encoding to copy filtered resources.
[INFO] [compiler:testCompile]
[INFO] No sources to compile
[INFO] [surefire:test]
[INFO] No tests to run.
[HUDSON] Recording test results
[INFO] [jar:jar]
[INFO] Building jar: <http://hudson.zones.apache.org/hudson/job/Tuscany-SCA-J-CAA/ws/scajcaa/sca-java-caa/JCA_11005/target/JCA_11005.jar>
[INFO] [assembly:single {execution: make-assembly}]
[INFO] Reading assembly descriptor: ../tozip.xml
[INFO] Building zip: <http://hudson.zones.apache.org/hudson/job/Tuscany-SCA-J-CAA/ws/scajcaa/sca-java-caa/JCA_11005/target/JCA_11005.zip>
[WARNING] Configuration options: 'appendAssemblyId' is set to false, and 'classifier' is missing.
Instead of attaching the assembly file: <http://hudson.zones.apache.org/hudson/job/Tuscany-SCA-J-CAA/ws/scajcaa/sca-java-caa/JCA_11005/target/JCA_11005.zip,> it will become the file for main project artifact.
NOTE: If multiple descriptors or descriptor-formats are provided for this project, the value of this file will be non-deterministic!
[WARNING] Replacing pre-existing project main-artifact file: <http://hudson.zones.apache.org/hudson/job/Tuscany-SCA-J-CAA/ws/scajcaa/sca-java-caa/JCA_11005/target/JCA_11005.jar>
with assembly file: <http://hudson.zones.apache.org/hudson/job/Tuscany-SCA-J-CAA/ws/scajcaa/sca-java-caa/JCA_11005/target/JCA_11005.zip>
[INFO] [install:install]
[INFO] Installing <http://hudson.zones.apache.org/hudson/job/Tuscany-SCA-J-CAA/ws/scajcaa/sca-java-caa/JCA_11005/target/JCA_11005.zip> to /export/home/hudson/.m2/repository/org/oasis-open/sca/j/JCA_11005/1.0/JCA_11005-1.0.jar
[HUDSON] Archiving <http://hudson.zones.apache.org/hudson/job/Tuscany-SCA-J-CAA/ws/scajcaa/sca-java-caa/JCA_11005/pom.xml> to /export/home/hudson/hudson/jobs/Tuscany-SCA-J-CAA/modules/org.oasis-open.sca.j$JCA_11005/builds/2009-11-27_00-51-04/archive/org.oasis-open.sca.j/JCA_11005/1.0/pom.xml
[HUDSON] Archiving <http://hudson.zones.apache.org/hudson/job/Tuscany-SCA-J-CAA/ws/scajcaa/sca-java-caa/JCA_11005/target/JCA_11005.zip> to /export/home/hudson/hudson/jobs/Tuscany-SCA-J-CAA/modules/org.oasis-open.sca.j$JCA_11005/builds/2009-11-27_00-51-04/archive/org.oasis-open.sca.j/JCA_11005/1.0/JCA_11005.zip
[INFO] ------------------------------------------------------------------------
[INFO] Building OASIS Java CAA TestCases - Contribution JCA_11006
[INFO] task-segment: [clean, install]
[INFO] ------------------------------------------------------------------------
[INFO] [clean:clean]
[INFO] Deleting directory <http://hudson.zones.apache.org/hudson/job/Tuscany-SCA-J-CAA/ws/scajcaa/sca-java-caa/JCA_11006/target>
[INFO] [resources:resources]
[INFO] Using default encoding to copy filtered resources.
[INFO] [compiler:compile]
[INFO] Compiling 1 source file to <http://hudson.zones.apache.org/hudson/job/Tuscany-SCA-J-CAA/ws/scajcaa/sca-java-caa/JCA_11006/target/classes>
[INFO] [resources:testResources]
[INFO] Using default encoding to copy filtered resources.
[INFO] [compiler:testCompile]
[INFO] No sources to compile
[INFO] [surefire:test]
[INFO] No tests to run.
[HUDSON] Recording test results
[INFO] [jar:jar]
[INFO] Building jar: <http://hudson.zones.apache.org/hudson/job/Tuscany-SCA-J-CAA/ws/scajcaa/sca-java-caa/JCA_11006/target/JCA_11006.jar>
[INFO] [assembly:single {execution: make-assembly}]
[INFO] Reading assembly descriptor: ../tozip.xml
[INFO] Building zip: <http://hudson.zones.apache.org/hudson/job/Tuscany-SCA-J-CAA/ws/scajcaa/sca-java-caa/JCA_11006/target/JCA_11006.zip>
[WARNING] Configuration options: 'appendAssemblyId' is set to false, and 'classifier' is missing.
Instead of attaching the assembly file: <http://hudson.zones.apache.org/hudson/job/Tuscany-SCA-J-CAA/ws/scajcaa/sca-java-caa/JCA_11006/target/JCA_11006.zip,> it will become the file for main project artifact.
NOTE: If multiple descriptors or descriptor-formats are provided for this project, the value of this file will be non-deterministic!
[WARNING] Replacing pre-existing project main-artifact file: <http://hudson.zones.apache.org/hudson/job/Tuscany-SCA-J-CAA/ws/scajcaa/sca-java-caa/JCA_11006/target/JCA_11006.jar>
with assembly file: <http://hudson.zones.apache.org/hudson/job/Tuscany-SCA-J-CAA/ws/scajcaa/sca-java-caa/JCA_11006/target/JCA_11006.zip>
[INFO] [install:install]
[INFO] Installing <http://hudson.zones.apache.org/hudson/job/Tuscany-SCA-J-CAA/ws/scajcaa/sca-java-caa/JCA_11006/target/JCA_11006.zip> to /export/home/hudson/.m2/repository/org/oasis-open/sca/j/JCA_11006/1.0/JCA_11006-1.0.jar
[HUDSON] Archiving <http://hudson.zones.apache.org/hudson/job/Tuscany-SCA-J-CAA/ws/scajcaa/sca-java-caa/JCA_11006/pom.xml> to /export/home/hudson/hudson/jobs/Tuscany-SCA-J-CAA/modules/org.oasis-open.sca.j$JCA_11006/builds/2009-11-27_00-51-04/archive/org.oasis-open.sca.j/JCA_11006/1.0/pom.xml
[HUDSON] Archiving <http://hudson.zones.apache.org/hudson/job/Tuscany-SCA-J-CAA/ws/scajcaa/sca-java-caa/JCA_11006/target/JCA_11006.zip> to /export/home/hudson/hudson/jobs/Tuscany-SCA-J-CAA/modules/org.oasis-open.sca.j$JCA_11006/builds/2009-11-27_00-51-04/archive/org.oasis-open.sca.j/JCA_11006/1.0/JCA_11006.zip
[INFO] ------------------------------------------------------------------------
[INFO] Building OASIS Java CAA TestCases - Contribution JCA_11007
[INFO] task-segment: [clean, install]
[INFO] ------------------------------------------------------------------------
[INFO] [clean:clean]
[INFO] Deleting directory <http://hudson.zones.apache.org/hudson/job/Tuscany-SCA-J-CAA/ws/scajcaa/sca-java-caa/JCA_11007/target>
[INFO] [resources:resources]
[INFO] Using default encoding to copy filtered resources.
[INFO] [compiler:compile]
[INFO] Compiling 1 source file to <http://hudson.zones.apache.org/hudson/job/Tuscany-SCA-J-CAA/ws/scajcaa/sca-java-caa/JCA_11007/target/classes>
[INFO] [resources:testResources]
[INFO] Using default encoding to copy filtered resources.
[INFO] [compiler:testCompile]
[INFO] No sources to compile
[INFO] [surefire:test]
[INFO] No tests to run.
[HUDSON] Recording test results
[INFO] [jar:jar]
[INFO] Building jar: <http://hudson.zones.apache.org/hudson/job/Tuscany-SCA-J-CAA/ws/scajcaa/sca-java-caa/JCA_11007/target/JCA_11007.jar>
[INFO] [assembly:single {execution: make-assembly}]
[INFO] Reading assembly descriptor: ../tozip.xml
[INFO] Building zip: <http://hudson.zones.apache.org/hudson/job/Tuscany-SCA-J-CAA/ws/scajcaa/sca-java-caa/JCA_11007/target/JCA_11007.zip>
[WARNING] Configuration options: 'appendAssemblyId' is set to false, and 'classifier' is missing.
Instead of attaching the assembly file: <http://hudson.zones.apache.org/hudson/job/Tuscany-SCA-J-CAA/ws/scajcaa/sca-java-caa/JCA_11007/target/JCA_11007.zip,> it will become the file for main project artifact.
NOTE: If multiple descriptors or descriptor-formats are provided for this project, the value of this file will be non-deterministic!
[WARNING] Replacing pre-existing project main-artifact file: <http://hudson.zones.apache.org/hudson/job/Tuscany-SCA-J-CAA/ws/scajcaa/sca-java-caa/JCA_11007/target/JCA_11007.jar>
with assembly file: <http://hudson.zones.apache.org/hudson/job/Tuscany-SCA-J-CAA/ws/scajcaa/sca-java-caa/JCA_11007/target/JCA_11007.zip>
[INFO] [install:install]
[INFO] Installing <http://hudson.zones.apache.org/hudson/job/Tuscany-SCA-J-CAA/ws/scajcaa/sca-java-caa/JCA_11007/target/JCA_11007.zip> to /export/home/hudson/.m2/repository/org/oasis-open/sca/j/JCA_11007/1.0/JCA_11007-1.0.jar
[HUDSON] Archiving <http://hudson.zones.apache.org/hudson/job/Tuscany-SCA-J-CAA/ws/scajcaa/sca-java-caa/JCA_11007/pom.xml> to /export/home/hudson/hudson/jobs/Tuscany-SCA-J-CAA/modules/org.oasis-open.sca.j$JCA_11007/builds/2009-11-27_00-51-04/archive/org.oasis-open.sca.j/JCA_11007/1.0/pom.xml
[HUDSON] Archiving <http://hudson.zones.apache.org/hudson/job/Tuscany-SCA-J-CAA/ws/scajcaa/sca-java-caa/JCA_11007/target/JCA_11007.zip> to /export/home/hudson/hudson/jobs/Tuscany-SCA-J-CAA/modules/org.oasis-open.sca.j$JCA_11007/builds/2009-11-27_00-51-04/archive/org.oasis-open.sca.j/JCA_11007/1.0/JCA_11007.zip
[INFO] ------------------------------------------------------------------------
[INFO] Building OASIS Java CAA TestCases - Contribution JCA_11008
[INFO] task-segment: [clean, install]
[INFO] ------------------------------------------------------------------------
[INFO] [clean:clean]
[INFO] Deleting directory <http://hudson.zones.apache.org/hudson/job/Tuscany-SCA-J-CAA/ws/scajcaa/sca-java-caa/JCA_11008/target>
[INFO] [resources:resources]
[INFO] Using default encoding to copy filtered resources.
[INFO] [compiler:compile]
[INFO] Compiling 1 source file to <http://hudson.zones.apache.org/hudson/job/Tuscany-SCA-J-CAA/ws/scajcaa/sca-java-caa/JCA_11008/target/classes>
[INFO] [resources:testResources]
[INFO] Using default encoding to copy filtered resources.
[INFO] [compiler:testCompile]
[INFO] No sources to compile
[INFO] [surefire:test]
[INFO] No tests to run.
[HUDSON] Recording test results
[INFO] [jar:jar]
[INFO] Building jar: <http://hudson.zones.apache.org/hudson/job/Tuscany-SCA-J-CAA/ws/scajcaa/sca-java-caa/JCA_11008/target/JCA_11008.jar>
[INFO] [assembly:single {execution: make-assembly}]
[INFO] Reading assembly descriptor: ../tozip.xml
[INFO] Building zip: <http://hudson.zones.apache.org/hudson/job/Tuscany-SCA-J-CAA/ws/scajcaa/sca-java-caa/JCA_11008/target/JCA_11008.zip>
[WARNING] Configuration options: 'appendAssemblyId' is set to false, and 'classifier' is missing.
Instead of attaching the assembly file: <http://hudson.zones.apache.org/hudson/job/Tuscany-SCA-J-CAA/ws/scajcaa/sca-java-caa/JCA_11008/target/JCA_11008.zip,> it will become the file for main project artifact.
NOTE: If multiple descriptors or descriptor-formats are provided for this project, the value of this file will be non-deterministic!
[WARNING] Replacing pre-existing project main-artifact file: <http://hudson.zones.apache.org/hudson/job/Tuscany-SCA-J-CAA/ws/scajcaa/sca-java-caa/JCA_11008/target/JCA_11008.jar>
with assembly file: <http://hudson.zones.apache.org/hudson/job/Tuscany-SCA-J-CAA/ws/scajcaa/sca-java-caa/JCA_11008/target/JCA_11008.zip>
[INFO] [install:install]
[INFO] Installing <http://hudson.zones.apache.org/hudson/job/Tuscany-SCA-J-CAA/ws/scajcaa/sca-java-caa/JCA_11008/target/JCA_11008.zip> to /export/home/hudson/.m2/repository/org/oasis-open/sca/j/JCA_11008/1.0/JCA_11008-1.0.jar
[HUDSON] Archiving <http://hudson.zones.apache.org/hudson/job/Tuscany-SCA-J-CAA/ws/scajcaa/sca-java-caa/JCA_11008/pom.xml> to /export/home/hudson/hudson/jobs/Tuscany-SCA-J-CAA/modules/org.oasis-open.sca.j$JCA_11008/builds/2009-11-27_00-51-04/archive/org.oasis-open.sca.j/JCA_11008/1.0/pom.xml
[HUDSON] Archiving <http://hudson.zones.apache.org/hudson/job/Tuscany-SCA-J-CAA/ws/scajcaa/sca-java-caa/JCA_11008/target/JCA_11008.zip> to /export/home/hudson/hudson/jobs/Tuscany-SCA-J-CAA/modules/org.oasis-open.sca.j$JCA_11008/builds/2009-11-27_00-51-04/archive/org.oasis-open.sca.j/JCA_11008/1.0/JCA_11008.zip
[INFO] ------------------------------------------------------------------------
[INFO] Building OASIS Java CAA TestCases - Test Client
[INFO] task-segment: [clean, install]
[INFO] ------------------------------------------------------------------------
[INFO] [clean:clean]
[INFO] Deleting directory <http://hudson.zones.apache.org/hudson/job/Tuscany-SCA-J-CAA/ws/scajcaa/sca-java-caa/Test_Client_JavaCAA/target>
[INFO] [resources:resources]
[INFO] Using default encoding to copy filtered resources.
[INFO] [compiler:compile]
[INFO] Compiling 79 source files to <http://hudson.zones.apache.org/hudson/job/Tuscany-SCA-J-CAA/ws/scajcaa/sca-java-caa/Test_Client_JavaCAA/target/classes>
[INFO] [resources:testResources]
[INFO] Using default encoding to copy filtered resources.
[INFO] [compiler:testCompile]
[INFO] No sources to compile
[INFO] [surefire:test]
[INFO] No tests to run.
[HUDSON] Recording test results
[INFO] [jar:jar]
[INFO] Building jar: <http://hudson.zones.apache.org/hudson/job/Tuscany-SCA-J-CAA/ws/scajcaa/sca-java-caa/Test_Client_JavaCAA/target/Test_Client_JavaCAA.jar>
[INFO] [install:install]
[INFO] Installing <http://hudson.zones.apache.org/hudson/job/Tuscany-SCA-J-CAA/ws/scajcaa/sca-java-caa/Test_Client_JavaCAA/target/Test_Client_JavaCAA.jar> to /export/home/hudson/.m2/repository/org/oasis-open/sca/j/Test_Client_JavaCAA/1.0/Test_Client_JavaCAA-1.0.jar
[HUDSON] Archiving <http://hudson.zones.apache.org/hudson/job/Tuscany-SCA-J-CAA/ws/scajcaa/sca-java-caa/Test_Client_JavaCAA/pom.xml> to /export/home/hudson/hudson/jobs/Tuscany-SCA-J-CAA/modules/org.oasis-open.sca.j$Test_Client_JavaCAA/builds/2009-11-27_00-51-04/archive/org.oasis-open.sca.j/Test_Client_JavaCAA/1.0/pom.xml
[HUDSON] Archiving <http://hudson.zones.apache.org/hudson/job/Tuscany-SCA-J-CAA/ws/scajcaa/sca-java-caa/Test_Client_JavaCAA/target/Test_Client_JavaCAA.jar> to /export/home/hudson/hudson/jobs/Tuscany-SCA-J-CAA/modules/org.oasis-open.sca.j$Test_Client_JavaCAA/builds/2009-11-27_00-51-04/archive/org.oasis-open.sca.j/Test_Client_JavaCAA/1.0/Test_Client_JavaCAA.jar
[INFO] ------------------------------------------------------------------------
[INFO] Building Apache Tuscany SCA Specification Tests for SCA-J CAA
[INFO] task-segment: [clean, install]
[INFO] ------------------------------------------------------------------------
[INFO] [clean:clean]
[INFO] [build-helper:add-test-source {execution: add-test-source}]
[INFO] Test Source directory: <http://hudson.zones.apache.org/hudson/job/Tuscany-SCA-J-CAA/ws/scajcaa/tuscany-java-caa-test-runner/src/test/tjava> added.
[INFO] snapshot org.apache.tuscany.sca:tuscany-binding-ws-axis2:2.0-SNAPSHOT: checking for updates from apache.snapshots
[INFO] snapshot org.apache.tuscany.sca:tuscany-databinding-axiom:2.0-SNAPSHOT: checking for updates from apache.snapshots
[INFO] snapshot org.apache.tuscany.sca:tuscany-binding-ws-axis2-policy:2.0-SNAPSHOT: checking for updates from apache.snapshots
Downloading: http://repo2.maven.org/maven2/org/apache/santuario/xmlsec/1.4.0/xmlsec-1.4.0.pom
Downloading: http://people.apache.org/repo/m2-incubating-repository/org/apache/santuario/xmlsec/1.4.0/xmlsec-1.4.0.pom
Downloading: http://svn.apache.org/repos/asf/tuscany/maven/org/apache/santuario/xmlsec/1.4.0/xmlsec-1.4.0.pom
Downloading: http://ws.zones.apache.org/repository2/org/apache/santuario/xmlsec/1.4.0/xmlsec-1.4.0.pom
Downloading: http://ftp.ussg.iu.edu/eclipse/modeling/emf/emf/maven2//org/apache/santuario/xmlsec/1.4.0/xmlsec-1.4.0.pom
Downloading: http://ftp.osuosl.org/pub/eclipse/tools/emf/maven2/org/apache/santuario/xmlsec/1.4.0/xmlsec-1.4.0.pom
Downloading: http://www.intalio.org/public/maven2/org/apache/santuario/xmlsec/1.4.0/xmlsec-1.4.0.pom
Downloading: http://download.java.net/maven/1/org.apache.santuario/poms/xmlsec-1.4.0.pom
Downloading: http://download.java.net/maven/2/org/apache/santuario/xmlsec/1.4.0/xmlsec-1.4.0.pom
Downloading: http://repo1.maven.org/maven2/org/apache/santuario/xmlsec/1.4.0/xmlsec-1.4.0.pom
Downloading: http://repo2.maven.org/maven2/opensaml/opensaml/1.1/opensaml-1.1.pom
Downloading: http://people.apache.org/repo/m2-incubating-repository/opensaml/opensaml/1.1/opensaml-1.1.pom
Downloading: http://svn.apache.org/repos/asf/tuscany/maven/opensaml/opensaml/1.1/opensaml-1.1.pom
Downloading: http://ws.zones.apache.org/repository2/opensaml/opensaml/1.1/opensaml-1.1.pom
Downloading: http://ftp.ussg.iu.edu/eclipse/modeling/emf/emf/maven2//opensaml/opensaml/1.1/opensaml-1.1.pom
Downloading: http://ftp.osuosl.org/pub/eclipse/tools/emf/maven2/opensaml/opensaml/1.1/opensaml-1.1.pom
Downloading: http://www.intalio.org/public/maven2/opensaml/opensaml/1.1/opensaml-1.1.pom
Downloading: http://download.java.net/maven/1/opensaml/poms/opensaml-1.1.pom
Downloading: http://download.java.net/maven/2/opensaml/opensaml/1.1/opensaml-1.1.pom
Downloading: http://repo1.maven.org/maven2/opensaml/opensaml/1.1/opensaml-1.1.pom
Downloading: http://repo2.maven.org/maven2/org/apache/santuario/xmlsec/1.4.1/xmlsec-1.4.1.pom
Downloading: http://people.apache.org/repo/m2-incubating-repository/org/apache/santuario/xmlsec/1.4.1/xmlsec-1.4.1.pom
Downloading: http://svn.apache.org/repos/asf/tuscany/maven/org/apache/santuario/xmlsec/1.4.1/xmlsec-1.4.1.pom
Downloading: http://ws.zones.apache.org/repository2/org/apache/santuario/xmlsec/1.4.1/xmlsec-1.4.1.pom
Downloading: http://ftp.ussg.iu.edu/eclipse/modeling/emf/emf/maven2//org/apache/santuario/xmlsec/1.4.1/xmlsec-1.4.1.pom
Downloading: http://ftp.osuosl.org/pub/eclipse/tools/emf/maven2/org/apache/santuario/xmlsec/1.4.1/xmlsec-1.4.1.pom
Downloading: http://www.intalio.org/public/maven2/org/apache/santuario/xmlsec/1.4.1/xmlsec-1.4.1.pom
Downloading: http://download.java.net/maven/1/org.apache.santuario/poms/xmlsec-1.4.1.pom
Downloading: http://download.java.net/maven/2/org/apache/santuario/xmlsec/1.4.1/xmlsec-1.4.1.pom
Downloading: http://repo1.maven.org/maven2/org/apache/santuario/xmlsec/1.4.1/xmlsec-1.4.1.pom
[INFO] snapshot org.apache.tuscany.sca:tuscany-xsd:2.0-SNAPSHOT: checking for updates from apache.snapshots
[INFO] snapshot org.apache.tuscany.sca:tuscany-xsd:2.0-SNAPSHOT: checking for updates from apache.ws
[WARNING] repository metadata for: 'snapshot org.apache.tuscany.sca:tuscany-xsd:2.0-SNAPSHOT' could not be retrieved from repository: apache.ws due to an error: Error transferring file
[INFO] Repository 'apache.ws' will be blacklisted
[INFO] snapshot org.apache.tuscany.sca:tuscany-interface-wsdl:2.0-SNAPSHOT: checking for updates from apache.snapshots
[INFO] snapshot org.apache.tuscany.sca:tuscany-binding-ws:2.0-SNAPSHOT: checking for updates from apache.snapshots
[INFO] snapshot org.apache.tuscany.sca:tuscany-binding-ws-wsdlgen:2.0-SNAPSHOT: checking for updates from apache.snapshots
[INFO] snapshot org.apache.tuscany.sca:tuscany-databinding-jaxb-axiom:2.0-SNAPSHOT: checking for updates from apache.snapshots
[INFO] snapshot org.apache.tuscany.sca:tuscany-host-http:2.0-SNAPSHOT: checking for updates from apache.snapshots
[INFO] snapshot org.apache.tuscany.sca:tuscany-policy-security:2.0-SNAPSHOT: checking for updates from apache.snapshots
[INFO] snapshot org.apache.tuscany.sca:tuscany-policy-xml-ws:2.0-SNAPSHOT: checking for updates from apache.snapshots
[INFO] [antrun:run {execution: copy-files-from-svn}]
[INFO] Executing tasks
copyResourceDir:
copySourceDir:
[sync] Removed 1 dangling directory from <http://hudson.zones.apache.org/hudson/job/Tuscany-SCA-J-CAA/ws/scajcaa/tuscany-java-caa-test-runner/src/test/java>
[sync] Removed 8 dangling files from <http://hudson.zones.apache.org/hudson/job/Tuscany-SCA-J-CAA/ws/scajcaa/tuscany-java-caa-test-runner/src/test/java>
copySourceDir:
[sync] Copying 8 files to <http://hudson.zones.apache.org/hudson/job/Tuscany-SCA-J-CAA/ws/scajcaa/tuscany-java-caa-test-runner/src/test/java/testClient>
[sync] Copying <http://hudson.zones.apache.org/hudson/job/Tuscany-SCA-J-CAA/ws/scajcaa/sca-assembly/Test_Client/src/main/java/testClient/InvokeTest.java> to <http://hudson.zones.apache.org/hudson/job/Tuscany-SCA-J-CAA/ws/scajcaa/tuscany-java-caa-test-runner/src/test/java/testClient/InvokeTest.java>
[sync] Copying <http://hudson.zones.apache.org/hudson/job/Tuscany-SCA-J-CAA/ws/scajcaa/sca-assembly/Test_Client/src/main/java/testClient/TestInvocationService.java> to <http://hudson.zones.apache.org/hudson/job/Tuscany-SCA-J-CAA/ws/scajcaa/tuscany-java-caa-test-runner/src/test/java/testClient/TestInvocationService.java>
[sync] Copying <http://hudson.zones.apache.org/hudson/job/Tuscany-SCA-J-CAA/ws/scajcaa/sca-assembly/Test_Client/src/main/java/testClient/InvokeTestResponse.java> to <http://hudson.zones.apache.org/hudson/job/Tuscany-SCA-J-CAA/ws/scajcaa/tuscany-java-caa-test-runner/src/test/java/testClient/InvokeTestResponse.java>
[sync] Copying <http://hudson.zones.apache.org/hudson/job/Tuscany-SCA-J-CAA/ws/scajcaa/sca-assembly/Test_Client/src/main/java/testClient/package-info.java> to <http://hudson.zones.apache.org/hudson/job/Tuscany-SCA-J-CAA/ws/scajcaa/tuscany-java-caa-test-runner/src/test/java/testClient/package-info.java>
[sync] Copying <http://hudson.zones.apache.org/hudson/job/Tuscany-SCA-J-CAA/ws/scajcaa/sca-assembly/Test_Client/src/main/java/testClient/TestException.java> to <http://hudson.zones.apache.org/hudson/job/Tuscany-SCA-J-CAA/ws/scajcaa/tuscany-java-caa-test-runner/src/test/java/testClient/TestException.java>
[sync] Copying <http://hudson.zones.apache.org/hudson/job/Tuscany-SCA-J-CAA/ws/scajcaa/sca-assembly/Test_Client/src/main/java/testClient/ObjectFactory.java> to <http://hudson.zones.apache.org/hudson/job/Tuscany-SCA-J-CAA/ws/scajcaa/tuscany-java-caa-test-runner/src/test/java/testClient/ObjectFactory.java>
[sync] Copying <http://hudson.zones.apache.org/hudson/job/Tuscany-SCA-J-CAA/ws/scajcaa/sca-assembly/Test_Client/src/main/java/testClient/TestInvocation.java> to <http://hudson.zones.apache.org/hudson/job/Tuscany-SCA-J-CAA/ws/scajcaa/tuscany-java-caa-test-runner/src/test/java/testClient/TestInvocation.java>
[sync] Copying <http://hudson.zones.apache.org/hudson/job/Tuscany-SCA-J-CAA/ws/scajcaa/sca-assembly/Test_Client/src/main/java/testClient/TestException_Exception.java> to <http://hudson.zones.apache.org/hudson/job/Tuscany-SCA-J-CAA/ws/scajcaa/tuscany-java-caa-test-runner/src/test/java/testClient/TestException_Exception.java>
copyFile:
[HUDSON] Archiving <http://hudson.zones.apache.org/hudson/job/Tuscany-SCA-J-CAA/ws/scajcaa/tuscany-java-caa-test-runner/pom.xml> to /export/home/hudson/hudson/jobs/Tuscany-SCA-J-CAA/modules/org.apache.tuscany.sca$tuscany-otests-sca-j-caa-tests/builds/2009-11-27_00-51-04/archive/org.apache.tuscany.sca/tuscany-otests-sca-j-caa-tests/2.0-SNAPSHOT/pom.xml
[INFO] ------------------------------------------------------------------------
[ERROR] BUILD ERROR
[INFO] ------------------------------------------------------------------------
[INFO] An Ant BuildException has occured: The following error occurred while executing this line:
<http://hudson.zones.apache.org/hudson/job/Tuscany-SCA-J-CAA/ws/scajcaa/build.xml>:53: Warning: Could not find file <http://hudson.zones.apache.org/hudson/job/Tuscany-SCA-J-CAA/ws/scajcaa/sca-assembly/Test_Client/src/main/java/client/BaseJAXWSTestCase.java> to copy.
[INFO] ------------------------------------------------------------------------
[INFO] For more information, run Maven with the -e switch
[INFO] ------------------------------------------------------------------------
[INFO] Total time: 26 minutes 16 seconds
[INFO] Finished at: Fri Nov 27 01:17:30 UTC 2009
[INFO] Final Memory: 142M/742M
[INFO] ------------------------------------------------------------------------
Waiting for Hudson to finish collecting data
Sending e-mails to: commits@tuscany.apache.org
channel stopped
Build failed in Hudson: Tuscany-SCA-J-CAA #41
Posted by Apache Hudson Server <hu...@hudson.zones.apache.org>.
See <http://hudson.zones.apache.org/hudson/job/Tuscany-SCA-J-CAA/41/>
------------------------------------------
[...truncated 5557 lines...]
[INFO] Building jar: <http://hudson.zones.apache.org/hudson/job/Tuscany-SCA-J-CAA/ws/scajcaa/sca-java-caa/JCA_10052/target/JCA_10052.jar>
[INFO] [assembly:single {execution: make-assembly}]
[INFO] Reading assembly descriptor: ../tozip.xml
[INFO] Building zip: <http://hudson.zones.apache.org/hudson/job/Tuscany-SCA-J-CAA/ws/scajcaa/sca-java-caa/JCA_10052/target/JCA_10052.zip>
[WARNING] Configuration options: 'appendAssemblyId' is set to false, and 'classifier' is missing.
Instead of attaching the assembly file: <http://hudson.zones.apache.org/hudson/job/Tuscany-SCA-J-CAA/ws/scajcaa/sca-java-caa/JCA_10052/target/JCA_10052.zip,> it will become the file for main project artifact.
NOTE: If multiple descriptors or descriptor-formats are provided for this project, the value of this file will be non-deterministic!
[WARNING] Replacing pre-existing project main-artifact file: <http://hudson.zones.apache.org/hudson/job/Tuscany-SCA-J-CAA/ws/scajcaa/sca-java-caa/JCA_10052/target/JCA_10052.jar>
with assembly file: <http://hudson.zones.apache.org/hudson/job/Tuscany-SCA-J-CAA/ws/scajcaa/sca-java-caa/JCA_10052/target/JCA_10052.zip>
[INFO] [install:install]
[INFO] Installing <http://hudson.zones.apache.org/hudson/job/Tuscany-SCA-J-CAA/ws/scajcaa/sca-java-caa/JCA_10052/target/JCA_10052.zip> to /export/home/hudson/.m2/repository/org/oasis-open/sca/j/JCA_10052/1.0/JCA_10052-1.0.jar
[HUDSON] Archiving <http://hudson.zones.apache.org/hudson/job/Tuscany-SCA-J-CAA/ws/scajcaa/sca-java-caa/JCA_10052/pom.xml> to /export/home/hudson/hudson/jobs/Tuscany-SCA-J-CAA/modules/org.oasis-open.sca.j$JCA_10052/builds/2009-11-26_00-48-38/archive/org.oasis-open.sca.j/JCA_10052/1.0/pom.xml
[HUDSON] Archiving <http://hudson.zones.apache.org/hudson/job/Tuscany-SCA-J-CAA/ws/scajcaa/sca-java-caa/JCA_10052/target/JCA_10052.zip> to /export/home/hudson/hudson/jobs/Tuscany-SCA-J-CAA/modules/org.oasis-open.sca.j$JCA_10052/builds/2009-11-26_00-48-38/archive/org.oasis-open.sca.j/JCA_10052/1.0/JCA_10052.zip
[INFO] ------------------------------------------------------------------------
[INFO] Building OASIS Java CAA TestCases - Contribution JCA_11005
[INFO] task-segment: [clean, install]
[INFO] ------------------------------------------------------------------------
[INFO] [clean:clean]
[INFO] Deleting directory <http://hudson.zones.apache.org/hudson/job/Tuscany-SCA-J-CAA/ws/scajcaa/sca-java-caa/JCA_11005/target>
[INFO] [resources:resources]
[INFO] Using default encoding to copy filtered resources.
[INFO] [compiler:compile]
[INFO] Compiling 2 source files to <http://hudson.zones.apache.org/hudson/job/Tuscany-SCA-J-CAA/ws/scajcaa/sca-java-caa/JCA_11005/target/classes>
[INFO] [resources:testResources]
[INFO] Using default encoding to copy filtered resources.
[INFO] [compiler:testCompile]
[INFO] No sources to compile
[INFO] [surefire:test]
[INFO] No tests to run.
[HUDSON] Recording test results
[INFO] [jar:jar]
[INFO] Building jar: <http://hudson.zones.apache.org/hudson/job/Tuscany-SCA-J-CAA/ws/scajcaa/sca-java-caa/JCA_11005/target/JCA_11005.jar>
[INFO] [assembly:single {execution: make-assembly}]
[INFO] Reading assembly descriptor: ../tozip.xml
[INFO] Building zip: <http://hudson.zones.apache.org/hudson/job/Tuscany-SCA-J-CAA/ws/scajcaa/sca-java-caa/JCA_11005/target/JCA_11005.zip>
[WARNING] Configuration options: 'appendAssemblyId' is set to false, and 'classifier' is missing.
Instead of attaching the assembly file: <http://hudson.zones.apache.org/hudson/job/Tuscany-SCA-J-CAA/ws/scajcaa/sca-java-caa/JCA_11005/target/JCA_11005.zip,> it will become the file for main project artifact.
NOTE: If multiple descriptors or descriptor-formats are provided for this project, the value of this file will be non-deterministic!
[WARNING] Replacing pre-existing project main-artifact file: <http://hudson.zones.apache.org/hudson/job/Tuscany-SCA-J-CAA/ws/scajcaa/sca-java-caa/JCA_11005/target/JCA_11005.jar>
with assembly file: <http://hudson.zones.apache.org/hudson/job/Tuscany-SCA-J-CAA/ws/scajcaa/sca-java-caa/JCA_11005/target/JCA_11005.zip>
[INFO] [install:install]
[INFO] Installing <http://hudson.zones.apache.org/hudson/job/Tuscany-SCA-J-CAA/ws/scajcaa/sca-java-caa/JCA_11005/target/JCA_11005.zip> to /export/home/hudson/.m2/repository/org/oasis-open/sca/j/JCA_11005/1.0/JCA_11005-1.0.jar
[HUDSON] Archiving <http://hudson.zones.apache.org/hudson/job/Tuscany-SCA-J-CAA/ws/scajcaa/sca-java-caa/JCA_11005/pom.xml> to /export/home/hudson/hudson/jobs/Tuscany-SCA-J-CAA/modules/org.oasis-open.sca.j$JCA_11005/builds/2009-11-26_00-48-38/archive/org.oasis-open.sca.j/JCA_11005/1.0/pom.xml
[HUDSON] Archiving <http://hudson.zones.apache.org/hudson/job/Tuscany-SCA-J-CAA/ws/scajcaa/sca-java-caa/JCA_11005/target/JCA_11005.zip> to /export/home/hudson/hudson/jobs/Tuscany-SCA-J-CAA/modules/org.oasis-open.sca.j$JCA_11005/builds/2009-11-26_00-48-38/archive/org.oasis-open.sca.j/JCA_11005/1.0/JCA_11005.zip
[INFO] ------------------------------------------------------------------------
[INFO] Building OASIS Java CAA TestCases - Contribution JCA_11006
[INFO] task-segment: [clean, install]
[INFO] ------------------------------------------------------------------------
[INFO] [clean:clean]
[INFO] Deleting directory <http://hudson.zones.apache.org/hudson/job/Tuscany-SCA-J-CAA/ws/scajcaa/sca-java-caa/JCA_11006/target>
[INFO] [resources:resources]
[INFO] Using default encoding to copy filtered resources.
[INFO] [compiler:compile]
[INFO] Compiling 1 source file to <http://hudson.zones.apache.org/hudson/job/Tuscany-SCA-J-CAA/ws/scajcaa/sca-java-caa/JCA_11006/target/classes>
[INFO] [resources:testResources]
[INFO] Using default encoding to copy filtered resources.
[INFO] [compiler:testCompile]
[INFO] No sources to compile
[INFO] [surefire:test]
[INFO] No tests to run.
[HUDSON] Recording test results
[INFO] [jar:jar]
[INFO] Building jar: <http://hudson.zones.apache.org/hudson/job/Tuscany-SCA-J-CAA/ws/scajcaa/sca-java-caa/JCA_11006/target/JCA_11006.jar>
[INFO] [assembly:single {execution: make-assembly}]
[INFO] Reading assembly descriptor: ../tozip.xml
[INFO] Building zip: <http://hudson.zones.apache.org/hudson/job/Tuscany-SCA-J-CAA/ws/scajcaa/sca-java-caa/JCA_11006/target/JCA_11006.zip>
[WARNING] Configuration options: 'appendAssemblyId' is set to false, and 'classifier' is missing.
Instead of attaching the assembly file: <http://hudson.zones.apache.org/hudson/job/Tuscany-SCA-J-CAA/ws/scajcaa/sca-java-caa/JCA_11006/target/JCA_11006.zip,> it will become the file for main project artifact.
NOTE: If multiple descriptors or descriptor-formats are provided for this project, the value of this file will be non-deterministic!
[WARNING] Replacing pre-existing project main-artifact file: <http://hudson.zones.apache.org/hudson/job/Tuscany-SCA-J-CAA/ws/scajcaa/sca-java-caa/JCA_11006/target/JCA_11006.jar>
with assembly file: <http://hudson.zones.apache.org/hudson/job/Tuscany-SCA-J-CAA/ws/scajcaa/sca-java-caa/JCA_11006/target/JCA_11006.zip>
[INFO] [install:install]
[INFO] Installing <http://hudson.zones.apache.org/hudson/job/Tuscany-SCA-J-CAA/ws/scajcaa/sca-java-caa/JCA_11006/target/JCA_11006.zip> to /export/home/hudson/.m2/repository/org/oasis-open/sca/j/JCA_11006/1.0/JCA_11006-1.0.jar
[HUDSON] Archiving <http://hudson.zones.apache.org/hudson/job/Tuscany-SCA-J-CAA/ws/scajcaa/sca-java-caa/JCA_11006/pom.xml> to /export/home/hudson/hudson/jobs/Tuscany-SCA-J-CAA/modules/org.oasis-open.sca.j$JCA_11006/builds/2009-11-26_00-48-38/archive/org.oasis-open.sca.j/JCA_11006/1.0/pom.xml
[HUDSON] Archiving <http://hudson.zones.apache.org/hudson/job/Tuscany-SCA-J-CAA/ws/scajcaa/sca-java-caa/JCA_11006/target/JCA_11006.zip> to /export/home/hudson/hudson/jobs/Tuscany-SCA-J-CAA/modules/org.oasis-open.sca.j$JCA_11006/builds/2009-11-26_00-48-38/archive/org.oasis-open.sca.j/JCA_11006/1.0/JCA_11006.zip
[INFO] ------------------------------------------------------------------------
[INFO] Building OASIS Java CAA TestCases - Contribution JCA_11007
[INFO] task-segment: [clean, install]
[INFO] ------------------------------------------------------------------------
[INFO] [clean:clean]
[INFO] Deleting directory <http://hudson.zones.apache.org/hudson/job/Tuscany-SCA-J-CAA/ws/scajcaa/sca-java-caa/JCA_11007/target>
[INFO] [resources:resources]
[INFO] Using default encoding to copy filtered resources.
[INFO] [compiler:compile]
[INFO] Compiling 1 source file to <http://hudson.zones.apache.org/hudson/job/Tuscany-SCA-J-CAA/ws/scajcaa/sca-java-caa/JCA_11007/target/classes>
[INFO] [resources:testResources]
[INFO] Using default encoding to copy filtered resources.
[INFO] [compiler:testCompile]
[INFO] No sources to compile
[INFO] [surefire:test]
[INFO] No tests to run.
[HUDSON] Recording test results
[INFO] [jar:jar]
[INFO] Building jar: <http://hudson.zones.apache.org/hudson/job/Tuscany-SCA-J-CAA/ws/scajcaa/sca-java-caa/JCA_11007/target/JCA_11007.jar>
[INFO] [assembly:single {execution: make-assembly}]
[INFO] Reading assembly descriptor: ../tozip.xml
[INFO] Building zip: <http://hudson.zones.apache.org/hudson/job/Tuscany-SCA-J-CAA/ws/scajcaa/sca-java-caa/JCA_11007/target/JCA_11007.zip>
[WARNING] Configuration options: 'appendAssemblyId' is set to false, and 'classifier' is missing.
Instead of attaching the assembly file: <http://hudson.zones.apache.org/hudson/job/Tuscany-SCA-J-CAA/ws/scajcaa/sca-java-caa/JCA_11007/target/JCA_11007.zip,> it will become the file for main project artifact.
NOTE: If multiple descriptors or descriptor-formats are provided for this project, the value of this file will be non-deterministic!
[WARNING] Replacing pre-existing project main-artifact file: <http://hudson.zones.apache.org/hudson/job/Tuscany-SCA-J-CAA/ws/scajcaa/sca-java-caa/JCA_11007/target/JCA_11007.jar>
with assembly file: <http://hudson.zones.apache.org/hudson/job/Tuscany-SCA-J-CAA/ws/scajcaa/sca-java-caa/JCA_11007/target/JCA_11007.zip>
[INFO] [install:install]
[INFO] Installing <http://hudson.zones.apache.org/hudson/job/Tuscany-SCA-J-CAA/ws/scajcaa/sca-java-caa/JCA_11007/target/JCA_11007.zip> to /export/home/hudson/.m2/repository/org/oasis-open/sca/j/JCA_11007/1.0/JCA_11007-1.0.jar
[HUDSON] Archiving <http://hudson.zones.apache.org/hudson/job/Tuscany-SCA-J-CAA/ws/scajcaa/sca-java-caa/JCA_11007/pom.xml> to /export/home/hudson/hudson/jobs/Tuscany-SCA-J-CAA/modules/org.oasis-open.sca.j$JCA_11007/builds/2009-11-26_00-48-38/archive/org.oasis-open.sca.j/JCA_11007/1.0/pom.xml
[HUDSON] Archiving <http://hudson.zones.apache.org/hudson/job/Tuscany-SCA-J-CAA/ws/scajcaa/sca-java-caa/JCA_11007/target/JCA_11007.zip> to /export/home/hudson/hudson/jobs/Tuscany-SCA-J-CAA/modules/org.oasis-open.sca.j$JCA_11007/builds/2009-11-26_00-48-38/archive/org.oasis-open.sca.j/JCA_11007/1.0/JCA_11007.zip
[INFO] ------------------------------------------------------------------------
[INFO] Building OASIS Java CAA TestCases - Contribution JCA_11008
[INFO] task-segment: [clean, install]
[INFO] ------------------------------------------------------------------------
[INFO] [clean:clean]
[INFO] Deleting directory <http://hudson.zones.apache.org/hudson/job/Tuscany-SCA-J-CAA/ws/scajcaa/sca-java-caa/JCA_11008/target>
[INFO] [resources:resources]
[INFO] Using default encoding to copy filtered resources.
[INFO] [compiler:compile]
[INFO] Compiling 1 source file to <http://hudson.zones.apache.org/hudson/job/Tuscany-SCA-J-CAA/ws/scajcaa/sca-java-caa/JCA_11008/target/classes>
[INFO] [resources:testResources]
[INFO] Using default encoding to copy filtered resources.
[INFO] [compiler:testCompile]
[INFO] No sources to compile
[INFO] [surefire:test]
[INFO] No tests to run.
[HUDSON] Recording test results
[INFO] [jar:jar]
[INFO] Building jar: <http://hudson.zones.apache.org/hudson/job/Tuscany-SCA-J-CAA/ws/scajcaa/sca-java-caa/JCA_11008/target/JCA_11008.jar>
[INFO] [assembly:single {execution: make-assembly}]
[INFO] Reading assembly descriptor: ../tozip.xml
[INFO] Building zip: <http://hudson.zones.apache.org/hudson/job/Tuscany-SCA-J-CAA/ws/scajcaa/sca-java-caa/JCA_11008/target/JCA_11008.zip>
[WARNING] Configuration options: 'appendAssemblyId' is set to false, and 'classifier' is missing.
Instead of attaching the assembly file: <http://hudson.zones.apache.org/hudson/job/Tuscany-SCA-J-CAA/ws/scajcaa/sca-java-caa/JCA_11008/target/JCA_11008.zip,> it will become the file for main project artifact.
NOTE: If multiple descriptors or descriptor-formats are provided for this project, the value of this file will be non-deterministic!
[WARNING] Replacing pre-existing project main-artifact file: <http://hudson.zones.apache.org/hudson/job/Tuscany-SCA-J-CAA/ws/scajcaa/sca-java-caa/JCA_11008/target/JCA_11008.jar>
with assembly file: <http://hudson.zones.apache.org/hudson/job/Tuscany-SCA-J-CAA/ws/scajcaa/sca-java-caa/JCA_11008/target/JCA_11008.zip>
[INFO] [install:install]
[INFO] Installing <http://hudson.zones.apache.org/hudson/job/Tuscany-SCA-J-CAA/ws/scajcaa/sca-java-caa/JCA_11008/target/JCA_11008.zip> to /export/home/hudson/.m2/repository/org/oasis-open/sca/j/JCA_11008/1.0/JCA_11008-1.0.jar
[HUDSON] Archiving <http://hudson.zones.apache.org/hudson/job/Tuscany-SCA-J-CAA/ws/scajcaa/sca-java-caa/JCA_11008/pom.xml> to /export/home/hudson/hudson/jobs/Tuscany-SCA-J-CAA/modules/org.oasis-open.sca.j$JCA_11008/builds/2009-11-26_00-48-38/archive/org.oasis-open.sca.j/JCA_11008/1.0/pom.xml
[HUDSON] Archiving <http://hudson.zones.apache.org/hudson/job/Tuscany-SCA-J-CAA/ws/scajcaa/sca-java-caa/JCA_11008/target/JCA_11008.zip> to /export/home/hudson/hudson/jobs/Tuscany-SCA-J-CAA/modules/org.oasis-open.sca.j$JCA_11008/builds/2009-11-26_00-48-38/archive/org.oasis-open.sca.j/JCA_11008/1.0/JCA_11008.zip
[INFO] ------------------------------------------------------------------------
[INFO] Building OASIS Java CAA TestCases - Test Client
[INFO] task-segment: [clean, install]
[INFO] ------------------------------------------------------------------------
[INFO] [clean:clean]
[INFO] Deleting directory <http://hudson.zones.apache.org/hudson/job/Tuscany-SCA-J-CAA/ws/scajcaa/sca-java-caa/Test_Client_JavaCAA/target>
[INFO] [resources:resources]
[INFO] Using default encoding to copy filtered resources.
[INFO] [compiler:compile]
[INFO] Compiling 79 source files to <http://hudson.zones.apache.org/hudson/job/Tuscany-SCA-J-CAA/ws/scajcaa/sca-java-caa/Test_Client_JavaCAA/target/classes>
[INFO] [resources:testResources]
[INFO] Using default encoding to copy filtered resources.
[INFO] [compiler:testCompile]
[INFO] No sources to compile
[INFO] [surefire:test]
[INFO] No tests to run.
[HUDSON] Recording test results
[INFO] [jar:jar]
[INFO] Building jar: <http://hudson.zones.apache.org/hudson/job/Tuscany-SCA-J-CAA/ws/scajcaa/sca-java-caa/Test_Client_JavaCAA/target/Test_Client_JavaCAA.jar>
[INFO] [install:install]
[INFO] Installing <http://hudson.zones.apache.org/hudson/job/Tuscany-SCA-J-CAA/ws/scajcaa/sca-java-caa/Test_Client_JavaCAA/target/Test_Client_JavaCAA.jar> to /export/home/hudson/.m2/repository/org/oasis-open/sca/j/Test_Client_JavaCAA/1.0/Test_Client_JavaCAA-1.0.jar
[HUDSON] Archiving <http://hudson.zones.apache.org/hudson/job/Tuscany-SCA-J-CAA/ws/scajcaa/sca-java-caa/Test_Client_JavaCAA/pom.xml> to /export/home/hudson/hudson/jobs/Tuscany-SCA-J-CAA/modules/org.oasis-open.sca.j$Test_Client_JavaCAA/builds/2009-11-26_00-48-38/archive/org.oasis-open.sca.j/Test_Client_JavaCAA/1.0/pom.xml
[HUDSON] Archiving <http://hudson.zones.apache.org/hudson/job/Tuscany-SCA-J-CAA/ws/scajcaa/sca-java-caa/Test_Client_JavaCAA/target/Test_Client_JavaCAA.jar> to /export/home/hudson/hudson/jobs/Tuscany-SCA-J-CAA/modules/org.oasis-open.sca.j$Test_Client_JavaCAA/builds/2009-11-26_00-48-38/archive/org.oasis-open.sca.j/Test_Client_JavaCAA/1.0/Test_Client_JavaCAA.jar
[INFO] ------------------------------------------------------------------------
[INFO] Building Apache Tuscany SCA Specification Tests for SCA-J CAA
[INFO] task-segment: [clean, install]
[INFO] ------------------------------------------------------------------------
[INFO] [clean:clean]
[INFO] [build-helper:add-test-source {execution: add-test-source}]
[INFO] Test Source directory: <http://hudson.zones.apache.org/hudson/job/Tuscany-SCA-J-CAA/ws/scajcaa/tuscany-java-caa-test-runner/src/test/tjava> added.
[INFO] snapshot org.apache.tuscany.sca:tuscany-binding-ws-axis2:2.0-SNAPSHOT: checking for updates from apache.snapshots
[INFO] snapshot org.apache.tuscany.sca:tuscany-databinding-axiom:2.0-SNAPSHOT: checking for updates from apache.snapshots
[INFO] snapshot org.apache.tuscany.sca:tuscany-binding-ws-axis2-policy:2.0-SNAPSHOT: checking for updates from apache.snapshots
Downloading: http://repo2.maven.org/maven2/org/apache/santuario/xmlsec/1.4.0/xmlsec-1.4.0.pom
Downloading: http://people.apache.org/repo/m2-incubating-repository/org/apache/santuario/xmlsec/1.4.0/xmlsec-1.4.0.pom
Downloading: http://svn.apache.org/repos/asf/tuscany/maven/org/apache/santuario/xmlsec/1.4.0/xmlsec-1.4.0.pom
Downloading: http://ws.zones.apache.org/repository2/org/apache/santuario/xmlsec/1.4.0/xmlsec-1.4.0.pom
Downloading: http://ftp.ussg.iu.edu/eclipse/modeling/emf/emf/maven2//org/apache/santuario/xmlsec/1.4.0/xmlsec-1.4.0.pom
Downloading: http://ftp.osuosl.org/pub/eclipse/tools/emf/maven2/org/apache/santuario/xmlsec/1.4.0/xmlsec-1.4.0.pom
Downloading: http://www.intalio.org/public/maven2/org/apache/santuario/xmlsec/1.4.0/xmlsec-1.4.0.pom
Downloading: http://download.java.net/maven/1/org.apache.santuario/poms/xmlsec-1.4.0.pom
Downloading: http://download.java.net/maven/2/org/apache/santuario/xmlsec/1.4.0/xmlsec-1.4.0.pom
Downloading: http://repo1.maven.org/maven2/org/apache/santuario/xmlsec/1.4.0/xmlsec-1.4.0.pom
Downloading: http://repo2.maven.org/maven2/opensaml/opensaml/1.1/opensaml-1.1.pom
Downloading: http://people.apache.org/repo/m2-incubating-repository/opensaml/opensaml/1.1/opensaml-1.1.pom
Downloading: http://svn.apache.org/repos/asf/tuscany/maven/opensaml/opensaml/1.1/opensaml-1.1.pom
Downloading: http://ws.zones.apache.org/repository2/opensaml/opensaml/1.1/opensaml-1.1.pom
Downloading: http://ftp.ussg.iu.edu/eclipse/modeling/emf/emf/maven2//opensaml/opensaml/1.1/opensaml-1.1.pom
Downloading: http://ftp.osuosl.org/pub/eclipse/tools/emf/maven2/opensaml/opensaml/1.1/opensaml-1.1.pom
Downloading: http://www.intalio.org/public/maven2/opensaml/opensaml/1.1/opensaml-1.1.pom
Downloading: http://download.java.net/maven/1/opensaml/poms/opensaml-1.1.pom
Downloading: http://download.java.net/maven/2/opensaml/opensaml/1.1/opensaml-1.1.pom
Downloading: http://repo1.maven.org/maven2/opensaml/opensaml/1.1/opensaml-1.1.pom
Downloading: http://repo2.maven.org/maven2/org/apache/santuario/xmlsec/1.4.1/xmlsec-1.4.1.pom
Downloading: http://people.apache.org/repo/m2-incubating-repository/org/apache/santuario/xmlsec/1.4.1/xmlsec-1.4.1.pom
Downloading: http://svn.apache.org/repos/asf/tuscany/maven/org/apache/santuario/xmlsec/1.4.1/xmlsec-1.4.1.pom
Downloading: http://ws.zones.apache.org/repository2/org/apache/santuario/xmlsec/1.4.1/xmlsec-1.4.1.pom
Downloading: http://ftp.ussg.iu.edu/eclipse/modeling/emf/emf/maven2//org/apache/santuario/xmlsec/1.4.1/xmlsec-1.4.1.pom
Downloading: http://ftp.osuosl.org/pub/eclipse/tools/emf/maven2/org/apache/santuario/xmlsec/1.4.1/xmlsec-1.4.1.pom
Downloading: http://www.intalio.org/public/maven2/org/apache/santuario/xmlsec/1.4.1/xmlsec-1.4.1.pom
Downloading: http://download.java.net/maven/1/org.apache.santuario/poms/xmlsec-1.4.1.pom
Downloading: http://download.java.net/maven/2/org/apache/santuario/xmlsec/1.4.1/xmlsec-1.4.1.pom
Downloading: http://repo1.maven.org/maven2/org/apache/santuario/xmlsec/1.4.1/xmlsec-1.4.1.pom
[INFO] snapshot org.apache.tuscany.sca:tuscany-xsd:2.0-SNAPSHOT: checking for updates from apache.snapshots
[INFO] snapshot org.apache.tuscany.sca:tuscany-xsd:2.0-SNAPSHOT: checking for updates from apache.ws
[WARNING] repository metadata for: 'snapshot org.apache.tuscany.sca:tuscany-xsd:2.0-SNAPSHOT' could not be retrieved from repository: apache.ws due to an error: Error transferring file
[INFO] Repository 'apache.ws' will be blacklisted
[INFO] snapshot org.apache.tuscany.sca:tuscany-interface-wsdl:2.0-SNAPSHOT: checking for updates from apache.snapshots
[INFO] snapshot org.apache.tuscany.sca:tuscany-binding-ws:2.0-SNAPSHOT: checking for updates from apache.snapshots
[INFO] snapshot org.apache.tuscany.sca:tuscany-binding-ws-wsdlgen:2.0-SNAPSHOT: checking for updates from apache.snapshots
[INFO] snapshot org.apache.tuscany.sca:tuscany-databinding-jaxb-axiom:2.0-SNAPSHOT: checking for updates from apache.snapshots
[INFO] snapshot org.apache.tuscany.sca:tuscany-host-http:2.0-SNAPSHOT: checking for updates from apache.snapshots
[INFO] snapshot org.apache.tuscany.sca:tuscany-policy-security:2.0-SNAPSHOT: checking for updates from apache.snapshots
[INFO] snapshot org.apache.tuscany.sca:tuscany-policy-xml-ws:2.0-SNAPSHOT: checking for updates from apache.snapshots
[INFO] [antrun:run {execution: copy-files-from-svn}]
[INFO] Executing tasks
copyResourceDir:
copySourceDir:
[sync] Removed 1 dangling directory from <http://hudson.zones.apache.org/hudson/job/Tuscany-SCA-J-CAA/ws/scajcaa/tuscany-java-caa-test-runner/src/test/java>
[sync] Removed 8 dangling files from <http://hudson.zones.apache.org/hudson/job/Tuscany-SCA-J-CAA/ws/scajcaa/tuscany-java-caa-test-runner/src/test/java>
copySourceDir:
[sync] Copying 8 files to <http://hudson.zones.apache.org/hudson/job/Tuscany-SCA-J-CAA/ws/scajcaa/tuscany-java-caa-test-runner/src/test/java/testClient>
[sync] Copying <http://hudson.zones.apache.org/hudson/job/Tuscany-SCA-J-CAA/ws/scajcaa/sca-assembly/Test_Client/src/main/java/testClient/InvokeTest.java> to <http://hudson.zones.apache.org/hudson/job/Tuscany-SCA-J-CAA/ws/scajcaa/tuscany-java-caa-test-runner/src/test/java/testClient/InvokeTest.java>
[sync] Copying <http://hudson.zones.apache.org/hudson/job/Tuscany-SCA-J-CAA/ws/scajcaa/sca-assembly/Test_Client/src/main/java/testClient/TestInvocationService.java> to <http://hudson.zones.apache.org/hudson/job/Tuscany-SCA-J-CAA/ws/scajcaa/tuscany-java-caa-test-runner/src/test/java/testClient/TestInvocationService.java>
[sync] Copying <http://hudson.zones.apache.org/hudson/job/Tuscany-SCA-J-CAA/ws/scajcaa/sca-assembly/Test_Client/src/main/java/testClient/InvokeTestResponse.java> to <http://hudson.zones.apache.org/hudson/job/Tuscany-SCA-J-CAA/ws/scajcaa/tuscany-java-caa-test-runner/src/test/java/testClient/InvokeTestResponse.java>
[sync] Copying <http://hudson.zones.apache.org/hudson/job/Tuscany-SCA-J-CAA/ws/scajcaa/sca-assembly/Test_Client/src/main/java/testClient/package-info.java> to <http://hudson.zones.apache.org/hudson/job/Tuscany-SCA-J-CAA/ws/scajcaa/tuscany-java-caa-test-runner/src/test/java/testClient/package-info.java>
[sync] Copying <http://hudson.zones.apache.org/hudson/job/Tuscany-SCA-J-CAA/ws/scajcaa/sca-assembly/Test_Client/src/main/java/testClient/TestException.java> to <http://hudson.zones.apache.org/hudson/job/Tuscany-SCA-J-CAA/ws/scajcaa/tuscany-java-caa-test-runner/src/test/java/testClient/TestException.java>
[sync] Copying <http://hudson.zones.apache.org/hudson/job/Tuscany-SCA-J-CAA/ws/scajcaa/sca-assembly/Test_Client/src/main/java/testClient/ObjectFactory.java> to <http://hudson.zones.apache.org/hudson/job/Tuscany-SCA-J-CAA/ws/scajcaa/tuscany-java-caa-test-runner/src/test/java/testClient/ObjectFactory.java>
[sync] Copying <http://hudson.zones.apache.org/hudson/job/Tuscany-SCA-J-CAA/ws/scajcaa/sca-assembly/Test_Client/src/main/java/testClient/TestInvocation.java> to <http://hudson.zones.apache.org/hudson/job/Tuscany-SCA-J-CAA/ws/scajcaa/tuscany-java-caa-test-runner/src/test/java/testClient/TestInvocation.java>
[sync] Copying <http://hudson.zones.apache.org/hudson/job/Tuscany-SCA-J-CAA/ws/scajcaa/sca-assembly/Test_Client/src/main/java/testClient/TestException_Exception.java> to <http://hudson.zones.apache.org/hudson/job/Tuscany-SCA-J-CAA/ws/scajcaa/tuscany-java-caa-test-runner/src/test/java/testClient/TestException_Exception.java>
copyFile:
[HUDSON] Archiving <http://hudson.zones.apache.org/hudson/job/Tuscany-SCA-J-CAA/ws/scajcaa/tuscany-java-caa-test-runner/pom.xml> to /export/home/hudson/hudson/jobs/Tuscany-SCA-J-CAA/modules/org.apache.tuscany.sca$tuscany-otests-sca-j-caa-tests/builds/2009-11-26_00-48-38/archive/org.apache.tuscany.sca/tuscany-otests-sca-j-caa-tests/2.0-SNAPSHOT/pom.xml
[INFO] ------------------------------------------------------------------------
[ERROR] BUILD ERROR
[INFO] ------------------------------------------------------------------------
[INFO] An Ant BuildException has occured: The following error occurred while executing this line:
<http://hudson.zones.apache.org/hudson/job/Tuscany-SCA-J-CAA/ws/scajcaa/build.xml>:53: Warning: Could not find file <http://hudson.zones.apache.org/hudson/job/Tuscany-SCA-J-CAA/ws/scajcaa/sca-assembly/Test_Client/src/main/java/client/BaseJAXWSTestCase.java> to copy.
[INFO] ------------------------------------------------------------------------
[INFO] For more information, run Maven with the -e switch
[INFO] ------------------------------------------------------------------------
[INFO] Total time: 26 minutes 31 seconds
[INFO] Finished at: Thu Nov 26 01:15:17 UTC 2009
[INFO] Final Memory: 141M/742M
[INFO] ------------------------------------------------------------------------
Waiting for Hudson to finish collecting data
Sending e-mails to: commits@tuscany.apache.org
channel stopped
Build failed in Hudson: Tuscany-SCA-J-CAA #40
Posted by Apache Hudson Server <hu...@hudson.zones.apache.org>.
See <http://hudson.zones.apache.org/hudson/job/Tuscany-SCA-J-CAA/40/>
------------------------------------------
[...truncated 5559 lines...]
[INFO] Building jar: <http://hudson.zones.apache.org/hudson/job/Tuscany-SCA-J-CAA/ws/scajcaa/sca-java-caa/JCA_10052/target/JCA_10052.jar>
[INFO] [assembly:single {execution: make-assembly}]
[INFO] Reading assembly descriptor: ../tozip.xml
[INFO] Building zip: <http://hudson.zones.apache.org/hudson/job/Tuscany-SCA-J-CAA/ws/scajcaa/sca-java-caa/JCA_10052/target/JCA_10052.zip>
[WARNING] Configuration options: 'appendAssemblyId' is set to false, and 'classifier' is missing.
Instead of attaching the assembly file: <http://hudson.zones.apache.org/hudson/job/Tuscany-SCA-J-CAA/ws/scajcaa/sca-java-caa/JCA_10052/target/JCA_10052.zip,> it will become the file for main project artifact.
NOTE: If multiple descriptors or descriptor-formats are provided for this project, the value of this file will be non-deterministic!
[WARNING] Replacing pre-existing project main-artifact file: <http://hudson.zones.apache.org/hudson/job/Tuscany-SCA-J-CAA/ws/scajcaa/sca-java-caa/JCA_10052/target/JCA_10052.jar>
with assembly file: <http://hudson.zones.apache.org/hudson/job/Tuscany-SCA-J-CAA/ws/scajcaa/sca-java-caa/JCA_10052/target/JCA_10052.zip>
[INFO] [install:install]
[INFO] Installing <http://hudson.zones.apache.org/hudson/job/Tuscany-SCA-J-CAA/ws/scajcaa/sca-java-caa/JCA_10052/target/JCA_10052.zip> to /export/home/hudson/.m2/repository/org/oasis-open/sca/j/JCA_10052/1.0/JCA_10052-1.0.jar
[HUDSON] Archiving <http://hudson.zones.apache.org/hudson/job/Tuscany-SCA-J-CAA/ws/scajcaa/sca-java-caa/JCA_10052/pom.xml> to /export/home/hudson/hudson/jobs/Tuscany-SCA-J-CAA/modules/org.oasis-open.sca.j$JCA_10052/builds/2009-11-25_00-48-32/archive/org.oasis-open.sca.j/JCA_10052/1.0/pom.xml
[HUDSON] Archiving <http://hudson.zones.apache.org/hudson/job/Tuscany-SCA-J-CAA/ws/scajcaa/sca-java-caa/JCA_10052/target/JCA_10052.zip> to /export/home/hudson/hudson/jobs/Tuscany-SCA-J-CAA/modules/org.oasis-open.sca.j$JCA_10052/builds/2009-11-25_00-48-32/archive/org.oasis-open.sca.j/JCA_10052/1.0/JCA_10052.zip
[INFO] ------------------------------------------------------------------------
[INFO] Building OASIS Java CAA TestCases - Contribution JCA_11005
[INFO] task-segment: [clean, install]
[INFO] ------------------------------------------------------------------------
[INFO] [clean:clean]
[INFO] Deleting directory <http://hudson.zones.apache.org/hudson/job/Tuscany-SCA-J-CAA/ws/scajcaa/sca-java-caa/JCA_11005/target>
[INFO] [resources:resources]
[INFO] Using default encoding to copy filtered resources.
[INFO] [compiler:compile]
[INFO] Compiling 2 source files to <http://hudson.zones.apache.org/hudson/job/Tuscany-SCA-J-CAA/ws/scajcaa/sca-java-caa/JCA_11005/target/classes>
[INFO] [resources:testResources]
[INFO] Using default encoding to copy filtered resources.
[INFO] [compiler:testCompile]
[INFO] No sources to compile
[INFO] [surefire:test]
[INFO] No tests to run.
[HUDSON] Recording test results
[INFO] [jar:jar]
[INFO] Building jar: <http://hudson.zones.apache.org/hudson/job/Tuscany-SCA-J-CAA/ws/scajcaa/sca-java-caa/JCA_11005/target/JCA_11005.jar>
[INFO] [assembly:single {execution: make-assembly}]
[INFO] Reading assembly descriptor: ../tozip.xml
[INFO] Building zip: <http://hudson.zones.apache.org/hudson/job/Tuscany-SCA-J-CAA/ws/scajcaa/sca-java-caa/JCA_11005/target/JCA_11005.zip>
[WARNING] Configuration options: 'appendAssemblyId' is set to false, and 'classifier' is missing.
Instead of attaching the assembly file: <http://hudson.zones.apache.org/hudson/job/Tuscany-SCA-J-CAA/ws/scajcaa/sca-java-caa/JCA_11005/target/JCA_11005.zip,> it will become the file for main project artifact.
NOTE: If multiple descriptors or descriptor-formats are provided for this project, the value of this file will be non-deterministic!
[WARNING] Replacing pre-existing project main-artifact file: <http://hudson.zones.apache.org/hudson/job/Tuscany-SCA-J-CAA/ws/scajcaa/sca-java-caa/JCA_11005/target/JCA_11005.jar>
with assembly file: <http://hudson.zones.apache.org/hudson/job/Tuscany-SCA-J-CAA/ws/scajcaa/sca-java-caa/JCA_11005/target/JCA_11005.zip>
[INFO] [install:install]
[INFO] Installing <http://hudson.zones.apache.org/hudson/job/Tuscany-SCA-J-CAA/ws/scajcaa/sca-java-caa/JCA_11005/target/JCA_11005.zip> to /export/home/hudson/.m2/repository/org/oasis-open/sca/j/JCA_11005/1.0/JCA_11005-1.0.jar
[HUDSON] Archiving <http://hudson.zones.apache.org/hudson/job/Tuscany-SCA-J-CAA/ws/scajcaa/sca-java-caa/JCA_11005/pom.xml> to /export/home/hudson/hudson/jobs/Tuscany-SCA-J-CAA/modules/org.oasis-open.sca.j$JCA_11005/builds/2009-11-25_00-48-32/archive/org.oasis-open.sca.j/JCA_11005/1.0/pom.xml
[HUDSON] Archiving <http://hudson.zones.apache.org/hudson/job/Tuscany-SCA-J-CAA/ws/scajcaa/sca-java-caa/JCA_11005/target/JCA_11005.zip> to /export/home/hudson/hudson/jobs/Tuscany-SCA-J-CAA/modules/org.oasis-open.sca.j$JCA_11005/builds/2009-11-25_00-48-32/archive/org.oasis-open.sca.j/JCA_11005/1.0/JCA_11005.zip
[INFO] ------------------------------------------------------------------------
[INFO] Building OASIS Java CAA TestCases - Contribution JCA_11006
[INFO] task-segment: [clean, install]
[INFO] ------------------------------------------------------------------------
[INFO] [clean:clean]
[INFO] Deleting directory <http://hudson.zones.apache.org/hudson/job/Tuscany-SCA-J-CAA/ws/scajcaa/sca-java-caa/JCA_11006/target>
[INFO] [resources:resources]
[INFO] Using default encoding to copy filtered resources.
[INFO] [compiler:compile]
[INFO] Compiling 1 source file to <http://hudson.zones.apache.org/hudson/job/Tuscany-SCA-J-CAA/ws/scajcaa/sca-java-caa/JCA_11006/target/classes>
[INFO] [resources:testResources]
[INFO] Using default encoding to copy filtered resources.
[INFO] [compiler:testCompile]
[INFO] No sources to compile
[INFO] [surefire:test]
[INFO] No tests to run.
[HUDSON] Recording test results
[INFO] [jar:jar]
[INFO] Building jar: <http://hudson.zones.apache.org/hudson/job/Tuscany-SCA-J-CAA/ws/scajcaa/sca-java-caa/JCA_11006/target/JCA_11006.jar>
[INFO] [assembly:single {execution: make-assembly}]
[INFO] Reading assembly descriptor: ../tozip.xml
[INFO] Building zip: <http://hudson.zones.apache.org/hudson/job/Tuscany-SCA-J-CAA/ws/scajcaa/sca-java-caa/JCA_11006/target/JCA_11006.zip>
[WARNING] Configuration options: 'appendAssemblyId' is set to false, and 'classifier' is missing.
Instead of attaching the assembly file: <http://hudson.zones.apache.org/hudson/job/Tuscany-SCA-J-CAA/ws/scajcaa/sca-java-caa/JCA_11006/target/JCA_11006.zip,> it will become the file for main project artifact.
NOTE: If multiple descriptors or descriptor-formats are provided for this project, the value of this file will be non-deterministic!
[WARNING] Replacing pre-existing project main-artifact file: <http://hudson.zones.apache.org/hudson/job/Tuscany-SCA-J-CAA/ws/scajcaa/sca-java-caa/JCA_11006/target/JCA_11006.jar>
with assembly file: <http://hudson.zones.apache.org/hudson/job/Tuscany-SCA-J-CAA/ws/scajcaa/sca-java-caa/JCA_11006/target/JCA_11006.zip>
[INFO] [install:install]
[INFO] Installing <http://hudson.zones.apache.org/hudson/job/Tuscany-SCA-J-CAA/ws/scajcaa/sca-java-caa/JCA_11006/target/JCA_11006.zip> to /export/home/hudson/.m2/repository/org/oasis-open/sca/j/JCA_11006/1.0/JCA_11006-1.0.jar
[HUDSON] Archiving <http://hudson.zones.apache.org/hudson/job/Tuscany-SCA-J-CAA/ws/scajcaa/sca-java-caa/JCA_11006/pom.xml> to /export/home/hudson/hudson/jobs/Tuscany-SCA-J-CAA/modules/org.oasis-open.sca.j$JCA_11006/builds/2009-11-25_00-48-32/archive/org.oasis-open.sca.j/JCA_11006/1.0/pom.xml
[HUDSON] Archiving <http://hudson.zones.apache.org/hudson/job/Tuscany-SCA-J-CAA/ws/scajcaa/sca-java-caa/JCA_11006/target/JCA_11006.zip> to /export/home/hudson/hudson/jobs/Tuscany-SCA-J-CAA/modules/org.oasis-open.sca.j$JCA_11006/builds/2009-11-25_00-48-32/archive/org.oasis-open.sca.j/JCA_11006/1.0/JCA_11006.zip
[INFO] ------------------------------------------------------------------------
[INFO] Building OASIS Java CAA TestCases - Contribution JCA_11007
[INFO] task-segment: [clean, install]
[INFO] ------------------------------------------------------------------------
[INFO] [clean:clean]
[INFO] Deleting directory <http://hudson.zones.apache.org/hudson/job/Tuscany-SCA-J-CAA/ws/scajcaa/sca-java-caa/JCA_11007/target>
[INFO] [resources:resources]
[INFO] Using default encoding to copy filtered resources.
[INFO] [compiler:compile]
[INFO] Compiling 1 source file to <http://hudson.zones.apache.org/hudson/job/Tuscany-SCA-J-CAA/ws/scajcaa/sca-java-caa/JCA_11007/target/classes>
[INFO] [resources:testResources]
[INFO] Using default encoding to copy filtered resources.
[INFO] [compiler:testCompile]
[INFO] No sources to compile
[INFO] [surefire:test]
[INFO] No tests to run.
[HUDSON] Recording test results
[INFO] [jar:jar]
[INFO] Building jar: <http://hudson.zones.apache.org/hudson/job/Tuscany-SCA-J-CAA/ws/scajcaa/sca-java-caa/JCA_11007/target/JCA_11007.jar>
[INFO] [assembly:single {execution: make-assembly}]
[INFO] Reading assembly descriptor: ../tozip.xml
[INFO] Building zip: <http://hudson.zones.apache.org/hudson/job/Tuscany-SCA-J-CAA/ws/scajcaa/sca-java-caa/JCA_11007/target/JCA_11007.zip>
[WARNING] Configuration options: 'appendAssemblyId' is set to false, and 'classifier' is missing.
Instead of attaching the assembly file: <http://hudson.zones.apache.org/hudson/job/Tuscany-SCA-J-CAA/ws/scajcaa/sca-java-caa/JCA_11007/target/JCA_11007.zip,> it will become the file for main project artifact.
NOTE: If multiple descriptors or descriptor-formats are provided for this project, the value of this file will be non-deterministic!
[WARNING] Replacing pre-existing project main-artifact file: <http://hudson.zones.apache.org/hudson/job/Tuscany-SCA-J-CAA/ws/scajcaa/sca-java-caa/JCA_11007/target/JCA_11007.jar>
with assembly file: <http://hudson.zones.apache.org/hudson/job/Tuscany-SCA-J-CAA/ws/scajcaa/sca-java-caa/JCA_11007/target/JCA_11007.zip>
[INFO] [install:install]
[INFO] Installing <http://hudson.zones.apache.org/hudson/job/Tuscany-SCA-J-CAA/ws/scajcaa/sca-java-caa/JCA_11007/target/JCA_11007.zip> to /export/home/hudson/.m2/repository/org/oasis-open/sca/j/JCA_11007/1.0/JCA_11007-1.0.jar
[HUDSON] Archiving <http://hudson.zones.apache.org/hudson/job/Tuscany-SCA-J-CAA/ws/scajcaa/sca-java-caa/JCA_11007/pom.xml> to /export/home/hudson/hudson/jobs/Tuscany-SCA-J-CAA/modules/org.oasis-open.sca.j$JCA_11007/builds/2009-11-25_00-48-32/archive/org.oasis-open.sca.j/JCA_11007/1.0/pom.xml
[HUDSON] Archiving <http://hudson.zones.apache.org/hudson/job/Tuscany-SCA-J-CAA/ws/scajcaa/sca-java-caa/JCA_11007/target/JCA_11007.zip> to /export/home/hudson/hudson/jobs/Tuscany-SCA-J-CAA/modules/org.oasis-open.sca.j$JCA_11007/builds/2009-11-25_00-48-32/archive/org.oasis-open.sca.j/JCA_11007/1.0/JCA_11007.zip
[INFO] ------------------------------------------------------------------------
[INFO] Building OASIS Java CAA TestCases - Contribution JCA_11008
[INFO] task-segment: [clean, install]
[INFO] ------------------------------------------------------------------------
[INFO] [clean:clean]
[INFO] Deleting directory <http://hudson.zones.apache.org/hudson/job/Tuscany-SCA-J-CAA/ws/scajcaa/sca-java-caa/JCA_11008/target>
[INFO] [resources:resources]
[INFO] Using default encoding to copy filtered resources.
[INFO] [compiler:compile]
[INFO] Compiling 1 source file to <http://hudson.zones.apache.org/hudson/job/Tuscany-SCA-J-CAA/ws/scajcaa/sca-java-caa/JCA_11008/target/classes>
[INFO] [resources:testResources]
[INFO] Using default encoding to copy filtered resources.
[INFO] [compiler:testCompile]
[INFO] No sources to compile
[INFO] [surefire:test]
[INFO] No tests to run.
[HUDSON] Recording test results
[INFO] [jar:jar]
[INFO] Building jar: <http://hudson.zones.apache.org/hudson/job/Tuscany-SCA-J-CAA/ws/scajcaa/sca-java-caa/JCA_11008/target/JCA_11008.jar>
[INFO] [assembly:single {execution: make-assembly}]
[INFO] Reading assembly descriptor: ../tozip.xml
[INFO] Building zip: <http://hudson.zones.apache.org/hudson/job/Tuscany-SCA-J-CAA/ws/scajcaa/sca-java-caa/JCA_11008/target/JCA_11008.zip>
[WARNING] Configuration options: 'appendAssemblyId' is set to false, and 'classifier' is missing.
Instead of attaching the assembly file: <http://hudson.zones.apache.org/hudson/job/Tuscany-SCA-J-CAA/ws/scajcaa/sca-java-caa/JCA_11008/target/JCA_11008.zip,> it will become the file for main project artifact.
NOTE: If multiple descriptors or descriptor-formats are provided for this project, the value of this file will be non-deterministic!
[WARNING] Replacing pre-existing project main-artifact file: <http://hudson.zones.apache.org/hudson/job/Tuscany-SCA-J-CAA/ws/scajcaa/sca-java-caa/JCA_11008/target/JCA_11008.jar>
with assembly file: <http://hudson.zones.apache.org/hudson/job/Tuscany-SCA-J-CAA/ws/scajcaa/sca-java-caa/JCA_11008/target/JCA_11008.zip>
[INFO] [install:install]
[INFO] Installing <http://hudson.zones.apache.org/hudson/job/Tuscany-SCA-J-CAA/ws/scajcaa/sca-java-caa/JCA_11008/target/JCA_11008.zip> to /export/home/hudson/.m2/repository/org/oasis-open/sca/j/JCA_11008/1.0/JCA_11008-1.0.jar
[HUDSON] Archiving <http://hudson.zones.apache.org/hudson/job/Tuscany-SCA-J-CAA/ws/scajcaa/sca-java-caa/JCA_11008/pom.xml> to /export/home/hudson/hudson/jobs/Tuscany-SCA-J-CAA/modules/org.oasis-open.sca.j$JCA_11008/builds/2009-11-25_00-48-32/archive/org.oasis-open.sca.j/JCA_11008/1.0/pom.xml
[HUDSON] Archiving <http://hudson.zones.apache.org/hudson/job/Tuscany-SCA-J-CAA/ws/scajcaa/sca-java-caa/JCA_11008/target/JCA_11008.zip> to /export/home/hudson/hudson/jobs/Tuscany-SCA-J-CAA/modules/org.oasis-open.sca.j$JCA_11008/builds/2009-11-25_00-48-32/archive/org.oasis-open.sca.j/JCA_11008/1.0/JCA_11008.zip
[INFO] ------------------------------------------------------------------------
[INFO] Building OASIS Java CAA TestCases - Test Client
[INFO] task-segment: [clean, install]
[INFO] ------------------------------------------------------------------------
[INFO] [clean:clean]
[INFO] Deleting directory <http://hudson.zones.apache.org/hudson/job/Tuscany-SCA-J-CAA/ws/scajcaa/sca-java-caa/Test_Client_JavaCAA/target>
[INFO] [resources:resources]
[INFO] Using default encoding to copy filtered resources.
[INFO] [compiler:compile]
[INFO] Compiling 79 source files to <http://hudson.zones.apache.org/hudson/job/Tuscany-SCA-J-CAA/ws/scajcaa/sca-java-caa/Test_Client_JavaCAA/target/classes>
[INFO] [resources:testResources]
[INFO] Using default encoding to copy filtered resources.
[INFO] [compiler:testCompile]
[INFO] No sources to compile
[INFO] [surefire:test]
[INFO] No tests to run.
[HUDSON] Recording test results
[INFO] [jar:jar]
[INFO] Building jar: <http://hudson.zones.apache.org/hudson/job/Tuscany-SCA-J-CAA/ws/scajcaa/sca-java-caa/Test_Client_JavaCAA/target/Test_Client_JavaCAA.jar>
[INFO] [install:install]
[INFO] Installing <http://hudson.zones.apache.org/hudson/job/Tuscany-SCA-J-CAA/ws/scajcaa/sca-java-caa/Test_Client_JavaCAA/target/Test_Client_JavaCAA.jar> to /export/home/hudson/.m2/repository/org/oasis-open/sca/j/Test_Client_JavaCAA/1.0/Test_Client_JavaCAA-1.0.jar
[HUDSON] Archiving <http://hudson.zones.apache.org/hudson/job/Tuscany-SCA-J-CAA/ws/scajcaa/sca-java-caa/Test_Client_JavaCAA/pom.xml> to /export/home/hudson/hudson/jobs/Tuscany-SCA-J-CAA/modules/org.oasis-open.sca.j$Test_Client_JavaCAA/builds/2009-11-25_00-48-32/archive/org.oasis-open.sca.j/Test_Client_JavaCAA/1.0/pom.xml
[HUDSON] Archiving <http://hudson.zones.apache.org/hudson/job/Tuscany-SCA-J-CAA/ws/scajcaa/sca-java-caa/Test_Client_JavaCAA/target/Test_Client_JavaCAA.jar> to /export/home/hudson/hudson/jobs/Tuscany-SCA-J-CAA/modules/org.oasis-open.sca.j$Test_Client_JavaCAA/builds/2009-11-25_00-48-32/archive/org.oasis-open.sca.j/Test_Client_JavaCAA/1.0/Test_Client_JavaCAA.jar
[INFO] ------------------------------------------------------------------------
[INFO] Building Apache Tuscany SCA Specification Tests for SCA-J CAA
[INFO] task-segment: [clean, install]
[INFO] ------------------------------------------------------------------------
[INFO] [clean:clean]
[INFO] [build-helper:add-test-source {execution: add-test-source}]
[INFO] Test Source directory: <http://hudson.zones.apache.org/hudson/job/Tuscany-SCA-J-CAA/ws/scajcaa/tuscany-java-caa-test-runner/src/test/tjava> added.
[INFO] snapshot org.apache.tuscany.sca:tuscany-binding-ws-axis2:2.0-SNAPSHOT: checking for updates from apache.snapshots
[INFO] snapshot org.apache.tuscany.sca:tuscany-databinding-axiom:2.0-SNAPSHOT: checking for updates from apache.snapshots
[INFO] snapshot org.apache.tuscany.sca:tuscany-binding-ws-axis2-policy:2.0-SNAPSHOT: checking for updates from apache.snapshots
Downloading: http://repo2.maven.org/maven2/org/apache/santuario/xmlsec/1.4.0/xmlsec-1.4.0.pom
Downloading: http://people.apache.org/repo/m2-incubating-repository/org/apache/santuario/xmlsec/1.4.0/xmlsec-1.4.0.pom
Downloading: http://svn.apache.org/repos/asf/tuscany/maven/org/apache/santuario/xmlsec/1.4.0/xmlsec-1.4.0.pom
Downloading: http://ws.zones.apache.org/repository2/org/apache/santuario/xmlsec/1.4.0/xmlsec-1.4.0.pom
Downloading: http://ftp.ussg.iu.edu/eclipse/modeling/emf/emf/maven2//org/apache/santuario/xmlsec/1.4.0/xmlsec-1.4.0.pom
Downloading: http://ftp.osuosl.org/pub/eclipse/tools/emf/maven2/org/apache/santuario/xmlsec/1.4.0/xmlsec-1.4.0.pom
Downloading: http://www.intalio.org/public/maven2/org/apache/santuario/xmlsec/1.4.0/xmlsec-1.4.0.pom
Downloading: http://download.java.net/maven/1/org.apache.santuario/poms/xmlsec-1.4.0.pom
Downloading: http://download.java.net/maven/2/org/apache/santuario/xmlsec/1.4.0/xmlsec-1.4.0.pom
Downloading: http://repo1.maven.org/maven2/org/apache/santuario/xmlsec/1.4.0/xmlsec-1.4.0.pom
Downloading: http://repo2.maven.org/maven2/opensaml/opensaml/1.1/opensaml-1.1.pom
Downloading: http://people.apache.org/repo/m2-incubating-repository/opensaml/opensaml/1.1/opensaml-1.1.pom
Downloading: http://svn.apache.org/repos/asf/tuscany/maven/opensaml/opensaml/1.1/opensaml-1.1.pom
Downloading: http://ws.zones.apache.org/repository2/opensaml/opensaml/1.1/opensaml-1.1.pom
Downloading: http://ftp.ussg.iu.edu/eclipse/modeling/emf/emf/maven2//opensaml/opensaml/1.1/opensaml-1.1.pom
Downloading: http://ftp.osuosl.org/pub/eclipse/tools/emf/maven2/opensaml/opensaml/1.1/opensaml-1.1.pom
Downloading: http://www.intalio.org/public/maven2/opensaml/opensaml/1.1/opensaml-1.1.pom
Downloading: http://download.java.net/maven/1/opensaml/poms/opensaml-1.1.pom
Downloading: http://download.java.net/maven/2/opensaml/opensaml/1.1/opensaml-1.1.pom
Downloading: http://repo1.maven.org/maven2/opensaml/opensaml/1.1/opensaml-1.1.pom
Downloading: http://repo2.maven.org/maven2/org/apache/santuario/xmlsec/1.4.1/xmlsec-1.4.1.pom
Downloading: http://people.apache.org/repo/m2-incubating-repository/org/apache/santuario/xmlsec/1.4.1/xmlsec-1.4.1.pom
Downloading: http://svn.apache.org/repos/asf/tuscany/maven/org/apache/santuario/xmlsec/1.4.1/xmlsec-1.4.1.pom
Downloading: http://ws.zones.apache.org/repository2/org/apache/santuario/xmlsec/1.4.1/xmlsec-1.4.1.pom
Downloading: http://ftp.ussg.iu.edu/eclipse/modeling/emf/emf/maven2//org/apache/santuario/xmlsec/1.4.1/xmlsec-1.4.1.pom
Downloading: http://ftp.osuosl.org/pub/eclipse/tools/emf/maven2/org/apache/santuario/xmlsec/1.4.1/xmlsec-1.4.1.pom
Downloading: http://www.intalio.org/public/maven2/org/apache/santuario/xmlsec/1.4.1/xmlsec-1.4.1.pom
Downloading: http://download.java.net/maven/1/org.apache.santuario/poms/xmlsec-1.4.1.pom
Downloading: http://download.java.net/maven/2/org/apache/santuario/xmlsec/1.4.1/xmlsec-1.4.1.pom
Downloading: http://repo1.maven.org/maven2/org/apache/santuario/xmlsec/1.4.1/xmlsec-1.4.1.pom
[INFO] snapshot org.apache.tuscany.sca:tuscany-xsd:2.0-SNAPSHOT: checking for updates from apache.snapshots
[INFO] snapshot org.apache.tuscany.sca:tuscany-xsd:2.0-SNAPSHOT: checking for updates from apache.ws
[WARNING] repository metadata for: 'snapshot org.apache.tuscany.sca:tuscany-xsd:2.0-SNAPSHOT' could not be retrieved from repository: apache.ws due to an error: Error transferring file
[INFO] Repository 'apache.ws' will be blacklisted
[INFO] snapshot org.apache.tuscany.sca:tuscany-interface-wsdl:2.0-SNAPSHOT: checking for updates from apache.snapshots
[INFO] snapshot org.apache.tuscany.sca:tuscany-binding-ws:2.0-SNAPSHOT: checking for updates from apache.snapshots
[INFO] snapshot org.apache.tuscany.sca:tuscany-binding-ws-wsdlgen:2.0-SNAPSHOT: checking for updates from apache.snapshots
[INFO] snapshot org.apache.tuscany.sca:tuscany-databinding-jaxb-axiom:2.0-SNAPSHOT: checking for updates from apache.snapshots
[INFO] snapshot org.apache.tuscany.sca:tuscany-host-http:2.0-SNAPSHOT: checking for updates from apache.snapshots
[INFO] snapshot org.apache.tuscany.sca:tuscany-policy-security:2.0-SNAPSHOT: checking for updates from apache.snapshots
[INFO] snapshot org.apache.tuscany.sca:tuscany-policy-xml-ws:2.0-SNAPSHOT: checking for updates from apache.snapshots
[INFO] [antrun:run {execution: copy-files-from-svn}]
[INFO] Executing tasks
copyResourceDir:
copySourceDir:
[sync] Removed 1 dangling directory from <http://hudson.zones.apache.org/hudson/job/Tuscany-SCA-J-CAA/ws/scajcaa/tuscany-java-caa-test-runner/src/test/java>
[sync] Removed 8 dangling files from <http://hudson.zones.apache.org/hudson/job/Tuscany-SCA-J-CAA/ws/scajcaa/tuscany-java-caa-test-runner/src/test/java>
copySourceDir:
[sync] Copying 8 files to <http://hudson.zones.apache.org/hudson/job/Tuscany-SCA-J-CAA/ws/scajcaa/tuscany-java-caa-test-runner/src/test/java/testClient>
[sync] Copying <http://hudson.zones.apache.org/hudson/job/Tuscany-SCA-J-CAA/ws/scajcaa/sca-assembly/Test_Client/src/main/java/testClient/InvokeTest.java> to <http://hudson.zones.apache.org/hudson/job/Tuscany-SCA-J-CAA/ws/scajcaa/tuscany-java-caa-test-runner/src/test/java/testClient/InvokeTest.java>
[sync] Copying <http://hudson.zones.apache.org/hudson/job/Tuscany-SCA-J-CAA/ws/scajcaa/sca-assembly/Test_Client/src/main/java/testClient/TestInvocationService.java> to <http://hudson.zones.apache.org/hudson/job/Tuscany-SCA-J-CAA/ws/scajcaa/tuscany-java-caa-test-runner/src/test/java/testClient/TestInvocationService.java>
[sync] Copying <http://hudson.zones.apache.org/hudson/job/Tuscany-SCA-J-CAA/ws/scajcaa/sca-assembly/Test_Client/src/main/java/testClient/InvokeTestResponse.java> to <http://hudson.zones.apache.org/hudson/job/Tuscany-SCA-J-CAA/ws/scajcaa/tuscany-java-caa-test-runner/src/test/java/testClient/InvokeTestResponse.java>
[sync] Copying <http://hudson.zones.apache.org/hudson/job/Tuscany-SCA-J-CAA/ws/scajcaa/sca-assembly/Test_Client/src/main/java/testClient/package-info.java> to <http://hudson.zones.apache.org/hudson/job/Tuscany-SCA-J-CAA/ws/scajcaa/tuscany-java-caa-test-runner/src/test/java/testClient/package-info.java>
[sync] Copying <http://hudson.zones.apache.org/hudson/job/Tuscany-SCA-J-CAA/ws/scajcaa/sca-assembly/Test_Client/src/main/java/testClient/TestException.java> to <http://hudson.zones.apache.org/hudson/job/Tuscany-SCA-J-CAA/ws/scajcaa/tuscany-java-caa-test-runner/src/test/java/testClient/TestException.java>
[sync] Copying <http://hudson.zones.apache.org/hudson/job/Tuscany-SCA-J-CAA/ws/scajcaa/sca-assembly/Test_Client/src/main/java/testClient/ObjectFactory.java> to <http://hudson.zones.apache.org/hudson/job/Tuscany-SCA-J-CAA/ws/scajcaa/tuscany-java-caa-test-runner/src/test/java/testClient/ObjectFactory.java>
[sync] Copying <http://hudson.zones.apache.org/hudson/job/Tuscany-SCA-J-CAA/ws/scajcaa/sca-assembly/Test_Client/src/main/java/testClient/TestInvocation.java> to <http://hudson.zones.apache.org/hudson/job/Tuscany-SCA-J-CAA/ws/scajcaa/tuscany-java-caa-test-runner/src/test/java/testClient/TestInvocation.java>
[sync] Copying <http://hudson.zones.apache.org/hudson/job/Tuscany-SCA-J-CAA/ws/scajcaa/sca-assembly/Test_Client/src/main/java/testClient/TestException_Exception.java> to <http://hudson.zones.apache.org/hudson/job/Tuscany-SCA-J-CAA/ws/scajcaa/tuscany-java-caa-test-runner/src/test/java/testClient/TestException_Exception.java>
copyFile:
[HUDSON] Archiving <http://hudson.zones.apache.org/hudson/job/Tuscany-SCA-J-CAA/ws/scajcaa/tuscany-java-caa-test-runner/pom.xml> to /export/home/hudson/hudson/jobs/Tuscany-SCA-J-CAA/modules/org.apache.tuscany.sca$tuscany-otests-sca-j-caa-tests/builds/2009-11-25_00-48-32/archive/org.apache.tuscany.sca/tuscany-otests-sca-j-caa-tests/2.0-SNAPSHOT/pom.xml
[INFO] ------------------------------------------------------------------------
[ERROR] BUILD ERROR
[INFO] ------------------------------------------------------------------------
[INFO] An Ant BuildException has occured: The following error occurred while executing this line:
<http://hudson.zones.apache.org/hudson/job/Tuscany-SCA-J-CAA/ws/scajcaa/build.xml>:53: Warning: Could not find file <http://hudson.zones.apache.org/hudson/job/Tuscany-SCA-J-CAA/ws/scajcaa/sca-assembly/Test_Client/src/main/java/client/BaseJAXWSTestCase.java> to copy.
[INFO] ------------------------------------------------------------------------
[INFO] For more information, run Maven with the -e switch
[INFO] ------------------------------------------------------------------------
[INFO] Total time: 27 minutes 4 seconds
[INFO] Finished at: Wed Nov 25 01:15:40 UTC 2009
[INFO] Final Memory: 140M/742M
[INFO] ------------------------------------------------------------------------
Waiting for Hudson to finish collecting data
Sending e-mails to: commits@tuscany.apache.org
channel stopped
Build failed in Hudson: Tuscany-SCA-J-CAA #39
Posted by Apache Hudson Server <hu...@hudson.zones.apache.org>.
See <http://hudson.zones.apache.org/hudson/job/Tuscany-SCA-J-CAA/39/>
------------------------------------------
[...truncated 5559 lines...]
[INFO] Building jar: <http://hudson.zones.apache.org/hudson/job/Tuscany-SCA-J-CAA/ws/scajcaa/sca-java-caa/JCA_10052/target/JCA_10052.jar>
[INFO] [assembly:single {execution: make-assembly}]
[INFO] Reading assembly descriptor: ../tozip.xml
[INFO] Building zip: <http://hudson.zones.apache.org/hudson/job/Tuscany-SCA-J-CAA/ws/scajcaa/sca-java-caa/JCA_10052/target/JCA_10052.zip>
[WARNING] Configuration options: 'appendAssemblyId' is set to false, and 'classifier' is missing.
Instead of attaching the assembly file: <http://hudson.zones.apache.org/hudson/job/Tuscany-SCA-J-CAA/ws/scajcaa/sca-java-caa/JCA_10052/target/JCA_10052.zip,> it will become the file for main project artifact.
NOTE: If multiple descriptors or descriptor-formats are provided for this project, the value of this file will be non-deterministic!
[WARNING] Replacing pre-existing project main-artifact file: <http://hudson.zones.apache.org/hudson/job/Tuscany-SCA-J-CAA/ws/scajcaa/sca-java-caa/JCA_10052/target/JCA_10052.jar>
with assembly file: <http://hudson.zones.apache.org/hudson/job/Tuscany-SCA-J-CAA/ws/scajcaa/sca-java-caa/JCA_10052/target/JCA_10052.zip>
[INFO] [install:install]
[INFO] Installing <http://hudson.zones.apache.org/hudson/job/Tuscany-SCA-J-CAA/ws/scajcaa/sca-java-caa/JCA_10052/target/JCA_10052.zip> to /export/home/hudson/.m2/repository/org/oasis-open/sca/j/JCA_10052/1.0/JCA_10052-1.0.jar
[HUDSON] Archiving <http://hudson.zones.apache.org/hudson/job/Tuscany-SCA-J-CAA/ws/scajcaa/sca-java-caa/JCA_10052/pom.xml> to /export/home/hudson/hudson/jobs/Tuscany-SCA-J-CAA/modules/org.oasis-open.sca.j$JCA_10052/builds/2009-11-24_00-46-20/archive/org.oasis-open.sca.j/JCA_10052/1.0/pom.xml
[HUDSON] Archiving <http://hudson.zones.apache.org/hudson/job/Tuscany-SCA-J-CAA/ws/scajcaa/sca-java-caa/JCA_10052/target/JCA_10052.zip> to /export/home/hudson/hudson/jobs/Tuscany-SCA-J-CAA/modules/org.oasis-open.sca.j$JCA_10052/builds/2009-11-24_00-46-20/archive/org.oasis-open.sca.j/JCA_10052/1.0/JCA_10052.zip
[INFO] ------------------------------------------------------------------------
[INFO] Building OASIS Java CAA TestCases - Contribution JCA_11005
[INFO] task-segment: [clean, install]
[INFO] ------------------------------------------------------------------------
[INFO] [clean:clean]
[INFO] Deleting directory <http://hudson.zones.apache.org/hudson/job/Tuscany-SCA-J-CAA/ws/scajcaa/sca-java-caa/JCA_11005/target>
[INFO] [resources:resources]
[INFO] Using default encoding to copy filtered resources.
[INFO] [compiler:compile]
[INFO] Compiling 2 source files to <http://hudson.zones.apache.org/hudson/job/Tuscany-SCA-J-CAA/ws/scajcaa/sca-java-caa/JCA_11005/target/classes>
[INFO] [resources:testResources]
[INFO] Using default encoding to copy filtered resources.
[INFO] [compiler:testCompile]
[INFO] No sources to compile
[INFO] [surefire:test]
[INFO] No tests to run.
[HUDSON] Recording test results
[INFO] [jar:jar]
[INFO] Building jar: <http://hudson.zones.apache.org/hudson/job/Tuscany-SCA-J-CAA/ws/scajcaa/sca-java-caa/JCA_11005/target/JCA_11005.jar>
[INFO] [assembly:single {execution: make-assembly}]
[INFO] Reading assembly descriptor: ../tozip.xml
[INFO] Building zip: <http://hudson.zones.apache.org/hudson/job/Tuscany-SCA-J-CAA/ws/scajcaa/sca-java-caa/JCA_11005/target/JCA_11005.zip>
[WARNING] Configuration options: 'appendAssemblyId' is set to false, and 'classifier' is missing.
Instead of attaching the assembly file: <http://hudson.zones.apache.org/hudson/job/Tuscany-SCA-J-CAA/ws/scajcaa/sca-java-caa/JCA_11005/target/JCA_11005.zip,> it will become the file for main project artifact.
NOTE: If multiple descriptors or descriptor-formats are provided for this project, the value of this file will be non-deterministic!
[WARNING] Replacing pre-existing project main-artifact file: <http://hudson.zones.apache.org/hudson/job/Tuscany-SCA-J-CAA/ws/scajcaa/sca-java-caa/JCA_11005/target/JCA_11005.jar>
with assembly file: <http://hudson.zones.apache.org/hudson/job/Tuscany-SCA-J-CAA/ws/scajcaa/sca-java-caa/JCA_11005/target/JCA_11005.zip>
[INFO] [install:install]
[INFO] Installing <http://hudson.zones.apache.org/hudson/job/Tuscany-SCA-J-CAA/ws/scajcaa/sca-java-caa/JCA_11005/target/JCA_11005.zip> to /export/home/hudson/.m2/repository/org/oasis-open/sca/j/JCA_11005/1.0/JCA_11005-1.0.jar
[HUDSON] Archiving <http://hudson.zones.apache.org/hudson/job/Tuscany-SCA-J-CAA/ws/scajcaa/sca-java-caa/JCA_11005/pom.xml> to /export/home/hudson/hudson/jobs/Tuscany-SCA-J-CAA/modules/org.oasis-open.sca.j$JCA_11005/builds/2009-11-24_00-46-20/archive/org.oasis-open.sca.j/JCA_11005/1.0/pom.xml
[HUDSON] Archiving <http://hudson.zones.apache.org/hudson/job/Tuscany-SCA-J-CAA/ws/scajcaa/sca-java-caa/JCA_11005/target/JCA_11005.zip> to /export/home/hudson/hudson/jobs/Tuscany-SCA-J-CAA/modules/org.oasis-open.sca.j$JCA_11005/builds/2009-11-24_00-46-20/archive/org.oasis-open.sca.j/JCA_11005/1.0/JCA_11005.zip
[INFO] ------------------------------------------------------------------------
[INFO] Building OASIS Java CAA TestCases - Contribution JCA_11006
[INFO] task-segment: [clean, install]
[INFO] ------------------------------------------------------------------------
[INFO] [clean:clean]
[INFO] Deleting directory <http://hudson.zones.apache.org/hudson/job/Tuscany-SCA-J-CAA/ws/scajcaa/sca-java-caa/JCA_11006/target>
[INFO] [resources:resources]
[INFO] Using default encoding to copy filtered resources.
[INFO] [compiler:compile]
[INFO] Compiling 1 source file to <http://hudson.zones.apache.org/hudson/job/Tuscany-SCA-J-CAA/ws/scajcaa/sca-java-caa/JCA_11006/target/classes>
[INFO] [resources:testResources]
[INFO] Using default encoding to copy filtered resources.
[INFO] [compiler:testCompile]
[INFO] No sources to compile
[INFO] [surefire:test]
[INFO] No tests to run.
[HUDSON] Recording test results
[INFO] [jar:jar]
[INFO] Building jar: <http://hudson.zones.apache.org/hudson/job/Tuscany-SCA-J-CAA/ws/scajcaa/sca-java-caa/JCA_11006/target/JCA_11006.jar>
[INFO] [assembly:single {execution: make-assembly}]
[INFO] Reading assembly descriptor: ../tozip.xml
[INFO] Building zip: <http://hudson.zones.apache.org/hudson/job/Tuscany-SCA-J-CAA/ws/scajcaa/sca-java-caa/JCA_11006/target/JCA_11006.zip>
[WARNING] Configuration options: 'appendAssemblyId' is set to false, and 'classifier' is missing.
Instead of attaching the assembly file: <http://hudson.zones.apache.org/hudson/job/Tuscany-SCA-J-CAA/ws/scajcaa/sca-java-caa/JCA_11006/target/JCA_11006.zip,> it will become the file for main project artifact.
NOTE: If multiple descriptors or descriptor-formats are provided for this project, the value of this file will be non-deterministic!
[WARNING] Replacing pre-existing project main-artifact file: <http://hudson.zones.apache.org/hudson/job/Tuscany-SCA-J-CAA/ws/scajcaa/sca-java-caa/JCA_11006/target/JCA_11006.jar>
with assembly file: <http://hudson.zones.apache.org/hudson/job/Tuscany-SCA-J-CAA/ws/scajcaa/sca-java-caa/JCA_11006/target/JCA_11006.zip>
[INFO] [install:install]
[INFO] Installing <http://hudson.zones.apache.org/hudson/job/Tuscany-SCA-J-CAA/ws/scajcaa/sca-java-caa/JCA_11006/target/JCA_11006.zip> to /export/home/hudson/.m2/repository/org/oasis-open/sca/j/JCA_11006/1.0/JCA_11006-1.0.jar
[HUDSON] Archiving <http://hudson.zones.apache.org/hudson/job/Tuscany-SCA-J-CAA/ws/scajcaa/sca-java-caa/JCA_11006/pom.xml> to /export/home/hudson/hudson/jobs/Tuscany-SCA-J-CAA/modules/org.oasis-open.sca.j$JCA_11006/builds/2009-11-24_00-46-20/archive/org.oasis-open.sca.j/JCA_11006/1.0/pom.xml
[HUDSON] Archiving <http://hudson.zones.apache.org/hudson/job/Tuscany-SCA-J-CAA/ws/scajcaa/sca-java-caa/JCA_11006/target/JCA_11006.zip> to /export/home/hudson/hudson/jobs/Tuscany-SCA-J-CAA/modules/org.oasis-open.sca.j$JCA_11006/builds/2009-11-24_00-46-20/archive/org.oasis-open.sca.j/JCA_11006/1.0/JCA_11006.zip
[INFO] ------------------------------------------------------------------------
[INFO] Building OASIS Java CAA TestCases - Contribution JCA_11007
[INFO] task-segment: [clean, install]
[INFO] ------------------------------------------------------------------------
[INFO] [clean:clean]
[INFO] Deleting directory <http://hudson.zones.apache.org/hudson/job/Tuscany-SCA-J-CAA/ws/scajcaa/sca-java-caa/JCA_11007/target>
[INFO] [resources:resources]
[INFO] Using default encoding to copy filtered resources.
[INFO] [compiler:compile]
[INFO] Compiling 1 source file to <http://hudson.zones.apache.org/hudson/job/Tuscany-SCA-J-CAA/ws/scajcaa/sca-java-caa/JCA_11007/target/classes>
[INFO] [resources:testResources]
[INFO] Using default encoding to copy filtered resources.
[INFO] [compiler:testCompile]
[INFO] No sources to compile
[INFO] [surefire:test]
[INFO] No tests to run.
[HUDSON] Recording test results
[INFO] [jar:jar]
[INFO] Building jar: <http://hudson.zones.apache.org/hudson/job/Tuscany-SCA-J-CAA/ws/scajcaa/sca-java-caa/JCA_11007/target/JCA_11007.jar>
[INFO] [assembly:single {execution: make-assembly}]
[INFO] Reading assembly descriptor: ../tozip.xml
[INFO] Building zip: <http://hudson.zones.apache.org/hudson/job/Tuscany-SCA-J-CAA/ws/scajcaa/sca-java-caa/JCA_11007/target/JCA_11007.zip>
[WARNING] Configuration options: 'appendAssemblyId' is set to false, and 'classifier' is missing.
Instead of attaching the assembly file: <http://hudson.zones.apache.org/hudson/job/Tuscany-SCA-J-CAA/ws/scajcaa/sca-java-caa/JCA_11007/target/JCA_11007.zip,> it will become the file for main project artifact.
NOTE: If multiple descriptors or descriptor-formats are provided for this project, the value of this file will be non-deterministic!
[WARNING] Replacing pre-existing project main-artifact file: <http://hudson.zones.apache.org/hudson/job/Tuscany-SCA-J-CAA/ws/scajcaa/sca-java-caa/JCA_11007/target/JCA_11007.jar>
with assembly file: <http://hudson.zones.apache.org/hudson/job/Tuscany-SCA-J-CAA/ws/scajcaa/sca-java-caa/JCA_11007/target/JCA_11007.zip>
[INFO] [install:install]
[INFO] Installing <http://hudson.zones.apache.org/hudson/job/Tuscany-SCA-J-CAA/ws/scajcaa/sca-java-caa/JCA_11007/target/JCA_11007.zip> to /export/home/hudson/.m2/repository/org/oasis-open/sca/j/JCA_11007/1.0/JCA_11007-1.0.jar
[HUDSON] Archiving <http://hudson.zones.apache.org/hudson/job/Tuscany-SCA-J-CAA/ws/scajcaa/sca-java-caa/JCA_11007/pom.xml> to /export/home/hudson/hudson/jobs/Tuscany-SCA-J-CAA/modules/org.oasis-open.sca.j$JCA_11007/builds/2009-11-24_00-46-20/archive/org.oasis-open.sca.j/JCA_11007/1.0/pom.xml
[HUDSON] Archiving <http://hudson.zones.apache.org/hudson/job/Tuscany-SCA-J-CAA/ws/scajcaa/sca-java-caa/JCA_11007/target/JCA_11007.zip> to /export/home/hudson/hudson/jobs/Tuscany-SCA-J-CAA/modules/org.oasis-open.sca.j$JCA_11007/builds/2009-11-24_00-46-20/archive/org.oasis-open.sca.j/JCA_11007/1.0/JCA_11007.zip
[INFO] ------------------------------------------------------------------------
[INFO] Building OASIS Java CAA TestCases - Contribution JCA_11008
[INFO] task-segment: [clean, install]
[INFO] ------------------------------------------------------------------------
[INFO] [clean:clean]
[INFO] Deleting directory <http://hudson.zones.apache.org/hudson/job/Tuscany-SCA-J-CAA/ws/scajcaa/sca-java-caa/JCA_11008/target>
[INFO] [resources:resources]
[INFO] Using default encoding to copy filtered resources.
[INFO] [compiler:compile]
[INFO] Compiling 1 source file to <http://hudson.zones.apache.org/hudson/job/Tuscany-SCA-J-CAA/ws/scajcaa/sca-java-caa/JCA_11008/target/classes>
[INFO] [resources:testResources]
[INFO] Using default encoding to copy filtered resources.
[INFO] [compiler:testCompile]
[INFO] No sources to compile
[INFO] [surefire:test]
[INFO] No tests to run.
[HUDSON] Recording test results
[INFO] [jar:jar]
[INFO] Building jar: <http://hudson.zones.apache.org/hudson/job/Tuscany-SCA-J-CAA/ws/scajcaa/sca-java-caa/JCA_11008/target/JCA_11008.jar>
[INFO] [assembly:single {execution: make-assembly}]
[INFO] Reading assembly descriptor: ../tozip.xml
[INFO] Building zip: <http://hudson.zones.apache.org/hudson/job/Tuscany-SCA-J-CAA/ws/scajcaa/sca-java-caa/JCA_11008/target/JCA_11008.zip>
[WARNING] Configuration options: 'appendAssemblyId' is set to false, and 'classifier' is missing.
Instead of attaching the assembly file: <http://hudson.zones.apache.org/hudson/job/Tuscany-SCA-J-CAA/ws/scajcaa/sca-java-caa/JCA_11008/target/JCA_11008.zip,> it will become the file for main project artifact.
NOTE: If multiple descriptors or descriptor-formats are provided for this project, the value of this file will be non-deterministic!
[WARNING] Replacing pre-existing project main-artifact file: <http://hudson.zones.apache.org/hudson/job/Tuscany-SCA-J-CAA/ws/scajcaa/sca-java-caa/JCA_11008/target/JCA_11008.jar>
with assembly file: <http://hudson.zones.apache.org/hudson/job/Tuscany-SCA-J-CAA/ws/scajcaa/sca-java-caa/JCA_11008/target/JCA_11008.zip>
[INFO] [install:install]
[INFO] Installing <http://hudson.zones.apache.org/hudson/job/Tuscany-SCA-J-CAA/ws/scajcaa/sca-java-caa/JCA_11008/target/JCA_11008.zip> to /export/home/hudson/.m2/repository/org/oasis-open/sca/j/JCA_11008/1.0/JCA_11008-1.0.jar
[HUDSON] Archiving <http://hudson.zones.apache.org/hudson/job/Tuscany-SCA-J-CAA/ws/scajcaa/sca-java-caa/JCA_11008/pom.xml> to /export/home/hudson/hudson/jobs/Tuscany-SCA-J-CAA/modules/org.oasis-open.sca.j$JCA_11008/builds/2009-11-24_00-46-20/archive/org.oasis-open.sca.j/JCA_11008/1.0/pom.xml
[HUDSON] Archiving <http://hudson.zones.apache.org/hudson/job/Tuscany-SCA-J-CAA/ws/scajcaa/sca-java-caa/JCA_11008/target/JCA_11008.zip> to /export/home/hudson/hudson/jobs/Tuscany-SCA-J-CAA/modules/org.oasis-open.sca.j$JCA_11008/builds/2009-11-24_00-46-20/archive/org.oasis-open.sca.j/JCA_11008/1.0/JCA_11008.zip
[INFO] ------------------------------------------------------------------------
[INFO] Building OASIS Java CAA TestCases - Test Client
[INFO] task-segment: [clean, install]
[INFO] ------------------------------------------------------------------------
[INFO] [clean:clean]
[INFO] Deleting directory <http://hudson.zones.apache.org/hudson/job/Tuscany-SCA-J-CAA/ws/scajcaa/sca-java-caa/Test_Client_JavaCAA/target>
[INFO] [resources:resources]
[INFO] Using default encoding to copy filtered resources.
[INFO] [compiler:compile]
[INFO] Compiling 79 source files to <http://hudson.zones.apache.org/hudson/job/Tuscany-SCA-J-CAA/ws/scajcaa/sca-java-caa/Test_Client_JavaCAA/target/classes>
[INFO] [resources:testResources]
[INFO] Using default encoding to copy filtered resources.
[INFO] [compiler:testCompile]
[INFO] No sources to compile
[INFO] [surefire:test]
[INFO] No tests to run.
[HUDSON] Recording test results
[INFO] [jar:jar]
[INFO] Building jar: <http://hudson.zones.apache.org/hudson/job/Tuscany-SCA-J-CAA/ws/scajcaa/sca-java-caa/Test_Client_JavaCAA/target/Test_Client_JavaCAA.jar>
[INFO] [install:install]
[INFO] Installing <http://hudson.zones.apache.org/hudson/job/Tuscany-SCA-J-CAA/ws/scajcaa/sca-java-caa/Test_Client_JavaCAA/target/Test_Client_JavaCAA.jar> to /export/home/hudson/.m2/repository/org/oasis-open/sca/j/Test_Client_JavaCAA/1.0/Test_Client_JavaCAA-1.0.jar
[HUDSON] Archiving <http://hudson.zones.apache.org/hudson/job/Tuscany-SCA-J-CAA/ws/scajcaa/sca-java-caa/Test_Client_JavaCAA/pom.xml> to /export/home/hudson/hudson/jobs/Tuscany-SCA-J-CAA/modules/org.oasis-open.sca.j$Test_Client_JavaCAA/builds/2009-11-24_00-46-20/archive/org.oasis-open.sca.j/Test_Client_JavaCAA/1.0/pom.xml
[HUDSON] Archiving <http://hudson.zones.apache.org/hudson/job/Tuscany-SCA-J-CAA/ws/scajcaa/sca-java-caa/Test_Client_JavaCAA/target/Test_Client_JavaCAA.jar> to /export/home/hudson/hudson/jobs/Tuscany-SCA-J-CAA/modules/org.oasis-open.sca.j$Test_Client_JavaCAA/builds/2009-11-24_00-46-20/archive/org.oasis-open.sca.j/Test_Client_JavaCAA/1.0/Test_Client_JavaCAA.jar
[INFO] ------------------------------------------------------------------------
[INFO] Building Apache Tuscany SCA Specification Tests for SCA-J CAA
[INFO] task-segment: [clean, install]
[INFO] ------------------------------------------------------------------------
[INFO] [clean:clean]
[INFO] [build-helper:add-test-source {execution: add-test-source}]
[INFO] Test Source directory: <http://hudson.zones.apache.org/hudson/job/Tuscany-SCA-J-CAA/ws/scajcaa/tuscany-java-caa-test-runner/src/test/tjava> added.
[INFO] snapshot org.apache.tuscany.sca:tuscany-binding-ws-axis2:2.0-SNAPSHOT: checking for updates from apache.snapshots
[INFO] snapshot org.apache.tuscany.sca:tuscany-databinding-axiom:2.0-SNAPSHOT: checking for updates from apache.snapshots
[INFO] snapshot org.apache.tuscany.sca:tuscany-binding-ws-axis2-policy:2.0-SNAPSHOT: checking for updates from apache.snapshots
Downloading: http://repo2.maven.org/maven2/org/apache/santuario/xmlsec/1.4.0/xmlsec-1.4.0.pom
Downloading: http://people.apache.org/repo/m2-incubating-repository/org/apache/santuario/xmlsec/1.4.0/xmlsec-1.4.0.pom
Downloading: http://svn.apache.org/repos/asf/tuscany/maven/org/apache/santuario/xmlsec/1.4.0/xmlsec-1.4.0.pom
Downloading: http://ws.zones.apache.org/repository2/org/apache/santuario/xmlsec/1.4.0/xmlsec-1.4.0.pom
Downloading: http://ftp.ussg.iu.edu/eclipse/modeling/emf/emf/maven2//org/apache/santuario/xmlsec/1.4.0/xmlsec-1.4.0.pom
Downloading: http://ftp.osuosl.org/pub/eclipse/tools/emf/maven2/org/apache/santuario/xmlsec/1.4.0/xmlsec-1.4.0.pom
Downloading: http://www.intalio.org/public/maven2/org/apache/santuario/xmlsec/1.4.0/xmlsec-1.4.0.pom
Downloading: http://download.java.net/maven/1/org.apache.santuario/poms/xmlsec-1.4.0.pom
Downloading: http://download.java.net/maven/2/org/apache/santuario/xmlsec/1.4.0/xmlsec-1.4.0.pom
Downloading: http://repo1.maven.org/maven2/org/apache/santuario/xmlsec/1.4.0/xmlsec-1.4.0.pom
Downloading: http://repo2.maven.org/maven2/opensaml/opensaml/1.1/opensaml-1.1.pom
Downloading: http://people.apache.org/repo/m2-incubating-repository/opensaml/opensaml/1.1/opensaml-1.1.pom
Downloading: http://svn.apache.org/repos/asf/tuscany/maven/opensaml/opensaml/1.1/opensaml-1.1.pom
Downloading: http://ws.zones.apache.org/repository2/opensaml/opensaml/1.1/opensaml-1.1.pom
Downloading: http://ftp.ussg.iu.edu/eclipse/modeling/emf/emf/maven2//opensaml/opensaml/1.1/opensaml-1.1.pom
Downloading: http://ftp.osuosl.org/pub/eclipse/tools/emf/maven2/opensaml/opensaml/1.1/opensaml-1.1.pom
Downloading: http://www.intalio.org/public/maven2/opensaml/opensaml/1.1/opensaml-1.1.pom
Downloading: http://download.java.net/maven/1/opensaml/poms/opensaml-1.1.pom
Downloading: http://download.java.net/maven/2/opensaml/opensaml/1.1/opensaml-1.1.pom
Downloading: http://repo1.maven.org/maven2/opensaml/opensaml/1.1/opensaml-1.1.pom
Downloading: http://repo2.maven.org/maven2/org/apache/santuario/xmlsec/1.4.1/xmlsec-1.4.1.pom
Downloading: http://people.apache.org/repo/m2-incubating-repository/org/apache/santuario/xmlsec/1.4.1/xmlsec-1.4.1.pom
Downloading: http://svn.apache.org/repos/asf/tuscany/maven/org/apache/santuario/xmlsec/1.4.1/xmlsec-1.4.1.pom
Downloading: http://ws.zones.apache.org/repository2/org/apache/santuario/xmlsec/1.4.1/xmlsec-1.4.1.pom
Downloading: http://ftp.ussg.iu.edu/eclipse/modeling/emf/emf/maven2//org/apache/santuario/xmlsec/1.4.1/xmlsec-1.4.1.pom
Downloading: http://ftp.osuosl.org/pub/eclipse/tools/emf/maven2/org/apache/santuario/xmlsec/1.4.1/xmlsec-1.4.1.pom
Downloading: http://www.intalio.org/public/maven2/org/apache/santuario/xmlsec/1.4.1/xmlsec-1.4.1.pom
Downloading: http://download.java.net/maven/1/org.apache.santuario/poms/xmlsec-1.4.1.pom
Downloading: http://download.java.net/maven/2/org/apache/santuario/xmlsec/1.4.1/xmlsec-1.4.1.pom
Downloading: http://repo1.maven.org/maven2/org/apache/santuario/xmlsec/1.4.1/xmlsec-1.4.1.pom
[INFO] snapshot org.apache.tuscany.sca:tuscany-xsd:2.0-SNAPSHOT: checking for updates from apache.snapshots
[INFO] snapshot org.apache.tuscany.sca:tuscany-xsd:2.0-SNAPSHOT: checking for updates from apache.ws
[WARNING] repository metadata for: 'snapshot org.apache.tuscany.sca:tuscany-xsd:2.0-SNAPSHOT' could not be retrieved from repository: apache.ws due to an error: Error transferring file
[INFO] Repository 'apache.ws' will be blacklisted
[INFO] snapshot org.apache.tuscany.sca:tuscany-interface-wsdl:2.0-SNAPSHOT: checking for updates from apache.snapshots
[INFO] snapshot org.apache.tuscany.sca:tuscany-binding-ws:2.0-SNAPSHOT: checking for updates from apache.snapshots
[INFO] snapshot org.apache.tuscany.sca:tuscany-binding-ws-wsdlgen:2.0-SNAPSHOT: checking for updates from apache.snapshots
[INFO] snapshot org.apache.tuscany.sca:tuscany-databinding-jaxb-axiom:2.0-SNAPSHOT: checking for updates from apache.snapshots
[INFO] snapshot org.apache.tuscany.sca:tuscany-host-http:2.0-SNAPSHOT: checking for updates from apache.snapshots
[INFO] snapshot org.apache.tuscany.sca:tuscany-policy-security:2.0-SNAPSHOT: checking for updates from apache.snapshots
[INFO] snapshot org.apache.tuscany.sca:tuscany-policy-xml-ws:2.0-SNAPSHOT: checking for updates from apache.snapshots
[INFO] [antrun:run {execution: copy-files-from-svn}]
[INFO] Executing tasks
copyResourceDir:
copySourceDir:
[sync] Removed 1 dangling directory from <http://hudson.zones.apache.org/hudson/job/Tuscany-SCA-J-CAA/ws/scajcaa/tuscany-java-caa-test-runner/src/test/java>
[sync] Removed 8 dangling files from <http://hudson.zones.apache.org/hudson/job/Tuscany-SCA-J-CAA/ws/scajcaa/tuscany-java-caa-test-runner/src/test/java>
copySourceDir:
[sync] Copying 8 files to <http://hudson.zones.apache.org/hudson/job/Tuscany-SCA-J-CAA/ws/scajcaa/tuscany-java-caa-test-runner/src/test/java/testClient>
[sync] Copying <http://hudson.zones.apache.org/hudson/job/Tuscany-SCA-J-CAA/ws/scajcaa/sca-assembly/Test_Client/src/main/java/testClient/InvokeTest.java> to <http://hudson.zones.apache.org/hudson/job/Tuscany-SCA-J-CAA/ws/scajcaa/tuscany-java-caa-test-runner/src/test/java/testClient/InvokeTest.java>
[sync] Copying <http://hudson.zones.apache.org/hudson/job/Tuscany-SCA-J-CAA/ws/scajcaa/sca-assembly/Test_Client/src/main/java/testClient/TestInvocationService.java> to <http://hudson.zones.apache.org/hudson/job/Tuscany-SCA-J-CAA/ws/scajcaa/tuscany-java-caa-test-runner/src/test/java/testClient/TestInvocationService.java>
[sync] Copying <http://hudson.zones.apache.org/hudson/job/Tuscany-SCA-J-CAA/ws/scajcaa/sca-assembly/Test_Client/src/main/java/testClient/InvokeTestResponse.java> to <http://hudson.zones.apache.org/hudson/job/Tuscany-SCA-J-CAA/ws/scajcaa/tuscany-java-caa-test-runner/src/test/java/testClient/InvokeTestResponse.java>
[sync] Copying <http://hudson.zones.apache.org/hudson/job/Tuscany-SCA-J-CAA/ws/scajcaa/sca-assembly/Test_Client/src/main/java/testClient/package-info.java> to <http://hudson.zones.apache.org/hudson/job/Tuscany-SCA-J-CAA/ws/scajcaa/tuscany-java-caa-test-runner/src/test/java/testClient/package-info.java>
[sync] Copying <http://hudson.zones.apache.org/hudson/job/Tuscany-SCA-J-CAA/ws/scajcaa/sca-assembly/Test_Client/src/main/java/testClient/TestException.java> to <http://hudson.zones.apache.org/hudson/job/Tuscany-SCA-J-CAA/ws/scajcaa/tuscany-java-caa-test-runner/src/test/java/testClient/TestException.java>
[sync] Copying <http://hudson.zones.apache.org/hudson/job/Tuscany-SCA-J-CAA/ws/scajcaa/sca-assembly/Test_Client/src/main/java/testClient/ObjectFactory.java> to <http://hudson.zones.apache.org/hudson/job/Tuscany-SCA-J-CAA/ws/scajcaa/tuscany-java-caa-test-runner/src/test/java/testClient/ObjectFactory.java>
[sync] Copying <http://hudson.zones.apache.org/hudson/job/Tuscany-SCA-J-CAA/ws/scajcaa/sca-assembly/Test_Client/src/main/java/testClient/TestInvocation.java> to <http://hudson.zones.apache.org/hudson/job/Tuscany-SCA-J-CAA/ws/scajcaa/tuscany-java-caa-test-runner/src/test/java/testClient/TestInvocation.java>
[sync] Copying <http://hudson.zones.apache.org/hudson/job/Tuscany-SCA-J-CAA/ws/scajcaa/sca-assembly/Test_Client/src/main/java/testClient/TestException_Exception.java> to <http://hudson.zones.apache.org/hudson/job/Tuscany-SCA-J-CAA/ws/scajcaa/tuscany-java-caa-test-runner/src/test/java/testClient/TestException_Exception.java>
copyFile:
[HUDSON] Archiving <http://hudson.zones.apache.org/hudson/job/Tuscany-SCA-J-CAA/ws/scajcaa/tuscany-java-caa-test-runner/pom.xml> to /export/home/hudson/hudson/jobs/Tuscany-SCA-J-CAA/modules/org.apache.tuscany.sca$tuscany-otests-sca-j-caa-tests/builds/2009-11-24_00-46-20/archive/org.apache.tuscany.sca/tuscany-otests-sca-j-caa-tests/2.0-SNAPSHOT/pom.xml
[INFO] ------------------------------------------------------------------------
[ERROR] BUILD ERROR
[INFO] ------------------------------------------------------------------------
[INFO] An Ant BuildException has occured: The following error occurred while executing this line:
<http://hudson.zones.apache.org/hudson/job/Tuscany-SCA-J-CAA/ws/scajcaa/build.xml>:53: Warning: Could not find file <http://hudson.zones.apache.org/hudson/job/Tuscany-SCA-J-CAA/ws/scajcaa/sca-assembly/Test_Client/src/main/java/client/BaseJAXWSTestCase.java> to copy.
[INFO] ------------------------------------------------------------------------
[INFO] For more information, run Maven with the -e switch
[INFO] ------------------------------------------------------------------------
[INFO] Total time: 26 minutes 46 seconds
[INFO] Finished at: Tue Nov 24 01:13:15 UTC 2009
[INFO] Final Memory: 141M/742M
[INFO] ------------------------------------------------------------------------
Waiting for Hudson to finish collecting data
Sending e-mails to: commits@tuscany.apache.org
channel stopped
Build failed in Hudson: Tuscany-SCA-J-CAA #38
Posted by Apache Hudson Server <hu...@hudson.zones.apache.org>.
See <http://hudson.zones.apache.org/hudson/job/Tuscany-SCA-J-CAA/38/>
------------------------------------------
[...truncated 5557 lines...]
[INFO] Building jar: <http://hudson.zones.apache.org/hudson/job/Tuscany-SCA-J-CAA/ws/scajcaa/sca-java-caa/JCA_10052/target/JCA_10052.jar>
[INFO] [assembly:single {execution: make-assembly}]
[INFO] Reading assembly descriptor: ../tozip.xml
[INFO] Building zip: <http://hudson.zones.apache.org/hudson/job/Tuscany-SCA-J-CAA/ws/scajcaa/sca-java-caa/JCA_10052/target/JCA_10052.zip>
[WARNING] Configuration options: 'appendAssemblyId' is set to false, and 'classifier' is missing.
Instead of attaching the assembly file: <http://hudson.zones.apache.org/hudson/job/Tuscany-SCA-J-CAA/ws/scajcaa/sca-java-caa/JCA_10052/target/JCA_10052.zip,> it will become the file for main project artifact.
NOTE: If multiple descriptors or descriptor-formats are provided for this project, the value of this file will be non-deterministic!
[WARNING] Replacing pre-existing project main-artifact file: <http://hudson.zones.apache.org/hudson/job/Tuscany-SCA-J-CAA/ws/scajcaa/sca-java-caa/JCA_10052/target/JCA_10052.jar>
with assembly file: <http://hudson.zones.apache.org/hudson/job/Tuscany-SCA-J-CAA/ws/scajcaa/sca-java-caa/JCA_10052/target/JCA_10052.zip>
[INFO] [install:install]
[INFO] Installing <http://hudson.zones.apache.org/hudson/job/Tuscany-SCA-J-CAA/ws/scajcaa/sca-java-caa/JCA_10052/target/JCA_10052.zip> to /export/home/hudson/.m2/repository/org/oasis-open/sca/j/JCA_10052/1.0/JCA_10052-1.0.jar
[HUDSON] Archiving <http://hudson.zones.apache.org/hudson/job/Tuscany-SCA-J-CAA/ws/scajcaa/sca-java-caa/JCA_10052/pom.xml> to /export/home/hudson/hudson/jobs/Tuscany-SCA-J-CAA/modules/org.oasis-open.sca.j$JCA_10052/builds/2009-11-23_01-02-57/archive/org.oasis-open.sca.j/JCA_10052/1.0/pom.xml
[HUDSON] Archiving <http://hudson.zones.apache.org/hudson/job/Tuscany-SCA-J-CAA/ws/scajcaa/sca-java-caa/JCA_10052/target/JCA_10052.zip> to /export/home/hudson/hudson/jobs/Tuscany-SCA-J-CAA/modules/org.oasis-open.sca.j$JCA_10052/builds/2009-11-23_01-02-57/archive/org.oasis-open.sca.j/JCA_10052/1.0/JCA_10052.zip
[INFO] ------------------------------------------------------------------------
[INFO] Building OASIS Java CAA TestCases - Contribution JCA_11005
[INFO] task-segment: [clean, install]
[INFO] ------------------------------------------------------------------------
[INFO] [clean:clean]
[INFO] Deleting directory <http://hudson.zones.apache.org/hudson/job/Tuscany-SCA-J-CAA/ws/scajcaa/sca-java-caa/JCA_11005/target>
[INFO] [resources:resources]
[INFO] Using default encoding to copy filtered resources.
[INFO] [compiler:compile]
[INFO] Compiling 2 source files to <http://hudson.zones.apache.org/hudson/job/Tuscany-SCA-J-CAA/ws/scajcaa/sca-java-caa/JCA_11005/target/classes>
[INFO] [resources:testResources]
[INFO] Using default encoding to copy filtered resources.
[INFO] [compiler:testCompile]
[INFO] No sources to compile
[INFO] [surefire:test]
[INFO] No tests to run.
[HUDSON] Recording test results
[INFO] [jar:jar]
[INFO] Building jar: <http://hudson.zones.apache.org/hudson/job/Tuscany-SCA-J-CAA/ws/scajcaa/sca-java-caa/JCA_11005/target/JCA_11005.jar>
[INFO] [assembly:single {execution: make-assembly}]
[INFO] Reading assembly descriptor: ../tozip.xml
[INFO] Building zip: <http://hudson.zones.apache.org/hudson/job/Tuscany-SCA-J-CAA/ws/scajcaa/sca-java-caa/JCA_11005/target/JCA_11005.zip>
[WARNING] Configuration options: 'appendAssemblyId' is set to false, and 'classifier' is missing.
Instead of attaching the assembly file: <http://hudson.zones.apache.org/hudson/job/Tuscany-SCA-J-CAA/ws/scajcaa/sca-java-caa/JCA_11005/target/JCA_11005.zip,> it will become the file for main project artifact.
NOTE: If multiple descriptors or descriptor-formats are provided for this project, the value of this file will be non-deterministic!
[WARNING] Replacing pre-existing project main-artifact file: <http://hudson.zones.apache.org/hudson/job/Tuscany-SCA-J-CAA/ws/scajcaa/sca-java-caa/JCA_11005/target/JCA_11005.jar>
with assembly file: <http://hudson.zones.apache.org/hudson/job/Tuscany-SCA-J-CAA/ws/scajcaa/sca-java-caa/JCA_11005/target/JCA_11005.zip>
[INFO] [install:install]
[INFO] Installing <http://hudson.zones.apache.org/hudson/job/Tuscany-SCA-J-CAA/ws/scajcaa/sca-java-caa/JCA_11005/target/JCA_11005.zip> to /export/home/hudson/.m2/repository/org/oasis-open/sca/j/JCA_11005/1.0/JCA_11005-1.0.jar
[HUDSON] Archiving <http://hudson.zones.apache.org/hudson/job/Tuscany-SCA-J-CAA/ws/scajcaa/sca-java-caa/JCA_11005/pom.xml> to /export/home/hudson/hudson/jobs/Tuscany-SCA-J-CAA/modules/org.oasis-open.sca.j$JCA_11005/builds/2009-11-23_01-02-57/archive/org.oasis-open.sca.j/JCA_11005/1.0/pom.xml
[HUDSON] Archiving <http://hudson.zones.apache.org/hudson/job/Tuscany-SCA-J-CAA/ws/scajcaa/sca-java-caa/JCA_11005/target/JCA_11005.zip> to /export/home/hudson/hudson/jobs/Tuscany-SCA-J-CAA/modules/org.oasis-open.sca.j$JCA_11005/builds/2009-11-23_01-02-57/archive/org.oasis-open.sca.j/JCA_11005/1.0/JCA_11005.zip
[INFO] ------------------------------------------------------------------------
[INFO] Building OASIS Java CAA TestCases - Contribution JCA_11006
[INFO] task-segment: [clean, install]
[INFO] ------------------------------------------------------------------------
[INFO] [clean:clean]
[INFO] Deleting directory <http://hudson.zones.apache.org/hudson/job/Tuscany-SCA-J-CAA/ws/scajcaa/sca-java-caa/JCA_11006/target>
[INFO] [resources:resources]
[INFO] Using default encoding to copy filtered resources.
[INFO] [compiler:compile]
[INFO] Compiling 1 source file to <http://hudson.zones.apache.org/hudson/job/Tuscany-SCA-J-CAA/ws/scajcaa/sca-java-caa/JCA_11006/target/classes>
[INFO] [resources:testResources]
[INFO] Using default encoding to copy filtered resources.
[INFO] [compiler:testCompile]
[INFO] No sources to compile
[INFO] [surefire:test]
[INFO] No tests to run.
[HUDSON] Recording test results
[INFO] [jar:jar]
[INFO] Building jar: <http://hudson.zones.apache.org/hudson/job/Tuscany-SCA-J-CAA/ws/scajcaa/sca-java-caa/JCA_11006/target/JCA_11006.jar>
[INFO] [assembly:single {execution: make-assembly}]
[INFO] Reading assembly descriptor: ../tozip.xml
[INFO] Building zip: <http://hudson.zones.apache.org/hudson/job/Tuscany-SCA-J-CAA/ws/scajcaa/sca-java-caa/JCA_11006/target/JCA_11006.zip>
[WARNING] Configuration options: 'appendAssemblyId' is set to false, and 'classifier' is missing.
Instead of attaching the assembly file: <http://hudson.zones.apache.org/hudson/job/Tuscany-SCA-J-CAA/ws/scajcaa/sca-java-caa/JCA_11006/target/JCA_11006.zip,> it will become the file for main project artifact.
NOTE: If multiple descriptors or descriptor-formats are provided for this project, the value of this file will be non-deterministic!
[WARNING] Replacing pre-existing project main-artifact file: <http://hudson.zones.apache.org/hudson/job/Tuscany-SCA-J-CAA/ws/scajcaa/sca-java-caa/JCA_11006/target/JCA_11006.jar>
with assembly file: <http://hudson.zones.apache.org/hudson/job/Tuscany-SCA-J-CAA/ws/scajcaa/sca-java-caa/JCA_11006/target/JCA_11006.zip>
[INFO] [install:install]
[INFO] Installing <http://hudson.zones.apache.org/hudson/job/Tuscany-SCA-J-CAA/ws/scajcaa/sca-java-caa/JCA_11006/target/JCA_11006.zip> to /export/home/hudson/.m2/repository/org/oasis-open/sca/j/JCA_11006/1.0/JCA_11006-1.0.jar
[HUDSON] Archiving <http://hudson.zones.apache.org/hudson/job/Tuscany-SCA-J-CAA/ws/scajcaa/sca-java-caa/JCA_11006/pom.xml> to /export/home/hudson/hudson/jobs/Tuscany-SCA-J-CAA/modules/org.oasis-open.sca.j$JCA_11006/builds/2009-11-23_01-02-57/archive/org.oasis-open.sca.j/JCA_11006/1.0/pom.xml
[HUDSON] Archiving <http://hudson.zones.apache.org/hudson/job/Tuscany-SCA-J-CAA/ws/scajcaa/sca-java-caa/JCA_11006/target/JCA_11006.zip> to /export/home/hudson/hudson/jobs/Tuscany-SCA-J-CAA/modules/org.oasis-open.sca.j$JCA_11006/builds/2009-11-23_01-02-57/archive/org.oasis-open.sca.j/JCA_11006/1.0/JCA_11006.zip
[INFO] ------------------------------------------------------------------------
[INFO] Building OASIS Java CAA TestCases - Contribution JCA_11007
[INFO] task-segment: [clean, install]
[INFO] ------------------------------------------------------------------------
[INFO] [clean:clean]
[INFO] Deleting directory <http://hudson.zones.apache.org/hudson/job/Tuscany-SCA-J-CAA/ws/scajcaa/sca-java-caa/JCA_11007/target>
[INFO] [resources:resources]
[INFO] Using default encoding to copy filtered resources.
[INFO] [compiler:compile]
[INFO] Compiling 1 source file to <http://hudson.zones.apache.org/hudson/job/Tuscany-SCA-J-CAA/ws/scajcaa/sca-java-caa/JCA_11007/target/classes>
[INFO] [resources:testResources]
[INFO] Using default encoding to copy filtered resources.
[INFO] [compiler:testCompile]
[INFO] No sources to compile
[INFO] [surefire:test]
[INFO] No tests to run.
[HUDSON] Recording test results
[INFO] [jar:jar]
[INFO] Building jar: <http://hudson.zones.apache.org/hudson/job/Tuscany-SCA-J-CAA/ws/scajcaa/sca-java-caa/JCA_11007/target/JCA_11007.jar>
[INFO] [assembly:single {execution: make-assembly}]
[INFO] Reading assembly descriptor: ../tozip.xml
[INFO] Building zip: <http://hudson.zones.apache.org/hudson/job/Tuscany-SCA-J-CAA/ws/scajcaa/sca-java-caa/JCA_11007/target/JCA_11007.zip>
[WARNING] Configuration options: 'appendAssemblyId' is set to false, and 'classifier' is missing.
Instead of attaching the assembly file: <http://hudson.zones.apache.org/hudson/job/Tuscany-SCA-J-CAA/ws/scajcaa/sca-java-caa/JCA_11007/target/JCA_11007.zip,> it will become the file for main project artifact.
NOTE: If multiple descriptors or descriptor-formats are provided for this project, the value of this file will be non-deterministic!
[WARNING] Replacing pre-existing project main-artifact file: <http://hudson.zones.apache.org/hudson/job/Tuscany-SCA-J-CAA/ws/scajcaa/sca-java-caa/JCA_11007/target/JCA_11007.jar>
with assembly file: <http://hudson.zones.apache.org/hudson/job/Tuscany-SCA-J-CAA/ws/scajcaa/sca-java-caa/JCA_11007/target/JCA_11007.zip>
[INFO] [install:install]
[INFO] Installing <http://hudson.zones.apache.org/hudson/job/Tuscany-SCA-J-CAA/ws/scajcaa/sca-java-caa/JCA_11007/target/JCA_11007.zip> to /export/home/hudson/.m2/repository/org/oasis-open/sca/j/JCA_11007/1.0/JCA_11007-1.0.jar
[HUDSON] Archiving <http://hudson.zones.apache.org/hudson/job/Tuscany-SCA-J-CAA/ws/scajcaa/sca-java-caa/JCA_11007/pom.xml> to /export/home/hudson/hudson/jobs/Tuscany-SCA-J-CAA/modules/org.oasis-open.sca.j$JCA_11007/builds/2009-11-23_01-02-57/archive/org.oasis-open.sca.j/JCA_11007/1.0/pom.xml
[HUDSON] Archiving <http://hudson.zones.apache.org/hudson/job/Tuscany-SCA-J-CAA/ws/scajcaa/sca-java-caa/JCA_11007/target/JCA_11007.zip> to /export/home/hudson/hudson/jobs/Tuscany-SCA-J-CAA/modules/org.oasis-open.sca.j$JCA_11007/builds/2009-11-23_01-02-57/archive/org.oasis-open.sca.j/JCA_11007/1.0/JCA_11007.zip
[INFO] ------------------------------------------------------------------------
[INFO] Building OASIS Java CAA TestCases - Contribution JCA_11008
[INFO] task-segment: [clean, install]
[INFO] ------------------------------------------------------------------------
[INFO] [clean:clean]
[INFO] Deleting directory <http://hudson.zones.apache.org/hudson/job/Tuscany-SCA-J-CAA/ws/scajcaa/sca-java-caa/JCA_11008/target>
[INFO] [resources:resources]
[INFO] Using default encoding to copy filtered resources.
[INFO] [compiler:compile]
[INFO] Compiling 1 source file to <http://hudson.zones.apache.org/hudson/job/Tuscany-SCA-J-CAA/ws/scajcaa/sca-java-caa/JCA_11008/target/classes>
[INFO] [resources:testResources]
[INFO] Using default encoding to copy filtered resources.
[INFO] [compiler:testCompile]
[INFO] No sources to compile
[INFO] [surefire:test]
[INFO] No tests to run.
[HUDSON] Recording test results
[INFO] [jar:jar]
[INFO] Building jar: <http://hudson.zones.apache.org/hudson/job/Tuscany-SCA-J-CAA/ws/scajcaa/sca-java-caa/JCA_11008/target/JCA_11008.jar>
[INFO] [assembly:single {execution: make-assembly}]
[INFO] Reading assembly descriptor: ../tozip.xml
[INFO] Building zip: <http://hudson.zones.apache.org/hudson/job/Tuscany-SCA-J-CAA/ws/scajcaa/sca-java-caa/JCA_11008/target/JCA_11008.zip>
[WARNING] Configuration options: 'appendAssemblyId' is set to false, and 'classifier' is missing.
Instead of attaching the assembly file: <http://hudson.zones.apache.org/hudson/job/Tuscany-SCA-J-CAA/ws/scajcaa/sca-java-caa/JCA_11008/target/JCA_11008.zip,> it will become the file for main project artifact.
NOTE: If multiple descriptors or descriptor-formats are provided for this project, the value of this file will be non-deterministic!
[WARNING] Replacing pre-existing project main-artifact file: <http://hudson.zones.apache.org/hudson/job/Tuscany-SCA-J-CAA/ws/scajcaa/sca-java-caa/JCA_11008/target/JCA_11008.jar>
with assembly file: <http://hudson.zones.apache.org/hudson/job/Tuscany-SCA-J-CAA/ws/scajcaa/sca-java-caa/JCA_11008/target/JCA_11008.zip>
[INFO] [install:install]
[INFO] Installing <http://hudson.zones.apache.org/hudson/job/Tuscany-SCA-J-CAA/ws/scajcaa/sca-java-caa/JCA_11008/target/JCA_11008.zip> to /export/home/hudson/.m2/repository/org/oasis-open/sca/j/JCA_11008/1.0/JCA_11008-1.0.jar
[HUDSON] Archiving <http://hudson.zones.apache.org/hudson/job/Tuscany-SCA-J-CAA/ws/scajcaa/sca-java-caa/JCA_11008/pom.xml> to /export/home/hudson/hudson/jobs/Tuscany-SCA-J-CAA/modules/org.oasis-open.sca.j$JCA_11008/builds/2009-11-23_01-02-57/archive/org.oasis-open.sca.j/JCA_11008/1.0/pom.xml
[HUDSON] Archiving <http://hudson.zones.apache.org/hudson/job/Tuscany-SCA-J-CAA/ws/scajcaa/sca-java-caa/JCA_11008/target/JCA_11008.zip> to /export/home/hudson/hudson/jobs/Tuscany-SCA-J-CAA/modules/org.oasis-open.sca.j$JCA_11008/builds/2009-11-23_01-02-57/archive/org.oasis-open.sca.j/JCA_11008/1.0/JCA_11008.zip
[INFO] ------------------------------------------------------------------------
[INFO] Building OASIS Java CAA TestCases - Test Client
[INFO] task-segment: [clean, install]
[INFO] ------------------------------------------------------------------------
[INFO] [clean:clean]
[INFO] Deleting directory <http://hudson.zones.apache.org/hudson/job/Tuscany-SCA-J-CAA/ws/scajcaa/sca-java-caa/Test_Client_JavaCAA/target>
[INFO] [resources:resources]
[INFO] Using default encoding to copy filtered resources.
[INFO] [compiler:compile]
[INFO] Compiling 79 source files to <http://hudson.zones.apache.org/hudson/job/Tuscany-SCA-J-CAA/ws/scajcaa/sca-java-caa/Test_Client_JavaCAA/target/classes>
[INFO] [resources:testResources]
[INFO] Using default encoding to copy filtered resources.
[INFO] [compiler:testCompile]
[INFO] No sources to compile
[INFO] [surefire:test]
[INFO] No tests to run.
[HUDSON] Recording test results
[INFO] [jar:jar]
[INFO] Building jar: <http://hudson.zones.apache.org/hudson/job/Tuscany-SCA-J-CAA/ws/scajcaa/sca-java-caa/Test_Client_JavaCAA/target/Test_Client_JavaCAA.jar>
[INFO] [install:install]
[INFO] Installing <http://hudson.zones.apache.org/hudson/job/Tuscany-SCA-J-CAA/ws/scajcaa/sca-java-caa/Test_Client_JavaCAA/target/Test_Client_JavaCAA.jar> to /export/home/hudson/.m2/repository/org/oasis-open/sca/j/Test_Client_JavaCAA/1.0/Test_Client_JavaCAA-1.0.jar
[HUDSON] Archiving <http://hudson.zones.apache.org/hudson/job/Tuscany-SCA-J-CAA/ws/scajcaa/sca-java-caa/Test_Client_JavaCAA/pom.xml> to /export/home/hudson/hudson/jobs/Tuscany-SCA-J-CAA/modules/org.oasis-open.sca.j$Test_Client_JavaCAA/builds/2009-11-23_01-02-57/archive/org.oasis-open.sca.j/Test_Client_JavaCAA/1.0/pom.xml
[HUDSON] Archiving <http://hudson.zones.apache.org/hudson/job/Tuscany-SCA-J-CAA/ws/scajcaa/sca-java-caa/Test_Client_JavaCAA/target/Test_Client_JavaCAA.jar> to /export/home/hudson/hudson/jobs/Tuscany-SCA-J-CAA/modules/org.oasis-open.sca.j$Test_Client_JavaCAA/builds/2009-11-23_01-02-57/archive/org.oasis-open.sca.j/Test_Client_JavaCAA/1.0/Test_Client_JavaCAA.jar
[INFO] ------------------------------------------------------------------------
[INFO] Building Apache Tuscany SCA Specification Tests for SCA-J CAA
[INFO] task-segment: [clean, install]
[INFO] ------------------------------------------------------------------------
[INFO] [clean:clean]
[INFO] [build-helper:add-test-source {execution: add-test-source}]
[INFO] Test Source directory: <http://hudson.zones.apache.org/hudson/job/Tuscany-SCA-J-CAA/ws/scajcaa/tuscany-java-caa-test-runner/src/test/tjava> added.
[INFO] snapshot org.apache.tuscany.sca:tuscany-binding-ws-axis2:2.0-SNAPSHOT: checking for updates from apache.snapshots
[INFO] snapshot org.apache.tuscany.sca:tuscany-databinding-axiom:2.0-SNAPSHOT: checking for updates from apache.snapshots
[INFO] snapshot org.apache.tuscany.sca:tuscany-binding-ws-axis2-policy:2.0-SNAPSHOT: checking for updates from apache.snapshots
Downloading: http://repo2.maven.org/maven2/org/apache/santuario/xmlsec/1.4.0/xmlsec-1.4.0.pom
Downloading: http://people.apache.org/repo/m2-incubating-repository/org/apache/santuario/xmlsec/1.4.0/xmlsec-1.4.0.pom
Downloading: http://svn.apache.org/repos/asf/tuscany/maven/org/apache/santuario/xmlsec/1.4.0/xmlsec-1.4.0.pom
Downloading: http://ws.zones.apache.org/repository2/org/apache/santuario/xmlsec/1.4.0/xmlsec-1.4.0.pom
Downloading: http://ftp.ussg.iu.edu/eclipse/modeling/emf/emf/maven2//org/apache/santuario/xmlsec/1.4.0/xmlsec-1.4.0.pom
Downloading: http://ftp.osuosl.org/pub/eclipse/tools/emf/maven2/org/apache/santuario/xmlsec/1.4.0/xmlsec-1.4.0.pom
Downloading: http://www.intalio.org/public/maven2/org/apache/santuario/xmlsec/1.4.0/xmlsec-1.4.0.pom
Downloading: http://download.java.net/maven/1/org.apache.santuario/poms/xmlsec-1.4.0.pom
Downloading: http://download.java.net/maven/2/org/apache/santuario/xmlsec/1.4.0/xmlsec-1.4.0.pom
Downloading: http://repo1.maven.org/maven2/org/apache/santuario/xmlsec/1.4.0/xmlsec-1.4.0.pom
Downloading: http://repo2.maven.org/maven2/opensaml/opensaml/1.1/opensaml-1.1.pom
Downloading: http://people.apache.org/repo/m2-incubating-repository/opensaml/opensaml/1.1/opensaml-1.1.pom
Downloading: http://svn.apache.org/repos/asf/tuscany/maven/opensaml/opensaml/1.1/opensaml-1.1.pom
Downloading: http://ws.zones.apache.org/repository2/opensaml/opensaml/1.1/opensaml-1.1.pom
Downloading: http://ftp.ussg.iu.edu/eclipse/modeling/emf/emf/maven2//opensaml/opensaml/1.1/opensaml-1.1.pom
Downloading: http://ftp.osuosl.org/pub/eclipse/tools/emf/maven2/opensaml/opensaml/1.1/opensaml-1.1.pom
Downloading: http://www.intalio.org/public/maven2/opensaml/opensaml/1.1/opensaml-1.1.pom
Downloading: http://download.java.net/maven/1/opensaml/poms/opensaml-1.1.pom
Downloading: http://download.java.net/maven/2/opensaml/opensaml/1.1/opensaml-1.1.pom
Downloading: http://repo1.maven.org/maven2/opensaml/opensaml/1.1/opensaml-1.1.pom
Downloading: http://repo2.maven.org/maven2/org/apache/santuario/xmlsec/1.4.1/xmlsec-1.4.1.pom
Downloading: http://people.apache.org/repo/m2-incubating-repository/org/apache/santuario/xmlsec/1.4.1/xmlsec-1.4.1.pom
Downloading: http://svn.apache.org/repos/asf/tuscany/maven/org/apache/santuario/xmlsec/1.4.1/xmlsec-1.4.1.pom
Downloading: http://ws.zones.apache.org/repository2/org/apache/santuario/xmlsec/1.4.1/xmlsec-1.4.1.pom
Downloading: http://ftp.ussg.iu.edu/eclipse/modeling/emf/emf/maven2//org/apache/santuario/xmlsec/1.4.1/xmlsec-1.4.1.pom
Downloading: http://ftp.osuosl.org/pub/eclipse/tools/emf/maven2/org/apache/santuario/xmlsec/1.4.1/xmlsec-1.4.1.pom
Downloading: http://www.intalio.org/public/maven2/org/apache/santuario/xmlsec/1.4.1/xmlsec-1.4.1.pom
Downloading: http://download.java.net/maven/1/org.apache.santuario/poms/xmlsec-1.4.1.pom
Downloading: http://download.java.net/maven/2/org/apache/santuario/xmlsec/1.4.1/xmlsec-1.4.1.pom
Downloading: http://repo1.maven.org/maven2/org/apache/santuario/xmlsec/1.4.1/xmlsec-1.4.1.pom
[INFO] snapshot org.apache.tuscany.sca:tuscany-xsd:2.0-SNAPSHOT: checking for updates from apache.snapshots
[INFO] snapshot org.apache.tuscany.sca:tuscany-xsd:2.0-SNAPSHOT: checking for updates from apache.ws
[WARNING] repository metadata for: 'snapshot org.apache.tuscany.sca:tuscany-xsd:2.0-SNAPSHOT' could not be retrieved from repository: apache.ws due to an error: Error transferring file
[INFO] Repository 'apache.ws' will be blacklisted
[INFO] snapshot org.apache.tuscany.sca:tuscany-interface-wsdl:2.0-SNAPSHOT: checking for updates from apache.snapshots
[INFO] snapshot org.apache.tuscany.sca:tuscany-binding-ws:2.0-SNAPSHOT: checking for updates from apache.snapshots
[INFO] snapshot org.apache.tuscany.sca:tuscany-binding-ws-wsdlgen:2.0-SNAPSHOT: checking for updates from apache.snapshots
[INFO] snapshot org.apache.tuscany.sca:tuscany-databinding-jaxb-axiom:2.0-SNAPSHOT: checking for updates from apache.snapshots
[INFO] snapshot org.apache.tuscany.sca:tuscany-host-http:2.0-SNAPSHOT: checking for updates from apache.snapshots
[INFO] snapshot org.apache.tuscany.sca:tuscany-policy-security:2.0-SNAPSHOT: checking for updates from apache.snapshots
[INFO] snapshot org.apache.tuscany.sca:tuscany-policy-xml-ws:2.0-SNAPSHOT: checking for updates from apache.snapshots
[INFO] [antrun:run {execution: copy-files-from-svn}]
[INFO] Executing tasks
copyResourceDir:
copySourceDir:
[sync] Removed 1 dangling directory from <http://hudson.zones.apache.org/hudson/job/Tuscany-SCA-J-CAA/ws/scajcaa/tuscany-java-caa-test-runner/src/test/java>
[sync] Removed 8 dangling files from <http://hudson.zones.apache.org/hudson/job/Tuscany-SCA-J-CAA/ws/scajcaa/tuscany-java-caa-test-runner/src/test/java>
copySourceDir:
[sync] Copying 8 files to <http://hudson.zones.apache.org/hudson/job/Tuscany-SCA-J-CAA/ws/scajcaa/tuscany-java-caa-test-runner/src/test/java/testClient>
[sync] Copying <http://hudson.zones.apache.org/hudson/job/Tuscany-SCA-J-CAA/ws/scajcaa/sca-assembly/Test_Client/src/main/java/testClient/InvokeTest.java> to <http://hudson.zones.apache.org/hudson/job/Tuscany-SCA-J-CAA/ws/scajcaa/tuscany-java-caa-test-runner/src/test/java/testClient/InvokeTest.java>
[sync] Copying <http://hudson.zones.apache.org/hudson/job/Tuscany-SCA-J-CAA/ws/scajcaa/sca-assembly/Test_Client/src/main/java/testClient/TestInvocationService.java> to <http://hudson.zones.apache.org/hudson/job/Tuscany-SCA-J-CAA/ws/scajcaa/tuscany-java-caa-test-runner/src/test/java/testClient/TestInvocationService.java>
[sync] Copying <http://hudson.zones.apache.org/hudson/job/Tuscany-SCA-J-CAA/ws/scajcaa/sca-assembly/Test_Client/src/main/java/testClient/InvokeTestResponse.java> to <http://hudson.zones.apache.org/hudson/job/Tuscany-SCA-J-CAA/ws/scajcaa/tuscany-java-caa-test-runner/src/test/java/testClient/InvokeTestResponse.java>
[sync] Copying <http://hudson.zones.apache.org/hudson/job/Tuscany-SCA-J-CAA/ws/scajcaa/sca-assembly/Test_Client/src/main/java/testClient/package-info.java> to <http://hudson.zones.apache.org/hudson/job/Tuscany-SCA-J-CAA/ws/scajcaa/tuscany-java-caa-test-runner/src/test/java/testClient/package-info.java>
[sync] Copying <http://hudson.zones.apache.org/hudson/job/Tuscany-SCA-J-CAA/ws/scajcaa/sca-assembly/Test_Client/src/main/java/testClient/TestException.java> to <http://hudson.zones.apache.org/hudson/job/Tuscany-SCA-J-CAA/ws/scajcaa/tuscany-java-caa-test-runner/src/test/java/testClient/TestException.java>
[sync] Copying <http://hudson.zones.apache.org/hudson/job/Tuscany-SCA-J-CAA/ws/scajcaa/sca-assembly/Test_Client/src/main/java/testClient/ObjectFactory.java> to <http://hudson.zones.apache.org/hudson/job/Tuscany-SCA-J-CAA/ws/scajcaa/tuscany-java-caa-test-runner/src/test/java/testClient/ObjectFactory.java>
[sync] Copying <http://hudson.zones.apache.org/hudson/job/Tuscany-SCA-J-CAA/ws/scajcaa/sca-assembly/Test_Client/src/main/java/testClient/TestInvocation.java> to <http://hudson.zones.apache.org/hudson/job/Tuscany-SCA-J-CAA/ws/scajcaa/tuscany-java-caa-test-runner/src/test/java/testClient/TestInvocation.java>
[sync] Copying <http://hudson.zones.apache.org/hudson/job/Tuscany-SCA-J-CAA/ws/scajcaa/sca-assembly/Test_Client/src/main/java/testClient/TestException_Exception.java> to <http://hudson.zones.apache.org/hudson/job/Tuscany-SCA-J-CAA/ws/scajcaa/tuscany-java-caa-test-runner/src/test/java/testClient/TestException_Exception.java>
copyFile:
[HUDSON] Archiving <http://hudson.zones.apache.org/hudson/job/Tuscany-SCA-J-CAA/ws/scajcaa/tuscany-java-caa-test-runner/pom.xml> to /export/home/hudson/hudson/jobs/Tuscany-SCA-J-CAA/modules/org.apache.tuscany.sca$tuscany-otests-sca-j-caa-tests/builds/2009-11-23_01-02-57/archive/org.apache.tuscany.sca/tuscany-otests-sca-j-caa-tests/2.0-SNAPSHOT/pom.xml
[INFO] ------------------------------------------------------------------------
[ERROR] BUILD ERROR
[INFO] ------------------------------------------------------------------------
[INFO] An Ant BuildException has occured: The following error occurred while executing this line:
<http://hudson.zones.apache.org/hudson/job/Tuscany-SCA-J-CAA/ws/scajcaa/build.xml>:53: Warning: Could not find file <http://hudson.zones.apache.org/hudson/job/Tuscany-SCA-J-CAA/ws/scajcaa/sca-assembly/Test_Client/src/main/java/client/BaseJAXWSTestCase.java> to copy.
[INFO] ------------------------------------------------------------------------
[INFO] For more information, run Maven with the -e switch
[INFO] ------------------------------------------------------------------------
[INFO] Total time: 27 minutes 21 seconds
[INFO] Finished at: Mon Nov 23 01:30:23 UTC 2009
[INFO] Final Memory: 140M/742M
[INFO] ------------------------------------------------------------------------
Waiting for Hudson to finish collecting data
Sending e-mails to: commits@tuscany.apache.org
channel stopped
Build failed in Hudson: Tuscany-SCA-J-CAA #37
Posted by Apache Hudson Server <hu...@hudson.zones.apache.org>.
See <http://hudson.zones.apache.org/hudson/job/Tuscany-SCA-J-CAA/37/>
------------------------------------------
[...truncated 5559 lines...]
[INFO] Building jar: <http://hudson.zones.apache.org/hudson/job/Tuscany-SCA-J-CAA/ws/scajcaa/sca-java-caa/JCA_10052/target/JCA_10052.jar>
[INFO] [assembly:single {execution: make-assembly}]
[INFO] Reading assembly descriptor: ../tozip.xml
[INFO] Building zip: <http://hudson.zones.apache.org/hudson/job/Tuscany-SCA-J-CAA/ws/scajcaa/sca-java-caa/JCA_10052/target/JCA_10052.zip>
[WARNING] Configuration options: 'appendAssemblyId' is set to false, and 'classifier' is missing.
Instead of attaching the assembly file: <http://hudson.zones.apache.org/hudson/job/Tuscany-SCA-J-CAA/ws/scajcaa/sca-java-caa/JCA_10052/target/JCA_10052.zip,> it will become the file for main project artifact.
NOTE: If multiple descriptors or descriptor-formats are provided for this project, the value of this file will be non-deterministic!
[WARNING] Replacing pre-existing project main-artifact file: <http://hudson.zones.apache.org/hudson/job/Tuscany-SCA-J-CAA/ws/scajcaa/sca-java-caa/JCA_10052/target/JCA_10052.jar>
with assembly file: <http://hudson.zones.apache.org/hudson/job/Tuscany-SCA-J-CAA/ws/scajcaa/sca-java-caa/JCA_10052/target/JCA_10052.zip>
[INFO] [install:install]
[INFO] Installing <http://hudson.zones.apache.org/hudson/job/Tuscany-SCA-J-CAA/ws/scajcaa/sca-java-caa/JCA_10052/target/JCA_10052.zip> to /export/home/hudson/.m2/repository/org/oasis-open/sca/j/JCA_10052/1.0/JCA_10052-1.0.jar
[HUDSON] Archiving <http://hudson.zones.apache.org/hudson/job/Tuscany-SCA-J-CAA/ws/scajcaa/sca-java-caa/JCA_10052/pom.xml> to /export/home/hudson/hudson/jobs/Tuscany-SCA-J-CAA/modules/org.oasis-open.sca.j$JCA_10052/builds/2009-11-22_00-50-37/archive/org.oasis-open.sca.j/JCA_10052/1.0/pom.xml
[HUDSON] Archiving <http://hudson.zones.apache.org/hudson/job/Tuscany-SCA-J-CAA/ws/scajcaa/sca-java-caa/JCA_10052/target/JCA_10052.zip> to /export/home/hudson/hudson/jobs/Tuscany-SCA-J-CAA/modules/org.oasis-open.sca.j$JCA_10052/builds/2009-11-22_00-50-37/archive/org.oasis-open.sca.j/JCA_10052/1.0/JCA_10052.zip
[INFO] ------------------------------------------------------------------------
[INFO] Building OASIS Java CAA TestCases - Contribution JCA_11005
[INFO] task-segment: [clean, install]
[INFO] ------------------------------------------------------------------------
[INFO] [clean:clean]
[INFO] Deleting directory <http://hudson.zones.apache.org/hudson/job/Tuscany-SCA-J-CAA/ws/scajcaa/sca-java-caa/JCA_11005/target>
[INFO] [resources:resources]
[INFO] Using default encoding to copy filtered resources.
[INFO] [compiler:compile]
[INFO] Compiling 2 source files to <http://hudson.zones.apache.org/hudson/job/Tuscany-SCA-J-CAA/ws/scajcaa/sca-java-caa/JCA_11005/target/classes>
[INFO] [resources:testResources]
[INFO] Using default encoding to copy filtered resources.
[INFO] [compiler:testCompile]
[INFO] No sources to compile
[INFO] [surefire:test]
[INFO] No tests to run.
[HUDSON] Recording test results
[INFO] [jar:jar]
[INFO] Building jar: <http://hudson.zones.apache.org/hudson/job/Tuscany-SCA-J-CAA/ws/scajcaa/sca-java-caa/JCA_11005/target/JCA_11005.jar>
[INFO] [assembly:single {execution: make-assembly}]
[INFO] Reading assembly descriptor: ../tozip.xml
[INFO] Building zip: <http://hudson.zones.apache.org/hudson/job/Tuscany-SCA-J-CAA/ws/scajcaa/sca-java-caa/JCA_11005/target/JCA_11005.zip>
[WARNING] Configuration options: 'appendAssemblyId' is set to false, and 'classifier' is missing.
Instead of attaching the assembly file: <http://hudson.zones.apache.org/hudson/job/Tuscany-SCA-J-CAA/ws/scajcaa/sca-java-caa/JCA_11005/target/JCA_11005.zip,> it will become the file for main project artifact.
NOTE: If multiple descriptors or descriptor-formats are provided for this project, the value of this file will be non-deterministic!
[WARNING] Replacing pre-existing project main-artifact file: <http://hudson.zones.apache.org/hudson/job/Tuscany-SCA-J-CAA/ws/scajcaa/sca-java-caa/JCA_11005/target/JCA_11005.jar>
with assembly file: <http://hudson.zones.apache.org/hudson/job/Tuscany-SCA-J-CAA/ws/scajcaa/sca-java-caa/JCA_11005/target/JCA_11005.zip>
[INFO] [install:install]
[INFO] Installing <http://hudson.zones.apache.org/hudson/job/Tuscany-SCA-J-CAA/ws/scajcaa/sca-java-caa/JCA_11005/target/JCA_11005.zip> to /export/home/hudson/.m2/repository/org/oasis-open/sca/j/JCA_11005/1.0/JCA_11005-1.0.jar
[HUDSON] Archiving <http://hudson.zones.apache.org/hudson/job/Tuscany-SCA-J-CAA/ws/scajcaa/sca-java-caa/JCA_11005/pom.xml> to /export/home/hudson/hudson/jobs/Tuscany-SCA-J-CAA/modules/org.oasis-open.sca.j$JCA_11005/builds/2009-11-22_00-50-37/archive/org.oasis-open.sca.j/JCA_11005/1.0/pom.xml
[HUDSON] Archiving <http://hudson.zones.apache.org/hudson/job/Tuscany-SCA-J-CAA/ws/scajcaa/sca-java-caa/JCA_11005/target/JCA_11005.zip> to /export/home/hudson/hudson/jobs/Tuscany-SCA-J-CAA/modules/org.oasis-open.sca.j$JCA_11005/builds/2009-11-22_00-50-37/archive/org.oasis-open.sca.j/JCA_11005/1.0/JCA_11005.zip
[INFO] ------------------------------------------------------------------------
[INFO] Building OASIS Java CAA TestCases - Contribution JCA_11006
[INFO] task-segment: [clean, install]
[INFO] ------------------------------------------------------------------------
[INFO] [clean:clean]
[INFO] Deleting directory <http://hudson.zones.apache.org/hudson/job/Tuscany-SCA-J-CAA/ws/scajcaa/sca-java-caa/JCA_11006/target>
[INFO] [resources:resources]
[INFO] Using default encoding to copy filtered resources.
[INFO] [compiler:compile]
[INFO] Compiling 1 source file to <http://hudson.zones.apache.org/hudson/job/Tuscany-SCA-J-CAA/ws/scajcaa/sca-java-caa/JCA_11006/target/classes>
[INFO] [resources:testResources]
[INFO] Using default encoding to copy filtered resources.
[INFO] [compiler:testCompile]
[INFO] No sources to compile
[INFO] [surefire:test]
[INFO] No tests to run.
[HUDSON] Recording test results
[INFO] [jar:jar]
[INFO] Building jar: <http://hudson.zones.apache.org/hudson/job/Tuscany-SCA-J-CAA/ws/scajcaa/sca-java-caa/JCA_11006/target/JCA_11006.jar>
[INFO] [assembly:single {execution: make-assembly}]
[INFO] Reading assembly descriptor: ../tozip.xml
[INFO] Building zip: <http://hudson.zones.apache.org/hudson/job/Tuscany-SCA-J-CAA/ws/scajcaa/sca-java-caa/JCA_11006/target/JCA_11006.zip>
[WARNING] Configuration options: 'appendAssemblyId' is set to false, and 'classifier' is missing.
Instead of attaching the assembly file: <http://hudson.zones.apache.org/hudson/job/Tuscany-SCA-J-CAA/ws/scajcaa/sca-java-caa/JCA_11006/target/JCA_11006.zip,> it will become the file for main project artifact.
NOTE: If multiple descriptors or descriptor-formats are provided for this project, the value of this file will be non-deterministic!
[WARNING] Replacing pre-existing project main-artifact file: <http://hudson.zones.apache.org/hudson/job/Tuscany-SCA-J-CAA/ws/scajcaa/sca-java-caa/JCA_11006/target/JCA_11006.jar>
with assembly file: <http://hudson.zones.apache.org/hudson/job/Tuscany-SCA-J-CAA/ws/scajcaa/sca-java-caa/JCA_11006/target/JCA_11006.zip>
[INFO] [install:install]
[INFO] Installing <http://hudson.zones.apache.org/hudson/job/Tuscany-SCA-J-CAA/ws/scajcaa/sca-java-caa/JCA_11006/target/JCA_11006.zip> to /export/home/hudson/.m2/repository/org/oasis-open/sca/j/JCA_11006/1.0/JCA_11006-1.0.jar
[HUDSON] Archiving <http://hudson.zones.apache.org/hudson/job/Tuscany-SCA-J-CAA/ws/scajcaa/sca-java-caa/JCA_11006/pom.xml> to /export/home/hudson/hudson/jobs/Tuscany-SCA-J-CAA/modules/org.oasis-open.sca.j$JCA_11006/builds/2009-11-22_00-50-37/archive/org.oasis-open.sca.j/JCA_11006/1.0/pom.xml
[HUDSON] Archiving <http://hudson.zones.apache.org/hudson/job/Tuscany-SCA-J-CAA/ws/scajcaa/sca-java-caa/JCA_11006/target/JCA_11006.zip> to /export/home/hudson/hudson/jobs/Tuscany-SCA-J-CAA/modules/org.oasis-open.sca.j$JCA_11006/builds/2009-11-22_00-50-37/archive/org.oasis-open.sca.j/JCA_11006/1.0/JCA_11006.zip
[INFO] ------------------------------------------------------------------------
[INFO] Building OASIS Java CAA TestCases - Contribution JCA_11007
[INFO] task-segment: [clean, install]
[INFO] ------------------------------------------------------------------------
[INFO] [clean:clean]
[INFO] Deleting directory <http://hudson.zones.apache.org/hudson/job/Tuscany-SCA-J-CAA/ws/scajcaa/sca-java-caa/JCA_11007/target>
[INFO] [resources:resources]
[INFO] Using default encoding to copy filtered resources.
[INFO] [compiler:compile]
[INFO] Compiling 1 source file to <http://hudson.zones.apache.org/hudson/job/Tuscany-SCA-J-CAA/ws/scajcaa/sca-java-caa/JCA_11007/target/classes>
[INFO] [resources:testResources]
[INFO] Using default encoding to copy filtered resources.
[INFO] [compiler:testCompile]
[INFO] No sources to compile
[INFO] [surefire:test]
[INFO] No tests to run.
[HUDSON] Recording test results
[INFO] [jar:jar]
[INFO] Building jar: <http://hudson.zones.apache.org/hudson/job/Tuscany-SCA-J-CAA/ws/scajcaa/sca-java-caa/JCA_11007/target/JCA_11007.jar>
[INFO] [assembly:single {execution: make-assembly}]
[INFO] Reading assembly descriptor: ../tozip.xml
[INFO] Building zip: <http://hudson.zones.apache.org/hudson/job/Tuscany-SCA-J-CAA/ws/scajcaa/sca-java-caa/JCA_11007/target/JCA_11007.zip>
[WARNING] Configuration options: 'appendAssemblyId' is set to false, and 'classifier' is missing.
Instead of attaching the assembly file: <http://hudson.zones.apache.org/hudson/job/Tuscany-SCA-J-CAA/ws/scajcaa/sca-java-caa/JCA_11007/target/JCA_11007.zip,> it will become the file for main project artifact.
NOTE: If multiple descriptors or descriptor-formats are provided for this project, the value of this file will be non-deterministic!
[WARNING] Replacing pre-existing project main-artifact file: <http://hudson.zones.apache.org/hudson/job/Tuscany-SCA-J-CAA/ws/scajcaa/sca-java-caa/JCA_11007/target/JCA_11007.jar>
with assembly file: <http://hudson.zones.apache.org/hudson/job/Tuscany-SCA-J-CAA/ws/scajcaa/sca-java-caa/JCA_11007/target/JCA_11007.zip>
[INFO] [install:install]
[INFO] Installing <http://hudson.zones.apache.org/hudson/job/Tuscany-SCA-J-CAA/ws/scajcaa/sca-java-caa/JCA_11007/target/JCA_11007.zip> to /export/home/hudson/.m2/repository/org/oasis-open/sca/j/JCA_11007/1.0/JCA_11007-1.0.jar
[HUDSON] Archiving <http://hudson.zones.apache.org/hudson/job/Tuscany-SCA-J-CAA/ws/scajcaa/sca-java-caa/JCA_11007/pom.xml> to /export/home/hudson/hudson/jobs/Tuscany-SCA-J-CAA/modules/org.oasis-open.sca.j$JCA_11007/builds/2009-11-22_00-50-37/archive/org.oasis-open.sca.j/JCA_11007/1.0/pom.xml
[HUDSON] Archiving <http://hudson.zones.apache.org/hudson/job/Tuscany-SCA-J-CAA/ws/scajcaa/sca-java-caa/JCA_11007/target/JCA_11007.zip> to /export/home/hudson/hudson/jobs/Tuscany-SCA-J-CAA/modules/org.oasis-open.sca.j$JCA_11007/builds/2009-11-22_00-50-37/archive/org.oasis-open.sca.j/JCA_11007/1.0/JCA_11007.zip
[INFO] ------------------------------------------------------------------------
[INFO] Building OASIS Java CAA TestCases - Contribution JCA_11008
[INFO] task-segment: [clean, install]
[INFO] ------------------------------------------------------------------------
[INFO] [clean:clean]
[INFO] Deleting directory <http://hudson.zones.apache.org/hudson/job/Tuscany-SCA-J-CAA/ws/scajcaa/sca-java-caa/JCA_11008/target>
[INFO] [resources:resources]
[INFO] Using default encoding to copy filtered resources.
[INFO] [compiler:compile]
[INFO] Compiling 1 source file to <http://hudson.zones.apache.org/hudson/job/Tuscany-SCA-J-CAA/ws/scajcaa/sca-java-caa/JCA_11008/target/classes>
[INFO] [resources:testResources]
[INFO] Using default encoding to copy filtered resources.
[INFO] [compiler:testCompile]
[INFO] No sources to compile
[INFO] [surefire:test]
[INFO] No tests to run.
[HUDSON] Recording test results
[INFO] [jar:jar]
[INFO] Building jar: <http://hudson.zones.apache.org/hudson/job/Tuscany-SCA-J-CAA/ws/scajcaa/sca-java-caa/JCA_11008/target/JCA_11008.jar>
[INFO] [assembly:single {execution: make-assembly}]
[INFO] Reading assembly descriptor: ../tozip.xml
[INFO] Building zip: <http://hudson.zones.apache.org/hudson/job/Tuscany-SCA-J-CAA/ws/scajcaa/sca-java-caa/JCA_11008/target/JCA_11008.zip>
[WARNING] Configuration options: 'appendAssemblyId' is set to false, and 'classifier' is missing.
Instead of attaching the assembly file: <http://hudson.zones.apache.org/hudson/job/Tuscany-SCA-J-CAA/ws/scajcaa/sca-java-caa/JCA_11008/target/JCA_11008.zip,> it will become the file for main project artifact.
NOTE: If multiple descriptors or descriptor-formats are provided for this project, the value of this file will be non-deterministic!
[WARNING] Replacing pre-existing project main-artifact file: <http://hudson.zones.apache.org/hudson/job/Tuscany-SCA-J-CAA/ws/scajcaa/sca-java-caa/JCA_11008/target/JCA_11008.jar>
with assembly file: <http://hudson.zones.apache.org/hudson/job/Tuscany-SCA-J-CAA/ws/scajcaa/sca-java-caa/JCA_11008/target/JCA_11008.zip>
[INFO] [install:install]
[INFO] Installing <http://hudson.zones.apache.org/hudson/job/Tuscany-SCA-J-CAA/ws/scajcaa/sca-java-caa/JCA_11008/target/JCA_11008.zip> to /export/home/hudson/.m2/repository/org/oasis-open/sca/j/JCA_11008/1.0/JCA_11008-1.0.jar
[HUDSON] Archiving <http://hudson.zones.apache.org/hudson/job/Tuscany-SCA-J-CAA/ws/scajcaa/sca-java-caa/JCA_11008/pom.xml> to /export/home/hudson/hudson/jobs/Tuscany-SCA-J-CAA/modules/org.oasis-open.sca.j$JCA_11008/builds/2009-11-22_00-50-37/archive/org.oasis-open.sca.j/JCA_11008/1.0/pom.xml
[HUDSON] Archiving <http://hudson.zones.apache.org/hudson/job/Tuscany-SCA-J-CAA/ws/scajcaa/sca-java-caa/JCA_11008/target/JCA_11008.zip> to /export/home/hudson/hudson/jobs/Tuscany-SCA-J-CAA/modules/org.oasis-open.sca.j$JCA_11008/builds/2009-11-22_00-50-37/archive/org.oasis-open.sca.j/JCA_11008/1.0/JCA_11008.zip
[INFO] ------------------------------------------------------------------------
[INFO] Building OASIS Java CAA TestCases - Test Client
[INFO] task-segment: [clean, install]
[INFO] ------------------------------------------------------------------------
[INFO] [clean:clean]
[INFO] Deleting directory <http://hudson.zones.apache.org/hudson/job/Tuscany-SCA-J-CAA/ws/scajcaa/sca-java-caa/Test_Client_JavaCAA/target>
[INFO] [resources:resources]
[INFO] Using default encoding to copy filtered resources.
[INFO] [compiler:compile]
[INFO] Compiling 79 source files to <http://hudson.zones.apache.org/hudson/job/Tuscany-SCA-J-CAA/ws/scajcaa/sca-java-caa/Test_Client_JavaCAA/target/classes>
[INFO] [resources:testResources]
[INFO] Using default encoding to copy filtered resources.
[INFO] [compiler:testCompile]
[INFO] No sources to compile
[INFO] [surefire:test]
[INFO] No tests to run.
[HUDSON] Recording test results
[INFO] [jar:jar]
[INFO] Building jar: <http://hudson.zones.apache.org/hudson/job/Tuscany-SCA-J-CAA/ws/scajcaa/sca-java-caa/Test_Client_JavaCAA/target/Test_Client_JavaCAA.jar>
[INFO] [install:install]
[INFO] Installing <http://hudson.zones.apache.org/hudson/job/Tuscany-SCA-J-CAA/ws/scajcaa/sca-java-caa/Test_Client_JavaCAA/target/Test_Client_JavaCAA.jar> to /export/home/hudson/.m2/repository/org/oasis-open/sca/j/Test_Client_JavaCAA/1.0/Test_Client_JavaCAA-1.0.jar
[HUDSON] Archiving <http://hudson.zones.apache.org/hudson/job/Tuscany-SCA-J-CAA/ws/scajcaa/sca-java-caa/Test_Client_JavaCAA/pom.xml> to /export/home/hudson/hudson/jobs/Tuscany-SCA-J-CAA/modules/org.oasis-open.sca.j$Test_Client_JavaCAA/builds/2009-11-22_00-50-37/archive/org.oasis-open.sca.j/Test_Client_JavaCAA/1.0/pom.xml
[HUDSON] Archiving <http://hudson.zones.apache.org/hudson/job/Tuscany-SCA-J-CAA/ws/scajcaa/sca-java-caa/Test_Client_JavaCAA/target/Test_Client_JavaCAA.jar> to /export/home/hudson/hudson/jobs/Tuscany-SCA-J-CAA/modules/org.oasis-open.sca.j$Test_Client_JavaCAA/builds/2009-11-22_00-50-37/archive/org.oasis-open.sca.j/Test_Client_JavaCAA/1.0/Test_Client_JavaCAA.jar
[INFO] ------------------------------------------------------------------------
[INFO] Building Apache Tuscany SCA Specification Tests for SCA-J CAA
[INFO] task-segment: [clean, install]
[INFO] ------------------------------------------------------------------------
[INFO] [clean:clean]
[INFO] [build-helper:add-test-source {execution: add-test-source}]
[INFO] Test Source directory: <http://hudson.zones.apache.org/hudson/job/Tuscany-SCA-J-CAA/ws/scajcaa/tuscany-java-caa-test-runner/src/test/tjava> added.
[INFO] snapshot org.apache.tuscany.sca:tuscany-binding-ws-axis2:2.0-SNAPSHOT: checking for updates from apache.snapshots
[INFO] snapshot org.apache.tuscany.sca:tuscany-databinding-axiom:2.0-SNAPSHOT: checking for updates from apache.snapshots
[INFO] snapshot org.apache.tuscany.sca:tuscany-binding-ws-axis2-policy:2.0-SNAPSHOT: checking for updates from apache.snapshots
Downloading: http://repo2.maven.org/maven2/org/apache/santuario/xmlsec/1.4.0/xmlsec-1.4.0.pom
Downloading: http://people.apache.org/repo/m2-incubating-repository/org/apache/santuario/xmlsec/1.4.0/xmlsec-1.4.0.pom
Downloading: http://svn.apache.org/repos/asf/tuscany/maven/org/apache/santuario/xmlsec/1.4.0/xmlsec-1.4.0.pom
Downloading: http://ws.zones.apache.org/repository2/org/apache/santuario/xmlsec/1.4.0/xmlsec-1.4.0.pom
Downloading: http://ftp.ussg.iu.edu/eclipse/modeling/emf/emf/maven2//org/apache/santuario/xmlsec/1.4.0/xmlsec-1.4.0.pom
Downloading: http://ftp.osuosl.org/pub/eclipse/tools/emf/maven2/org/apache/santuario/xmlsec/1.4.0/xmlsec-1.4.0.pom
Downloading: http://www.intalio.org/public/maven2/org/apache/santuario/xmlsec/1.4.0/xmlsec-1.4.0.pom
Downloading: http://download.java.net/maven/1/org.apache.santuario/poms/xmlsec-1.4.0.pom
Downloading: http://download.java.net/maven/2/org/apache/santuario/xmlsec/1.4.0/xmlsec-1.4.0.pom
Downloading: http://repo1.maven.org/maven2/org/apache/santuario/xmlsec/1.4.0/xmlsec-1.4.0.pom
Downloading: http://repo2.maven.org/maven2/opensaml/opensaml/1.1/opensaml-1.1.pom
Downloading: http://people.apache.org/repo/m2-incubating-repository/opensaml/opensaml/1.1/opensaml-1.1.pom
Downloading: http://svn.apache.org/repos/asf/tuscany/maven/opensaml/opensaml/1.1/opensaml-1.1.pom
Downloading: http://ws.zones.apache.org/repository2/opensaml/opensaml/1.1/opensaml-1.1.pom
Downloading: http://ftp.ussg.iu.edu/eclipse/modeling/emf/emf/maven2//opensaml/opensaml/1.1/opensaml-1.1.pom
Downloading: http://ftp.osuosl.org/pub/eclipse/tools/emf/maven2/opensaml/opensaml/1.1/opensaml-1.1.pom
Downloading: http://www.intalio.org/public/maven2/opensaml/opensaml/1.1/opensaml-1.1.pom
Downloading: http://download.java.net/maven/1/opensaml/poms/opensaml-1.1.pom
Downloading: http://download.java.net/maven/2/opensaml/opensaml/1.1/opensaml-1.1.pom
Downloading: http://repo1.maven.org/maven2/opensaml/opensaml/1.1/opensaml-1.1.pom
Downloading: http://repo2.maven.org/maven2/org/apache/santuario/xmlsec/1.4.1/xmlsec-1.4.1.pom
Downloading: http://people.apache.org/repo/m2-incubating-repository/org/apache/santuario/xmlsec/1.4.1/xmlsec-1.4.1.pom
Downloading: http://svn.apache.org/repos/asf/tuscany/maven/org/apache/santuario/xmlsec/1.4.1/xmlsec-1.4.1.pom
Downloading: http://ws.zones.apache.org/repository2/org/apache/santuario/xmlsec/1.4.1/xmlsec-1.4.1.pom
Downloading: http://ftp.ussg.iu.edu/eclipse/modeling/emf/emf/maven2//org/apache/santuario/xmlsec/1.4.1/xmlsec-1.4.1.pom
Downloading: http://ftp.osuosl.org/pub/eclipse/tools/emf/maven2/org/apache/santuario/xmlsec/1.4.1/xmlsec-1.4.1.pom
Downloading: http://www.intalio.org/public/maven2/org/apache/santuario/xmlsec/1.4.1/xmlsec-1.4.1.pom
Downloading: http://download.java.net/maven/1/org.apache.santuario/poms/xmlsec-1.4.1.pom
Downloading: http://download.java.net/maven/2/org/apache/santuario/xmlsec/1.4.1/xmlsec-1.4.1.pom
Downloading: http://repo1.maven.org/maven2/org/apache/santuario/xmlsec/1.4.1/xmlsec-1.4.1.pom
[INFO] snapshot org.apache.tuscany.sca:tuscany-xsd:2.0-SNAPSHOT: checking for updates from apache.snapshots
[INFO] snapshot org.apache.tuscany.sca:tuscany-xsd:2.0-SNAPSHOT: checking for updates from apache.ws
[WARNING] repository metadata for: 'snapshot org.apache.tuscany.sca:tuscany-xsd:2.0-SNAPSHOT' could not be retrieved from repository: apache.ws due to an error: Error transferring file
[INFO] Repository 'apache.ws' will be blacklisted
[INFO] snapshot org.apache.tuscany.sca:tuscany-interface-wsdl:2.0-SNAPSHOT: checking for updates from apache.snapshots
[INFO] snapshot org.apache.tuscany.sca:tuscany-binding-ws:2.0-SNAPSHOT: checking for updates from apache.snapshots
[INFO] snapshot org.apache.tuscany.sca:tuscany-binding-ws-wsdlgen:2.0-SNAPSHOT: checking for updates from apache.snapshots
[INFO] snapshot org.apache.tuscany.sca:tuscany-databinding-jaxb-axiom:2.0-SNAPSHOT: checking for updates from apache.snapshots
[INFO] snapshot org.apache.tuscany.sca:tuscany-host-http:2.0-SNAPSHOT: checking for updates from apache.snapshots
[INFO] snapshot org.apache.tuscany.sca:tuscany-policy-security:2.0-SNAPSHOT: checking for updates from apache.snapshots
[INFO] snapshot org.apache.tuscany.sca:tuscany-policy-xml-ws:2.0-SNAPSHOT: checking for updates from apache.snapshots
[INFO] [antrun:run {execution: copy-files-from-svn}]
[INFO] Executing tasks
copyResourceDir:
copySourceDir:
[sync] Removed 1 dangling directory from <http://hudson.zones.apache.org/hudson/job/Tuscany-SCA-J-CAA/ws/scajcaa/tuscany-java-caa-test-runner/src/test/java>
[sync] Removed 8 dangling files from <http://hudson.zones.apache.org/hudson/job/Tuscany-SCA-J-CAA/ws/scajcaa/tuscany-java-caa-test-runner/src/test/java>
copySourceDir:
[sync] Copying 8 files to <http://hudson.zones.apache.org/hudson/job/Tuscany-SCA-J-CAA/ws/scajcaa/tuscany-java-caa-test-runner/src/test/java/testClient>
[sync] Copying <http://hudson.zones.apache.org/hudson/job/Tuscany-SCA-J-CAA/ws/scajcaa/sca-assembly/Test_Client/src/main/java/testClient/InvokeTest.java> to <http://hudson.zones.apache.org/hudson/job/Tuscany-SCA-J-CAA/ws/scajcaa/tuscany-java-caa-test-runner/src/test/java/testClient/InvokeTest.java>
[sync] Copying <http://hudson.zones.apache.org/hudson/job/Tuscany-SCA-J-CAA/ws/scajcaa/sca-assembly/Test_Client/src/main/java/testClient/TestInvocationService.java> to <http://hudson.zones.apache.org/hudson/job/Tuscany-SCA-J-CAA/ws/scajcaa/tuscany-java-caa-test-runner/src/test/java/testClient/TestInvocationService.java>
[sync] Copying <http://hudson.zones.apache.org/hudson/job/Tuscany-SCA-J-CAA/ws/scajcaa/sca-assembly/Test_Client/src/main/java/testClient/InvokeTestResponse.java> to <http://hudson.zones.apache.org/hudson/job/Tuscany-SCA-J-CAA/ws/scajcaa/tuscany-java-caa-test-runner/src/test/java/testClient/InvokeTestResponse.java>
[sync] Copying <http://hudson.zones.apache.org/hudson/job/Tuscany-SCA-J-CAA/ws/scajcaa/sca-assembly/Test_Client/src/main/java/testClient/package-info.java> to <http://hudson.zones.apache.org/hudson/job/Tuscany-SCA-J-CAA/ws/scajcaa/tuscany-java-caa-test-runner/src/test/java/testClient/package-info.java>
[sync] Copying <http://hudson.zones.apache.org/hudson/job/Tuscany-SCA-J-CAA/ws/scajcaa/sca-assembly/Test_Client/src/main/java/testClient/TestException.java> to <http://hudson.zones.apache.org/hudson/job/Tuscany-SCA-J-CAA/ws/scajcaa/tuscany-java-caa-test-runner/src/test/java/testClient/TestException.java>
[sync] Copying <http://hudson.zones.apache.org/hudson/job/Tuscany-SCA-J-CAA/ws/scajcaa/sca-assembly/Test_Client/src/main/java/testClient/ObjectFactory.java> to <http://hudson.zones.apache.org/hudson/job/Tuscany-SCA-J-CAA/ws/scajcaa/tuscany-java-caa-test-runner/src/test/java/testClient/ObjectFactory.java>
[sync] Copying <http://hudson.zones.apache.org/hudson/job/Tuscany-SCA-J-CAA/ws/scajcaa/sca-assembly/Test_Client/src/main/java/testClient/TestInvocation.java> to <http://hudson.zones.apache.org/hudson/job/Tuscany-SCA-J-CAA/ws/scajcaa/tuscany-java-caa-test-runner/src/test/java/testClient/TestInvocation.java>
[sync] Copying <http://hudson.zones.apache.org/hudson/job/Tuscany-SCA-J-CAA/ws/scajcaa/sca-assembly/Test_Client/src/main/java/testClient/TestException_Exception.java> to <http://hudson.zones.apache.org/hudson/job/Tuscany-SCA-J-CAA/ws/scajcaa/tuscany-java-caa-test-runner/src/test/java/testClient/TestException_Exception.java>
copyFile:
[HUDSON] Archiving <http://hudson.zones.apache.org/hudson/job/Tuscany-SCA-J-CAA/ws/scajcaa/tuscany-java-caa-test-runner/pom.xml> to /export/home/hudson/hudson/jobs/Tuscany-SCA-J-CAA/modules/org.apache.tuscany.sca$tuscany-otests-sca-j-caa-tests/builds/2009-11-22_00-50-37/archive/org.apache.tuscany.sca/tuscany-otests-sca-j-caa-tests/2.0-SNAPSHOT/pom.xml
[INFO] ------------------------------------------------------------------------
[ERROR] BUILD ERROR
[INFO] ------------------------------------------------------------------------
[INFO] An Ant BuildException has occured: The following error occurred while executing this line:
<http://hudson.zones.apache.org/hudson/job/Tuscany-SCA-J-CAA/ws/scajcaa/build.xml>:53: Warning: Could not find file <http://hudson.zones.apache.org/hudson/job/Tuscany-SCA-J-CAA/ws/scajcaa/sca-assembly/Test_Client/src/main/java/client/BaseJAXWSTestCase.java> to copy.
[INFO] ------------------------------------------------------------------------
[INFO] For more information, run Maven with the -e switch
[INFO] ------------------------------------------------------------------------
[INFO] Total time: 8 minutes 25 seconds
[INFO] Finished at: Sun Nov 22 00:59:14 UTC 2009
[INFO] Final Memory: 142M/742M
[INFO] ------------------------------------------------------------------------
Waiting for Hudson to finish collecting data
Sending e-mails to: commits@tuscany.apache.org
channel stopped