You are viewing a plain text version of this content. The canonical link for it is here.
Posted to dev@lucene.apache.org by Policeman Jenkins Server <je...@thetaphi.de> on 2017/04/04 03:18:17 UTC
[JENKINS] Lucene-Solr-master-Windows (32bit/jdk1.8.0_121) - Build #
6497 - Unstable!
Build: https://jenkins.thetaphi.de/job/Lucene-Solr-master-Windows/6497/
Java: 32bit/jdk1.8.0_121 -server -XX:+UseConcMarkSweepGC
2 tests failed.
FAILED: org.apache.solr.util.TestSolrCLIRunExample.testSchemalessExample
Error Message:
Test abandoned because suite timeout was reached.
Stack Trace:
java.lang.Exception: Test abandoned because suite timeout was reached.
at __randomizedtesting.SeedInfo.seed([CD8A442CEDB674C]:0)
FAILED: junit.framework.TestSuite.org.apache.solr.util.TestSolrCLIRunExample
Error Message:
Suite timeout exceeded (>= 7200000 msec).
Stack Trace:
java.lang.Exception: Suite timeout exceeded (>= 7200000 msec).
at __randomizedtesting.SeedInfo.seed([CD8A442CEDB674C]:0)
Build Log:
[...truncated 12922 lines...]
[junit4] Suite: org.apache.solr.util.TestSolrCLIRunExample
[junit4] 2> Creating dataDir: C:\Users\jenkins\workspace\Lucene-Solr-master-Windows\solr\build\solr-core\test\J1\temp\solr.util.TestSolrCLIRunExample_CD8A442CEDB674C-001\init-core-data-001
[junit4] 2> 444682 WARN (SUITE-TestSolrCLIRunExample-seed#[CD8A442CEDB674C]-worker) [ ] o.a.s.SolrTestCaseJ4 startTrackingSearchers: numOpens=22 numCloses=22
[junit4] 2> 444682 INFO (SUITE-TestSolrCLIRunExample-seed#[CD8A442CEDB674C]-worker) [ ] o.a.s.SolrTestCaseJ4 Using PointFields
[junit4] 2> 444697 INFO (SUITE-TestSolrCLIRunExample-seed#[CD8A442CEDB674C]-worker) [ ] o.a.s.SolrTestCaseJ4 Randomized ssl (false) and clientAuth (false) via: @org.apache.solr.SolrTestCaseJ4$SuppressSSL(bugUrl=https://issues.apache.org/jira/browse/SOLR-5776)
[junit4] 2> 444697 INFO (TEST-TestSolrCLIRunExample.testFailExecuteScript-seed#[CD8A442CEDB674C]) [ ] o.a.s.SolrTestCaseJ4 ###Starting testFailExecuteScript
[junit4] 2>
[junit4] 2> ERROR: Failed to start Solr using command: C:\Users\jenkins\workspace\Lucene-Solr-master-Windows\solr\build\solr-core\test\J1\temp\solr.util.TestSolrCLIRunExample_CD8A442CEDB674C-001\tempDir-001\failExecuteScript start -p 61851 -s "C:\Users\jenkins\workspace\Lucene-Solr-master-Windows\solr\build\solr-core\test\J1\temp\solr.util.TestSolrCLIRunExample_CD8A442CEDB674C-001\tempDir-001\techproducts\solr" Exception : org.apache.commons.exec.ExecuteException: Execution failed (Exit value: -559038737. Caused by java.io.IOException: Cannot run program "C:\Users\jenkins\workspace\Lucene-Solr-master-Windows\solr\build\solr-core\test\J1\temp\solr.util.TestSolrCLIRunExample_CD8A442CEDB674C-001\tempDir-001\failExecuteScript" (in directory "."): CreateProcess error=193, %1 is not a valid Win32 application)
[junit4] 2>
[junit4] 2> 446243 INFO (TEST-TestSolrCLIRunExample.testFailExecuteScript-seed#[CD8A442CEDB674C]) [ ] o.a.s.SolrTestCaseJ4 ###Ending testFailExecuteScript
[junit4] 2> 446243 INFO (TEST-TestSolrCLIRunExample.testSchemalessExample-seed#[CD8A442CEDB674C]) [ ] o.a.s.SolrTestCaseJ4 ###Starting testSchemalessExample
[junit4] 2> 446243 INFO (TEST-TestSolrCLIRunExample.testSchemalessExample-seed#[CD8A442CEDB674C]) [ ] o.a.s.u.TestSolrCLIRunExample Selected port 61853 to start schemaless example Solr instance on ...
[junit4] 2> 447288 INFO (Thread-758) [ ] o.e.j.s.Server jetty-9.3.14.v20161028
[junit4] 2> 447288 INFO (Thread-758) [ ] o.e.j.s.h.ContextHandler Started o.e.j.s.ServletContextHandler@ab25eb{/solr,null,AVAILABLE}
[junit4] 2> 447288 INFO (Thread-758) [ ] o.e.j.s.AbstractConnector Started ServerConnector@14ec429{HTTP/1.1,[http/1.1]}{127.0.0.1:61853}
[junit4] 2> 447288 INFO (Thread-758) [ ] o.e.j.s.Server Started @457411ms
[junit4] 2> 447288 INFO (Thread-758) [ ] o.a.s.c.s.e.JettySolrRunner Jetty properties: {hostContext=/solr, hostPort=61853}
[junit4] 2> 447288 ERROR (Thread-758) [ ] o.a.s.s.StartupLoggingUtils Missing Java Option solr.log.dir. Logging may be missing or incomplete.
[junit4] 2> 447288 INFO (Thread-758) [ ] o.a.s.s.SolrDispatchFilter ___ _ Welcome to Apache Solr? version 7.0.0
[junit4] 2> 447288 INFO (Thread-758) [ ] o.a.s.s.SolrDispatchFilter / __| ___| |_ _ Starting in standalone mode on port 61853
[junit4] 2> 447288 INFO (Thread-758) [ ] o.a.s.s.SolrDispatchFilter \__ \/ _ \ | '_| Install dir: null
[junit4] 2> 447288 INFO (Thread-758) [ ] o.a.s.s.SolrDispatchFilter |___/\___/_|_| Start time: 2017-04-04T00:44:25.825Z
[junit4] 2> 447288 INFO (Thread-758) [ ] o.a.s.c.SolrXmlConfig Loading container configuration from C:\Users\jenkins\workspace\Lucene-Solr-master-Windows\solr\build\solr-core\test\J1\temp\solr.util.TestSolrCLIRunExample_CD8A442CEDB674C-001\tempDir-002\schemaless\solr\solr.xml
[junit4] 2> 447413 INFO (Thread-758) [ ] o.a.s.c.CorePropertiesLocator Found 0 core definitions underneath C:\Users\jenkins\workspace\Lucene-Solr-master-Windows\solr\build\solr-core\test\J1\temp\solr.util.TestSolrCLIRunExample_CD8A442CEDB674C-001\tempDir-002\schemaless\solr
[junit4] 2> Apr 04, 2017 4:44:23 AM com.carrotsearch.randomizedtesting.ThreadLeakControl$2 evaluate
[junit4] 2> WARNING: Suite execution timed out: org.apache.solr.util.TestSolrCLIRunExample
[junit4] 2> ==== jstack at approximately timeout time ====
[junit4] 2> "Thread-767" ID=3299 WAITING on java.lang.Object@1824857
[junit4] 2> at java.lang.Object.wait(Native Method)
[junit4] 2> - waiting on java.lang.Object@1824857
[junit4] 2> at java.lang.Object.wait(Object.java:502)
[junit4] 2> at org.apache.solr.core.CloserThread.run(CoreContainer.java:1510)
[junit4] 2>
[junit4] 2> "Connection evictor" ID=3298 TIMED_WAITING
[junit4] 2> at java.lang.Thread.sleep(Native Method)
[junit4] 2> at org.apache.http.impl.client.IdleConnectionEvictor$1.run(IdleConnectionEvictor.java:66)
[junit4] 2> at java.lang.Thread.run(Thread.java:745)
[junit4] 2>
[junit4] 2> "Connection evictor" ID=3297 TIMED_WAITING
[junit4] 2> at java.lang.Thread.sleep(Native Method)
[junit4] 2> at org.apache.http.impl.client.IdleConnectionEvictor$1.run(IdleConnectionEvictor.java:66)
[junit4] 2> at java.lang.Thread.run(Thread.java:745)
[junit4] 2>
[junit4] 2> "org.eclipse.jetty.server.session.HashSessionManager@112c502Timer" ID=3296 TIMED_WAITING on java.util.concurrent.locks.AbstractQueuedSynchronizer$ConditionObject@30bb94
[junit4] 2> at sun.misc.Unsafe.park(Native Method)
[junit4] 2> - timed waiting on java.util.concurrent.locks.AbstractQueuedSynchronizer$ConditionObject@30bb94
[junit4] 2> at java.util.concurrent.locks.LockSupport.parkNanos(LockSupport.java:215)
[junit4] 2> at java.util.concurrent.locks.AbstractQueuedSynchronizer$ConditionObject.awaitNanos(AbstractQueuedSynchronizer.java:2078)
[junit4] 2> at java.util.concurrent.ScheduledThreadPoolExecutor$DelayedWorkQueue.take(ScheduledThreadPoolExecutor.java:1093)
[junit4] 2> at java.util.concurrent.ScheduledThreadPoolExecutor$DelayedWorkQueue.take(ScheduledThreadPoolExecutor.java:809)
[junit4] 2> at java.util.concurrent.ThreadPoolExecutor.getTask(ThreadPoolExecutor.java:1067)
[junit4] 2> at java.util.concurrent.ThreadPoolExecutor.runWorker(ThreadPoolExecutor.java:1127)
[junit4] 2> at java.util.concurrent.ThreadPoolExecutor$Worker.run(ThreadPoolExecutor.java:617)
[junit4] 2> at java.lang.Thread.run(Thread.java:745)
[junit4] 2>
[junit4] 2> "qtp15523365-3295" ID=3295 TIMED_WAITING on java.util.concurrent.locks.AbstractQueuedSynchronizer$ConditionObject@167137d
[junit4] 2> at sun.misc.Unsafe.park(Native Method)
[junit4] 2> - timed waiting on java.util.concurrent.locks.AbstractQueuedSynchronizer$ConditionObject@167137d
[junit4] 2> at java.util.concurrent.locks.LockSupport.parkNanos(LockSupport.java:215)
[junit4] 2> at java.util.concurrent.locks.AbstractQueuedSynchronizer$ConditionObject.awaitNanos(AbstractQueuedSynchronizer.java:2078)
[junit4] 2> at org.eclipse.jetty.util.BlockingArrayQueue.poll(BlockingArrayQueue.java:392)
[junit4] 2> at org.eclipse.jetty.util.thread.QueuedThreadPool.idleJobPoll(QueuedThreadPool.java:563)
[junit4] 2> at org.eclipse.jetty.util.thread.QueuedThreadPool.access$800(QueuedThreadPool.java:48)
[junit4] 2> at org.eclipse.jetty.util.thread.QueuedThreadPool$2.run(QueuedThreadPool.java:626)
[junit4] 2> at java.lang.Thread.run(Thread.java:745)
[junit4] 2>
[junit4] 2> "qtp15523365-3294" ID=3294 TIMED_WAITING on java.util.concurrent.locks.AbstractQueuedSynchronizer$ConditionObject@167137d
[junit4] 2> at sun.misc.Unsafe.park(Native Method)
[junit4] 2> - timed waiting on java.util.concurrent.locks.AbstractQueuedSynchronizer$ConditionObject@167137d
[junit4] 2> at java.util.concurrent.locks.LockSupport.parkNanos(LockSupport.java:215)
[junit4] 2> at java.util.concurrent.locks.AbstractQueuedSynchronizer$ConditionObject.awaitNanos(AbstractQueuedSynchronizer.java:2078)
[junit4] 2> at org.eclipse.jetty.util.BlockingArrayQueue.poll(BlockingArrayQueue.java:392)
[junit4] 2> at org.eclipse.jetty.util.thread.QueuedThreadPool.idleJobPoll(QueuedThreadPool.java:563)
[junit4] 2> at org.eclipse.jetty.util.thread.QueuedThreadPool.access$800(QueuedThreadPool.java:48)
[junit4] 2> at org.eclipse.jetty.util.thread.QueuedThreadPool$2.run(QueuedThreadPool.java:626)
[junit4] 2> at java.lang.Thread.run(Thread.java:745)
[junit4] 2>
[junit4] 2> "qtp15523365-3293" ID=3293 TIMED_WAITING on java.util.concurrent.locks.AbstractQueuedSynchronizer$ConditionObject@167137d
[junit4] 2> at sun.misc.Unsafe.park(Native Method)
[junit4] 2> - timed waiting on java.util.concurrent.locks.AbstractQueuedSynchronizer$ConditionObject@167137d
[junit4] 2> at java.util.concurrent.locks.LockSupport.parkNanos(LockSupport.java:215)
[junit4] 2> at java.util.concurrent.locks.AbstractQueuedSynchronizer$ConditionObject.awaitNanos(AbstractQueuedSynchronizer.java:2078)
[junit4] 2> at org.eclipse.jetty.util.BlockingArrayQueue.poll(BlockingArrayQueue.java:392)
[junit4] 2> at org.eclipse.jetty.util.thread.QueuedThreadPool.idleJobPoll(QueuedThreadPool.java:563)
[junit4] 2> at org.eclipse.jetty.util.thread.QueuedThreadPool.access$800(QueuedThreadPool.java:48)
[junit4] 2> at org.eclipse.jetty.util.thread.QueuedThreadPool$2.run(QueuedThreadPool.java:626)
[junit4] 2> at java.lang.Thread.run(Thread.java:745)
[junit4] 2>
[junit4] 2> "qtp15523365-3292" ID=3292 TIMED_WAITING on java.util.concurrent.locks.AbstractQueuedSynchronizer$ConditionObject@167137d
[junit4] 2> at sun.misc.Unsafe.park(Native Method)
[junit4] 2> - timed waiting on java.util.concurrent.locks.AbstractQueuedSynchronizer$ConditionObject@167137d
[junit4] 2> at java.util.concurrent.locks.LockSupport.parkNanos(LockSupport.java:215)
[junit4] 2> at java.util.concurrent.locks.AbstractQueuedSynchronizer$ConditionObject.awaitNanos(AbstractQueuedSynchronizer.java:2078)
[junit4] 2> at org.eclipse.jetty.util.BlockingArrayQueue.poll(BlockingArrayQueue.java:392)
[junit4] 2> at org.eclipse.jetty.util.thread.QueuedThreadPool.idleJobPoll(QueuedThreadPool.java:563)
[junit4] 2> at org.eclipse.jetty.util.thread.QueuedThreadPool.access$800(QueuedThreadPool.java:48)
[junit4] 2> at org.eclipse.jetty.util.thread.QueuedThreadPool$2.run(QueuedThreadPool.java:626)
[junit4] 2> at java.lang.Thread.run(Thread.java:745)
[junit4] 2>
[junit4] 2> "qtp15523365-3291" ID=3291 TIMED_WAITING on java.util.concurrent.locks.AbstractQueuedSynchronizer$ConditionObject@167137d
[junit4] 2> at sun.misc.Unsafe.park(Native Method)
[junit4] 2> - timed waiting on java.util.concurrent.locks.AbstractQueuedSynchronizer$ConditionObject@167137d
[junit4] 2> at java.util.concurrent.locks.LockSupport.parkNanos(LockSupport.java:215)
[junit4] 2> at java.util.concurrent.locks.AbstractQueuedSynchronizer$ConditionObject.awaitNanos(AbstractQueuedSynchronizer.java:2078)
[junit4] 2> at org.eclipse.jetty.util.BlockingArrayQueue.poll(BlockingArrayQueue.java:392)
[junit4] 2> at org.eclipse.jetty.util.thread.QueuedThreadPool.idleJobPoll(QueuedThreadPool.java:563)
[junit4] 2> at org.eclipse.jetty.util.thread.QueuedThreadPool.access$800(QueuedThreadPool.java:48)
[junit4] 2> at org.eclipse.jetty.util.thread.QueuedThreadPool$2.run(QueuedThreadPool.java:626)
[junit4] 2> at java.lang.Thread.run(Thread.java:745)
[junit4] 2>
[junit4] 2> "qtp15523365-3290" ID=3290 TIMED_WAITING on java.util.concurrent.locks.AbstractQueuedSynchronizer$ConditionObject@167137d
[junit4] 2> at sun.misc.Unsafe.park(Native Method)
[junit4] 2> - timed waiting on java.util.concurrent.locks.AbstractQueuedSynchronizer$ConditionObject@167137d
[junit4] 2> at java.util.concurrent.locks.LockSupport.parkNanos(LockSupport.java:215)
[junit4] 2> at java.util.concurrent.locks.AbstractQueuedSynchronizer$ConditionObject.awaitNanos(AbstractQueuedSynchronizer.java:2078)
[junit4] 2> at org.eclipse.jetty.util.BlockingArrayQueue.poll(BlockingArrayQueue.java:392)
[junit4] 2> at org.eclipse.jetty.util.thread.QueuedThreadPool.idleJobPoll(QueuedThreadPool.java:563)
[junit4] 2> at org.eclipse.jetty.util.thread.QueuedThreadPool.access$800(QueuedThreadPool.java:48)
[junit4] 2> at org.eclipse.jetty.util.thread.QueuedThreadPool$2.run(QueuedThreadPool.java:626)
[junit4] 2> at java.lang.Thread.run(Thread.java:745)
[junit4] 2>
[junit4] 2> "qtp15523365-3289" ID=3289 RUNNABLE (in native code)
[junit4] 2> at sun.nio.ch.WindowsSelectorImpl$SubSelector.poll0(Native Method)
[junit4] 2> at sun.nio.ch.WindowsSelectorImpl$SubSelector.poll(WindowsSelectorImpl.java:296)
[junit4] 2> at sun.nio.ch.WindowsSelectorImpl$SubSelector.access$400(WindowsSelectorImpl.java:278)
[junit4] 2> at sun.nio.ch.WindowsSelectorImpl.doSelect(WindowsSelectorImpl.java:159)
[junit4] 2> at sun.nio.ch.SelectorImpl.lockAndDoSelect(SelectorImpl.java:86)
[junit4] 2> - locked sun.nio.ch.Util$3@110414b
[junit4] 2> - locked java.util.Collections$UnmodifiableSet@27654e
[junit4] 2> - locked sun.nio.ch.WindowsSelectorImpl@1ba9885
[junit4] 2> at sun.nio.ch.SelectorImpl.select(SelectorImpl.java:97)
[junit4] 2> at sun.nio.ch.SelectorImpl.select(SelectorImpl.java:101)
[junit4] 2> at org.eclipse.jetty.io.ManagedSelector$SelectorProducer.select(ManagedSelector.java:243)
[junit4] 2> at org.eclipse.jetty.io.ManagedSelector$SelectorProducer.produce(ManagedSelector.java:191)
[junit4] 2> at org.eclipse.jetty.util.thread.strategy.ExecuteProduceConsume.executeProduceConsume(ExecuteProduceConsume.java:249)
[junit4] 2> at org.eclipse.jetty.util.thread.strategy.ExecuteProduceConsume.produceConsume(ExecuteProduceConsume.java:148)
[junit4] 2> at org.eclipse.jetty.util.thread.strategy.ExecuteProduceConsume.execute(ExecuteProduceConsume.java:100)
[junit4] 2> at org.eclipse.jetty.io.ManagedSelector.run(ManagedSelector.java:147)
[junit4] 2> at org.eclipse.jetty.util.thread.QueuedThreadPool.runJob(QueuedThreadPool.java:671)
[junit4] 2> at org.eclipse.jetty.util.thread.QueuedThreadPool$2.run(QueuedThreadPool.java:589)
[junit4] 2> at java.lang.Thread.run(Thread.java:745)
[junit4] 2>
[junit4] 2> "qtp15523365-3288-acceptor-0@18e63d6-ServerConnector@14ec429{HTTP/1.1,[http/1.1]}{127.0.0.1:61853}" ID=3288 RUNNABLE (in native code)
[junit4] 2> at sun.nio.ch.ServerSocketChannelImpl.accept0(Native Method)
[junit4] 2> at sun.nio.ch.ServerSocketChannelImpl.accept(ServerSocketChannelImpl.java:422)
[junit4] 2> at sun.nio.ch.ServerSocketChannelImpl.accept(ServerSocketChannelImpl.java:250)
[junit4] 2> - locked java.lang.Object@639b74
[junit4] 2> at org.eclipse.jetty.server.ServerConnector.accept(ServerConnector.java:373)
[junit4] 2> at org.eclipse.jetty.server.AbstractConnector$Acceptor.run(AbstractConnector.java:601)
[junit4] 2> at org.eclipse.jetty.util.thread.QueuedThreadPool.runJob(QueuedThreadPool.java:671)
[junit4] 2> at org.eclipse.jetty.util.thread.QueuedThreadPool$2.run(QueuedThreadPool.java:589)
[junit4] 2> at java.lang.Thread.run(Thread.java:745)
[junit4] 2>
[junit4] 2> "TEST-TestSolrCLIRunExample.testSchemalessExample-seed#[CD8A442CEDB674C]" ID=3285 TIMED_WAITING
[junit4] 2> at java.lang.Thread.sleep(Native Method)
[junit4] 2> at org.apache.commons.exec.DefaultExecuteResultHandler.waitFor(DefaultExecuteResultHandler.java:121)
[junit4] 2> at org.apache.solr.util.SolrCLI$RunExampleTool.startSolr(SolrCLI.java:2937)
[junit4] 2> at org.apache.solr.util.SolrCLI$RunExampleTool.runExample(SolrCLI.java:2649)
[junit4] 2> at org.apache.solr.util.SolrCLI$RunExampleTool.runImpl(SolrCLI.java:2615)
[junit4] 2> at org.apache.solr.util.SolrCLI$ToolBase.runTool(SolrCLI.java:154)
[junit4] 2> at org.apache.solr.util.TestSolrCLIRunExample.testExample(TestSolrCLIRunExample.java:336)
[junit4] 2> at org.apache.solr.util.TestSolrCLIRunExample.testSchemalessExample(TestSolrCLIRunExample.java:300)
[junit4] 2> at sun.reflect.NativeMethodAccessorImpl.invoke0(Native Method)
[junit4] 2> at sun.reflect.NativeMethodAccessorImpl.invoke(NativeMethodAccessorImpl.java:62)
[junit4] 2> at sun.reflect.DelegatingMethodAccessorImpl.invoke(DelegatingMethodAccessorImpl.java:43)
[junit4] 2> at java.lang.reflect.Method.invoke(Method.java:498)
[junit4] 2> at com.carrotsearch.randomizedtesting.RandomizedRunner.invoke(RandomizedRunner.java:1713)
[junit4] 2> at com.carrotsearch.randomizedtesting.RandomizedRunner$8.evaluate(RandomizedRunner.java:907)
[junit4] 2> at com.carrotsearch.randomizedtesting.RandomizedRunner$9.evaluate(RandomizedRunner.java:943)
[junit4] 2> at com.carrotsearch.randomizedtesting.RandomizedRunner$10.evaluate(RandomizedRunner.java:957)
[junit4] 2> at com.carrotsearch.randomizedtesting.rules.SystemPropertiesRestoreRule$1.evaluate(SystemPropertiesRestoreRule.java:57)
[junit4] 2> at org.apache.lucene.util.TestRuleSetupTeardownChained$1.evaluate(TestRuleSetupTeardownChained.java:49)
[junit4] 2> at org.apache.lucene.util.AbstractBeforeAfterRule$1.evaluate(AbstractBeforeAfterRule.java:45)
[junit4] 2> at org.apache.lucene.util.TestRuleThreadAndTestName$1.evaluate(TestRuleThreadAndTestName.java:48)
[junit4] 2> at org.apache.lucene.util.TestRuleIgnoreAfterMaxFailures$1.evaluate(TestRuleIgnoreAfterMaxFailures.java:64)
[junit4] 2> at org.apache.lucene.util.TestRuleMarkFailure$1.evaluate(TestRuleMarkFailure.java:47)
[junit4] 2> at com.carrotsearch.randomizedtesting.rules.StatementAdapter.evaluate(StatementAdapter.java:36)
[junit4] 2> at com.carrotsearch.randomizedtesting.ThreadLeakControl$StatementRunner.run(ThreadLeakControl.java:368)
[junit4] 2> at com.carrotsearch.randomizedtesting.ThreadLeakControl.forkTimeoutingTask(ThreadLeakControl.java:817)
[junit4] 2> at com.carrotsearch.randomizedtesting.ThreadLeakControl$3.evaluate(ThreadLeakControl.java:468)
[junit4] 2> at com.carrotsearch.randomizedtesting.RandomizedRunner.runSingleTest(RandomizedRunner.java:916)
[junit4] 2> at com.carrotsearch.randomizedtesting.RandomizedRunner$5.evaluate(RandomizedRunner.java:802)
[junit4] 2> at com.carrotsearch.randomizedtesting.RandomizedRunner$6.evaluate(RandomizedRunner.java:852)
[junit4] 2> at com.carrotsearch.randomizedtesting.RandomizedRunner$7.evaluate(RandomizedRunner.java:863)
[junit4] 2> at com.carrotsearch.randomizedtesting.rules.StatementAdapter.evaluate(StatementAdapter.java:36)
[junit4] 2> at com.carrotsearch.randomizedtesting.rules.SystemPropertiesRestoreRule$1.evaluate(SystemPropertiesRestoreRule.java:57)
[junit4] 2> at org.apache.lucene.util.AbstractBeforeAfterRule$1.evaluate(AbstractBeforeAfterRule.java:45)
[junit4] 2> at com.carrotsearch.randomizedtesting.rules.StatementAdapter.evaluate(StatementAdapter.java:36)
[junit4] 2> at org.apache.lucene.util.TestRuleStoreClassName$1.evaluate(TestRuleStoreClassName.java:41)
[junit4] 2> at com.carrotsearch.randomizedtesting.rules.NoShadowingOrOverridesOnMethodsRule$1.evaluate(NoShadowingOrOverridesOnMethodsRule.java:40)
[junit4] 2> at com.carrotsearch.randomizedtesting.rules.NoShadowingOrOverridesOnMethodsRule$1.evaluate(NoShadowingOrOverridesOnMethodsRule.java:40)
[junit4] 2> at com.carrotsearch.randomizedtesting.rules.StatementAdapter.evaluate(StatementAdapter.java:36)
[junit4] 2> at com.carrotsearch.randomizedtesting.rules.StatementAdapter.evaluate(StatementAdapter.java:36)
[junit4] 2> at com.carrotsearch.randomizedtesting.rules.StatementAdapter.evaluate(StatementAdapter.java:36)
[junit4] 2> at org.apache.lucene.util.TestRuleAssertionsRequired$1.evaluate(TestRuleAssertionsRequired.java:53)
[junit4] 2> at org.apache.lucene.util.TestRuleMarkFailure$1.evaluate(TestRuleMarkFailure.java:47)
[junit4] 2> at org.apache.lucene.util.TestRuleIgnoreAfterMaxFailures$1.evaluate(TestRuleIgnoreAfterMaxFailures.java:64)
[junit4] 2> at org.apache.lucene.util.TestRuleIgnoreTestSuites$1.evaluate(TestRuleIgnoreTestSuites.java:54)
[junit4] 2> at com.carrotsearch.randomizedtesting.rules.StatementAdapter.evaluate(StatementAdapter.java:36)
[junit4] 2> at com.carrotsearch.randomizedtesting.ThreadLeakControl$StatementRunner.run(ThreadLeakControl.java:368)
[junit4] 2> at java.lang.Thread.run(Thread.java:745)
[junit4] 2>
[junit4] 2> "SUITE-TestSolrCLIRunExample-seed#[CD8A442CEDB674C]" ID=3284 RUNNABLE
[junit4] 2> at sun.management.ThreadImpl.dumpThreads0(Native Method)
[junit4] 2> at sun.management.ThreadImpl.dumpAllThreads(ThreadImpl.java:454)
[junit4] 2> at com.carrotsearch.randomizedtesting.ThreadLeakControl.formatThreadStacksFull(ThreadLeakControl.java:681)
[junit4] 2> at com.carrotsearch.randomizedtesting.ThreadLeakControl.access$1000(ThreadLeakControl.java:65)
[junit4] 2> at com.carrotsearch.randomizedtesting.ThreadLeakControl$2.evaluate(ThreadLeakControl.java:415)
[junit4] 2> - locked java.lang.Object@15e98ea
[junit4] 2> at com.carrotsearch.randomizedtesting.RandomizedRunner.runSuite(RandomizedRunner.java:678)
[junit4] 2> at com.carrotsearch.randomizedtesting.RandomizedRunner.access$200(RandomizedRunner.java:140)
[junit4] 2> at com.carrotsearch.randomizedtesting.RandomizedRunner$2.run(RandomizedRunner.java:598)
[junit4] 2>
[junit4] 2> "SeedGenerator Thread" ID=14 WAITING on sun.security.provider.SeedGenerator$ThreadedSeedGenerator@3a849a
[junit4] 2> at java.lang.Object.wait(Native Method)
[junit4] 2> - waiting on sun.security.provider.SeedGenerator$ThreadedSeedGenerator@3a849a
[junit4] 2> at java.lang.Object.wait(Object.java:502)
[junit4] 2> at sun.security.provider.SeedGenerator$ThreadedSeedGenerator.run(SeedGenerator.java:334)
[junit4] 2> at java.lang.Thread.run(Thread.java:745)
[junit4] 2>
[junit4] 2> "JUnit4-serializer-daemon" ID=10 TIMED_WAITING
[junit4] 2> at java.lang.Thread.sleep(Native Method)
[junit4] 2> at com.carrotsearch.ant.tasks.junit4.events.Serializer$1.run(Serializer.java:50)
[junit4] 2>
[junit4] 2> "Attach Listener" ID=6 RUNNABLE
[junit4] 2>
[junit4] 2> "Signal Dispatcher" ID=5 RUNNABLE
[junit4] 2>
[junit4] 2> "Finalizer" ID=3 WAITING on java.lang.ref.ReferenceQueue$Lock@1b343a8
[junit4] 2> at java.lang.Object.wait(Native Method)
[junit4] 2> - waiting on java.lang.ref.ReferenceQueue$Lock@1b343a8
[junit4] 2> at java.lang.ref.ReferenceQueue.remove(ReferenceQueue.java:143)
[junit4] 2> at java.lang.ref.ReferenceQueue.remove(ReferenceQueue.java:164)
[junit4] 2> at java.lang.ref.Finalizer$FinalizerThread.run(Finalizer.java:209)
[junit4] 2>
[junit4] 2> "Reference Handler" ID=2 WAITING on java.lang.ref.Reference$Lock@111d711
[junit4] 2> at java.lang.Object.wait(Native Method)
[junit4] 2> - waiting on java.lang.ref.Reference$Lock@111d711
[junit4] 2> at java.lang.Object.wait(Object.java:502)
[junit4] 2> at java.lang.ref.Reference.tryHandlePending(Reference.java:191)
[junit4] 2> at java.lang.ref.Reference$ReferenceHandler.run(Reference.java:153)
[junit4] 2>
[junit4] 2> "main" ID=1 WAITING on com.carrotsearch.randomizedtesting.RandomizedRunner$2@2b43f
[junit4] 2> at java.lang.Object.wait(Native Method)
[junit4] 2> - waiting on com.carrotsearch.randomizedtesting.RandomizedRunner$2@2b43f
[junit4] 2> at java.lang.Thread.join(Thread.java:1249)
[junit4] 2> at java.lang.Thread.join(Thread.java:1323)
[junit4] 2> at com.carrotsearch.randomizedtesting.RandomizedRunner.runSuite(RandomizedRunner.java:608)
[junit4] 2> at com.carrotsearch.randomizedtesting.RandomizedRunner.run(RandomizedRunner.java:457)
[junit4] 2> at com.carrotsearch.ant.tasks.junit4.slave.SlaveMain.execute(SlaveMain.java:244)
[junit4] 2> at com.carrotsearch.ant.tasks.junit4.slave.SlaveMain.main(SlaveMain.java:355)
[junit4] 2> at com.carrotsearch.ant.tasks.junit4.slave.SlaveMainSafe.main(SlaveMainSafe.java:13)
[junit4] 2>
[junit4] 2> ^^==============================================
[junit4] 2>
[junit4] 2> NOTE: reproduce with: ant test -Dtestcase=TestSolrCLIRunExample -Dtests.method=testSchemalessExample -Dtests.seed=CD8A442CEDB674C -Dtests.slow=true -Dtests.locale=id -Dtests.timezone=Africa/Ceuta -Dtests.asserts=true -Dtests.file.encoding=ISO-8859-1
[junit4] ERROR 7199s J1 | TestSolrCLIRunExample.testSchemalessExample <<<
[junit4] > Throwable #1: java.lang.Exception: Test abandoned because suite timeout was reached.
[junit4] > at __randomizedtesting.SeedInfo.seed([CD8A442CEDB674C]:0)
[junit4] 2> Apr 04, 2017 4:44:23 AM com.carrotsearch.randomizedtesting.ThreadLeakControl checkThreadLeaks
[junit4] 2> WARNING: Will linger awaiting termination of 13 leaked thread(s).
[junit4] 2> Apr 04, 2017 4:44:43 AM com.carrotsearch.randomizedtesting.ThreadLeakControl checkThreadLeaks
[junit4] 2> SEVERE: 13 threads leaked from SUITE scope at org.apache.solr.util.TestSolrCLIRunExample:
[junit4] 2> 1) Thread[id=3291, name=qtp15523365-3291, state=TIMED_WAITING, group=TGRP-TestSolrCLIRunExample]
[junit4] 2> at sun.misc.Unsafe.park(Native Method)
[junit4] 2> at java.util.concurrent.locks.LockSupport.parkNanos(LockSupport.java:215)
[junit4] 2> at java.util.concurrent.locks.AbstractQueuedSynchronizer$ConditionObject.awaitNanos(AbstractQueuedSynchronizer.java:2078)
[junit4] 2> at org.eclipse.jetty.util.BlockingArrayQueue.poll(BlockingArrayQueue.java:392)
[junit4] 2> at org.eclipse.jetty.util.thread.QueuedThreadPool.idleJobPoll(QueuedThreadPool.java:563)
[junit4] 2> at org.eclipse.jetty.util.thread.QueuedThreadPool.access$800(QueuedThreadPool.java:48)
[junit4] 2> at org.eclipse.jetty.util.thread.QueuedThreadPool$2.run(QueuedThreadPool.java:626)
[junit4] 2> at java.lang.Thread.run(Thread.java:745)
[junit4] 2> 2) Thread[id=3293, name=qtp15523365-3293, state=TIMED_WAITING, group=TGRP-TestSolrCLIRunExample]
[junit4] 2> at sun.misc.Unsafe.park(Native Method)
[junit4] 2> at java.util.concurrent.locks.LockSupport.parkNanos(LockSupport.java:215)
[junit4] 2> at java.util.concurrent.locks.AbstractQueuedSynchronizer$ConditionObject.awaitNanos(AbstractQueuedSynchronizer.java:2078)
[junit4] 2> at org.eclipse.jetty.util.BlockingArrayQueue.poll(BlockingArrayQueue.java:392)
[junit4] 2> at org.eclipse.jetty.util.thread.QueuedThreadPool.idleJobPoll(QueuedThreadPool.java:563)
[junit4] 2> at org.eclipse.jetty.util.thread.QueuedThreadPool.access$800(QueuedThreadPool.java:48)
[junit4] 2> at org.eclipse.jetty.util.thread.QueuedThreadPool$2.run(QueuedThreadPool.java:626)
[junit4] 2> at java.lang.Thread.run(Thread.java:745)
[junit4] 2> 3) Thread[id=3295, name=qtp15523365-3295, state=TIMED_WAITING, group=TGRP-TestSolrCLIRunExample]
[junit4] 2> at sun.misc.Unsafe.park(Native Method)
[junit4] 2> at java.util.concurrent.locks.LockSupport.parkNanos(LockSupport.java:215)
[junit4] 2> at java.util.concurrent.locks.AbstractQueuedSynchronizer$ConditionObject.awaitNanos(AbstractQueuedSynchronizer.java:2078)
[junit4] 2> at org.eclipse.jetty.util.BlockingArrayQueue.poll(BlockingArrayQueue.java:392)
[junit4] 2> at org.eclipse.jetty.util.thread.QueuedThreadPool.idleJobPoll(QueuedThreadPool.java:563)
[junit4] 2> at org.eclipse.jetty.util.thread.QueuedThreadPool.access$800(QueuedThreadPool.java:48)
[junit4] 2> at org.eclipse.jetty.util.thread.QueuedThreadPool$2.run(QueuedThreadPool.java:626)
[junit4] 2> at java.lang.Thread.run(Thread.java:745)
[junit4] 2> 4) Thread[id=3299, name=Thread-767, state=WAITING, group=TGRP-TestSolrCLIRunExample]
[junit4] 2> at java.lang.Object.wait(Native Method)
[junit4] 2> at java.lang.Object.wait(Object.java:502)
[junit4] 2> at org.apache.solr.core.CloserThread.run(CoreContainer.java:1510)
[junit4] 2> 5) Thread[id=3290, name=qtp15523365-3290, state=TIMED_WAITING, group=TGRP-TestSolrCLIRunExample]
[junit4] 2> at sun.misc.Unsafe.park(Native Method)
[junit4] 2> at java.util.concurrent.locks.LockSupport.parkNanos(LockSupport.java:215)
[junit4] 2> at java.util.concurrent.locks.AbstractQueuedSynchronizer$ConditionObject.awaitNanos(AbstractQueuedSynchronizer.java:2078)
[junit4] 2> at org.eclipse.jetty.util.BlockingArrayQueue.poll(BlockingArrayQueue.java:392)
[junit4] 2> at org.eclipse.jetty.util.thread.QueuedThreadPool.idleJobPoll(QueuedThreadPool.java:563)
[junit4] 2> at org.eclipse.jetty.util.thread.QueuedThreadPool.access$800(QueuedThreadPool.java:48)
[junit4] 2> at org.eclipse.jetty.util.thread.QueuedThreadPool$2.run(QueuedThreadPool.java:626)
[junit4] 2> at java.lang.Thread.run(Thread.java:745)
[junit4] 2> 6) Thread[id=3294, name=qtp15523365-3294, state=TIMED_WAITING, group=TGRP-TestSolrCLIRunExample]
[junit4] 2> at sun.misc.Unsafe.park(Native Method)
[junit4] 2> at java.util.concurrent.locks.LockSupport.parkNanos(LockSupport.java:215)
[junit4] 2> at java.util.concurrent.locks.AbstractQueuedSynchronizer$ConditionObject.awaitNanos(AbstractQueuedSynchronizer.java:2078)
[junit4] 2> at org.eclipse.jetty.util.BlockingArrayQueue.poll(BlockingArrayQueue.java:392)
[junit4] 2> at org.eclipse.jetty.util.thread.QueuedThreadPool.idleJobPoll(QueuedThreadPool.java:563)
[junit4] 2> at org.eclipse.jetty.util.thread.QueuedThreadPool.access$800(QueuedThreadPool.java:48)
[junit4] 2> at org.eclipse.jetty.util.thread.QueuedThreadPool$2.run(QueuedThreadPool.java:626)
[junit4] 2> at java.lang.Thread.run(Thread.java:745)
[junit4] 2> 7) Thread[id=3297, name=Connection evictor, state=TIMED_WAITING, group=TGRP-TestSolrCLIRunExample]
[junit4] 2> at java.lang.Thread.sleep(Native Method)
[junit4] 2> at org.apache.http.impl.client.IdleConnectionEvictor$1.run(IdleConnectionEvictor.java:66)
[junit4] 2> at java.lang.Thread.run(Thread.java:745)
[junit4] 2> 8) Thread[id=3288, name=qtp15523365-3288-acceptor-0@18e63d6-ServerConnector@14ec429{HTTP/1.1,[http/1.1]}{127.0.0.1:61853}, state=RUNNABLE, group=TGRP-TestSolrCLIRunExample]
[junit4] 2> at sun.nio.ch.ServerSocketChannelImpl.accept0(Native Method)
[junit4] 2> at sun.nio.ch.ServerSocketChannelImpl.accept(ServerSocketChannelImpl.java:422)
[junit4] 2> at sun.nio.ch.ServerSocketChannelImpl.accept(ServerSocketChannelImpl.java:250)
[junit4] 2> at org.eclipse.jetty.server.ServerConnector.accept(ServerConnector.java:373)
[junit4] 2> at org.eclipse.jetty.server.AbstractConnector$Acceptor.run(AbstractConnector.java:601)
[junit4] 2> at org.eclipse.jetty.util.thread.QueuedThreadPool.runJob(QueuedThreadPool.java:671)
[junit4] 2> at org.eclipse.jetty.util.thread.QueuedThreadPool$2.run(QueuedThreadPool.java:589)
[junit4] 2> at java.lang.Thread.run(Thread.java:745)
[junit4] 2> 9) Thread[id=3296, name=org.eclipse.jetty.server.session.HashSessionManager@112c502Timer, state=TIMED_WAITING, group=TGRP-TestSolrCLIRunExample]
[junit4] 2> at sun.misc.Unsafe.park(Native Method)
[junit4] 2> at java.util.concurrent.locks.LockSupport.parkNanos(LockSupport.java:215)
[junit4] 2> at java.util.concurrent.locks.AbstractQueuedSynchronizer$ConditionObject.awaitNanos(AbstractQueuedSynchronizer.java:2078)
[junit4] 2> at java.util.concurrent.ScheduledThreadPoolExecutor$DelayedWorkQueue.take(ScheduledThreadPoolExecutor.java:1093)
[junit4] 2> at java.util.concurrent.ScheduledThreadPoolExecutor$DelayedWorkQueue.take(ScheduledThreadPoolExecutor.java:809)
[junit4] 2> at java.util.concurrent.ThreadPoolExecutor.getTask(ThreadPoolExecutor.java:1067)
[junit4] 2> at java.util.concurrent.ThreadPoolExecutor.runWorker(ThreadPoolExecutor.java:1127)
[junit4] 2> at java.util.concurrent.ThreadPoolExecutor$Worker.run(ThreadPoolExecutor.java:617)
[junit4] 2> at java.lang.Thread.run(Thread.java:745)
[junit4] 2> 10) Thread[id=3285, name=TEST-TestSolrCLIRunExample.testSchemalessExample-seed#[CD8A442CEDB674C], state=TIMED_WAITING, group=TGRP-TestSolrCLIRunExample]
[junit4] 2> at java.lang.Thread.sleep(Native Method)
[junit4] 2> at org.apache.commons.exec.DefaultExecuteResultHandler.waitFor(DefaultExecuteResultHandler.java:121)
[junit4] 2> at org.apache.solr.util.SolrCLI$RunExampleTool.startSolr(SolrCLI.java:2937)
[junit4] 2> at org.apache.solr.util.SolrCLI$RunExampleTool.runExample(SolrCLI.java:2649)
[junit4] 2> at org.apache.solr.util.SolrCLI$RunExampleTool.runImpl(SolrCLI.java:2615)
[junit4] 2> at org.apache.solr.util.SolrCLI$ToolBase.runTool(SolrCLI.java:154)
[junit4] 2> at org.apache.solr.util.TestSolrCLIRunExample.testExample(TestSolrCLIRunExample.java:336)
[junit4] 2> at org.apache.solr.util.TestSolrCLIRunExample.testSchemalessExample(TestSolrCLIRunExample.java:300)
[junit4] 2> at sun.reflect.NativeMethodAccessorImpl.invoke0(Native Method)
[junit4] 2> at sun.reflect.NativeMethodAccessorImpl.invoke(NativeMethodAccessorImpl.java:62)
[junit4] 2> at sun.reflect.DelegatingMethodAccessorImpl.invoke(DelegatingMethodAccessorImpl.java:43)
[junit4] 2> at java.lang.reflect.Method.invoke(Method.java:498)
[junit4] 2> at com.carrotsearch.randomizedtesting.RandomizedRunner.invoke(RandomizedRunner.java:1713)
[junit4] 2> at com.carrotsearch.randomizedtesting.RandomizedRunner$8.evaluate(RandomizedRunner.java:907)
[junit4] 2> at com.carrotsearch.randomizedtesting.RandomizedRunner$9.evaluate(RandomizedRunner.java:943)
[junit4] 2> at com.carrotsearch.randomizedtesting.RandomizedRunner$10.evaluate(RandomizedRunner.java:957)
[junit4] 2> at com.carrotsearch.randomizedtesting.rules.SystemPropertiesRestoreRule$1.evaluate(SystemPropertiesRestoreRule.java:57)
[junit4] 2> at org.apache.lucene.util.TestRuleSetupTeardownChained$1.evaluate(TestRuleSetupTeardownChained.java:49)
[junit4] 2> at org.apache.lucene.util.AbstractBeforeAfterRule$1.evaluate(AbstractBeforeAfterRule.java:45)
[junit4] 2> at org.apache.lucene.util.TestRuleThreadAndTestName$1.evaluate(TestRuleThreadAndTestName.java:48)
[junit4] 2> at org.apache.lucene.util.TestRuleIgnoreAfterMaxFailures$1.evaluate(TestRuleIgnoreAfterMaxFailures.java:64)
[junit4] 2> at org.apache.lucene.util.TestRuleMarkFailure$1.evaluate(TestRuleMarkFailure.java:47)
[junit4] 2> at com.carrotsearch.randomizedtesting.rules.StatementAdapter.evaluate(StatementAdapter.java:36)
[junit4] 2> at com.carrotsearch.randomizedtesting.ThreadLeakControl$StatementRunner.run(ThreadLeakControl.java:368)
[junit4] 2> at com.carrotsearch.randomizedtesting.ThreadLeakControl.forkTimeoutingTask(ThreadLeakControl.java:817)
[junit4] 2> at com.carrotsearch.randomizedtesting.ThreadLeakControl$3.evaluate(ThreadLeakControl.java:468)
[junit4] 2> at com.carrotsearch.randomizedtesting.RandomizedRunner.runSingleTest(RandomizedRunner.java:916)
[junit4] 2> at com.carrotsearch.randomizedtesting.RandomizedRunner$5.evaluate(RandomizedRunner.java:802)
[junit4] 2> at com.carrotsearch.randomizedtesting.RandomizedRunner$6.evaluate(RandomizedRunner.java:852)
[junit4] 2> at com.carrotsearch.randomizedtesting.RandomizedRunner$7.evaluate(RandomizedRunner.java:863)
[junit4] 2> at com.carrotsearch.randomizedtesting.rules.StatementAdapter.evaluate(StatementAdapter.java:36)
[junit4] 2> at com.carrotsearch.randomizedtesting.rules.SystemPropertiesRestoreRule$1.evaluate(SystemPropertiesRestoreRule.java:57)
[junit4] 2> at org.apache.lucene.util.AbstractBeforeAfterRule$1.evaluate(AbstractBeforeAfterRule.java:45)
[junit4] 2> at com.carrotsearch.randomizedtesting.rules.StatementAdapter.evaluate(StatementAdapter.java:36)
[junit4] 2> at org.apache.lucene.util.TestRuleStoreClassName$1.evaluate(TestRuleStoreClassName.java:41)
[junit4] 2> at com.carrotsearch.randomizedtesting.rules.NoShadowingOrOverridesOnMethodsRule$1.evaluate(NoShadowingOrOverridesOnMethodsRule.java:40)
[junit4] 2> at com.carrotsearch.randomizedtesting.rules.NoShadowingOrOverridesOnMethodsRule$1.evaluate(NoShadowingOrOverridesOnMethodsRule.java:40)
[junit4] 2> at com.carrotsearch.randomizedtesting.rules.StatementAdapter.evaluate(StatementAdapter.java:36)
[junit4] 2> at com.carrotsearch.randomizedtesting.rules.StatementAdapter.evaluate(StatementAdapter.java:36)
[junit4] 2> at com.carrotsearch.randomizedtesting.rules.StatementAdapter.evaluate(StatementAdapter.java:36)
[junit4] 2> at org.apache.lucene.util.TestRuleAssertionsRequired$1.evaluate(TestRuleAssertionsRequired.java:53)
[junit4] 2> at org.apache.lucene.util.TestRuleMarkFailure$1.evaluate(TestRuleMarkFailure.java:47)
[junit4] 2> at org.apache.lucene.util.TestRuleIgnoreAfterMaxFailures$1.evaluate(TestRuleIgnoreAfterMaxFailures.java:64)
[junit4] 2> at org.apache.lucene.util.TestRuleIgnoreTestSuites$1.evaluate(TestRuleIgnoreTestSuites.java:54)
[junit4] 2> at com.carrotsearch.randomizedtesting.rules.StatementAdapter.evaluate(StatementAdapter.java:36)
[junit4] 2> at com.carrotsearch.randomizedtesting.ThreadLeakControl$StatementRunner.run(ThreadLeakControl.java:368)
[junit4] 2> at java.lang.Thread.run(Thread.java:745)
[junit4] 2> 11) Thread[id=3292, name=qtp15523365-3292, state=TIMED_WAITING, group=TGRP-TestSolrCLIRunExample]
[junit4] 2> at sun.misc.Unsafe.park(Native Method)
[junit4] 2> at java.util.concurrent.locks.LockSupport.parkNanos(LockSupport.java:215)
[junit4] 2> at java.util.concurrent.locks.AbstractQueuedSynchronizer$ConditionObject.awaitNanos(AbstractQueuedSynchronizer.java:2078)
[junit4] 2> at org.eclipse.jetty.util.BlockingArrayQueue.poll(BlockingArrayQueue.java:392)
[junit4] 2> at org.eclipse.jetty.util.thread.QueuedThreadPool.idleJobPoll(QueuedThreadPool.java:563)
[junit4] 2> at org.eclipse.jetty.util.thread.QueuedThreadPool.access$800(QueuedThreadPool.java:48)
[junit4] 2> at org.eclipse.jetty.util.thread.QueuedThreadPool$2.run(QueuedThreadPool.java:626)
[junit4] 2> at java.lang.Thread.run(Thread.java:745)
[junit4] 2> 12) Thread[id=3289, name=qtp15523365-3289, state=RUNNABLE, group=TGRP-TestSolrCLIRunExample]
[junit4] 2> at sun.nio.ch.WindowsSelectorImpl$SubSelector.poll0(Native Method)
[junit4] 2> at sun.nio.ch.WindowsSelectorImpl$SubSelector.poll(WindowsSelectorImpl.java:296)
[junit4] 2> at sun.nio.ch.WindowsSelectorImpl$SubSelector.access$400(WindowsSelectorImpl.java:278)
[junit4] 2> at sun.nio.ch.WindowsSelectorImpl.doSelect(WindowsSelectorImpl.java:159)
[junit4] 2> at sun.nio.ch.SelectorImpl.lockAndDoSelect(SelectorImpl.java:86)
[junit4] 2> at sun.nio.ch.SelectorImpl.select(SelectorImpl.java:97)
[junit4] 2> at sun.nio.ch.SelectorImpl.select(SelectorImpl.java:101)
[junit4] 2> at org.eclipse.jetty.io.ManagedSelector$SelectorProducer.select(ManagedSelector.java:243)
[junit4] 2> at org.eclipse.jetty.io.ManagedSelector$SelectorProducer.produce(ManagedSelector.java:191)
[junit4] 2> at org.eclipse.jetty.util.thread.strategy.ExecuteProduceConsume.executeProduceConsume(ExecuteProduceConsume.java:249)
[junit4] 2> at org.eclipse.jetty.util.thread.strategy.ExecuteProduceConsume.produceConsume(ExecuteProduceConsume.java:148)
[junit4] 2> at org.eclipse.jetty.util.thread.strategy.ExecuteProduceConsume.execute(ExecuteProduceConsume.java:100)
[junit4] 2> at org.eclipse.jetty.io.ManagedSelector.run(ManagedSelector.java:147)
[junit4] 2> at org.eclipse.jetty.util.thread.QueuedThreadPool.runJob(QueuedThreadPool.java:671)
[junit4] 2> at org.eclipse.jetty.util.thread.QueuedThreadPool$2.run(QueuedThreadPool.java:589)
[junit4] 2> at java.lang.Thread.run(Thread.java:745)
[junit4] 2> 13) Thread[id=3298, name=Connection evictor, state=TIMED_WAITING, group=TGRP-TestSolrCLIRunExample]
[junit4] 2> at java.lang.Thread.sleep(Native Method)
[junit4] 2> at org.apache.http.impl.client.IdleConnectionEvictor$1.run(IdleConnectionEvictor.java:66)
[junit4] 2> at java.lang.Thread.run(Thread.java:745)
[junit4] 2> Apr 04, 2017 4:44:43 AM com.carrotsearch.randomizedtesting.ThreadLeakControl tryToInterruptAll
[junit4] 2> INFO: Starting to interrupt leaked threads:
[junit4] 2> 1) Thread[id=3291, name=qtp15523365-3291, state=TIMED_WAITING, group=TGRP-TestSolrCLIRunExample]
[junit4] 2> 2) Thread[id=3293, name=qtp15523365-3293, state=TIMED_WAITING, group=TGRP-TestSolrCLIRunExample]
[junit4] 2> 3) Thread[id=3295, name=qtp15523365-3295, state=TIMED_WAITING, group=TGRP-TestSolrCLIRunExample]
[junit4] 2> 4) Thread[id=3299, name=Thread-767, state=WAITING, group=TGRP-TestSolrCLIRunExample]
[junit4] 2> 5) Thread[id=3290, name=qtp15523365-3290, state=TIMED_WAITING, group=TGRP-TestSolrCLIRunExample]
[junit4] 2> 6) Thread[id=3294, name=qtp15523365-3294, state=TIMED_WAITING, group=TGRP-TestSolrCLIRunExample]
[junit4] 2> 7) Thread[id=3297, name=Connection evictor, state=TIMED_WAITING, group=TGRP-TestSolrCLIRunExample]
[junit4] 2> 8) Thread[id=3288, name=qtp15523365-3288-acceptor-0@18e63d6-ServerConnector@14ec429{HTTP/1.1,[http/1.1]}{127.0.0.1:61853}, state=RUNNABLE, group=TGRP-TestSolrCLIRunExample]
[junit4] 2> 9) Thread[id=3296, name=org.eclipse.jetty.server.session.HashSessionManager@112c502Timer, state=TIMED_WAITING, group=TGRP-TestSolrCLIRunExample]
[junit4] 2> 10) Thread[id=3285, name=TEST-TestSolrCLIRunExample.testSchemalessExample-seed#[CD8A442CEDB674C], state=TIMED_WAITING, group=TGRP-TestSolrCLIRunExample]
[junit4] 2> 11) Thread[id=3292, name=qtp15523365-3292, state=TIMED_WAITING, group=TGRP-TestSolrCLIRunExample]
[junit4] 2> 12) Thread[id=3289, name=qtp15523365-3289, state=RUNNABLE, group=TGRP-TestSolrCLIRunExample]
[junit4] 2> 13) Thread[id=3298, name=Connection evictor, state=TIMED_WAITING, group=TGRP-TestSolrCLIRunExample]
[junit4] 2>
[junit4] 2> ERROR: The process has not exited yet therefore no result is available ...
[junit4] 2>
[junit4] 2> 7664915 INFO (TEST-TestSolrCLIRunExample.testSchemalessExample-seed#[CD8A442CEDB674C]) [ ] o.e.j.s.AbstractConnector Stopped ServerConnector@14ec429{HTTP/1.1,[http/1.1]}{127.0.0.1:61853}
[junit4] 2> 7664917 INFO (TEST-TestSolrCLIRunExample.testSchemalessExample-seed#[CD8A442CEDB674C]) [ ] o.a.s.c.CoreContainer Shutting down CoreContainer instance=23753027
[junit4] 2> 7664917 INFO (TEST-TestSolrCLIRunExample.testSchemalessExample-seed#[CD8A442CEDB674C]) [ ] o.a.s.m.SolrMetricManager Closing metric reporters for registry=solr.node, tag=null
[junit4] 2> 7664917 INFO (TEST-TestSolrCLIRunExample.testSchemalessExample-seed#[CD8A442CEDB674C]) [ ] o.a.s.c.TransientSolrCoreCacheDefault Allocating transient cache for 2147483647 transient cores
[junit4] 2> 7664918 INFO (TEST-TestSolrCLIRunExample.testSchemalessExample-seed#[CD8A442CEDB674C]) [ ] o.e.j.s.h.ContextHandler Stopped o.e.j.s.ServletContextHandler@ab25eb{/solr,null,UNAVAILABLE}
[junit4] 2> 7664919 INFO (TEST-TestSolrCLIRunExample.testSchemalessExample-seed#[CD8A442CEDB674C]) [ ] o.a.s.u.TestSolrCLIRunExample Stopped standalone Solr instance running on port 61853
[junit4] 2> 7664919 INFO (TEST-TestSolrCLIRunExample.testSchemalessExample-seed#[CD8A442CEDB674C]) [ ] o.a.s.SolrTestCaseJ4 ###Ending testSchemalessExample
[junit4] 2> 7664919 INFO (SUITE-TestSolrCLIRunExample-seed#[CD8A442CEDB674C]-worker) [ ] o.a.s.SolrTestCaseJ4 ###deleteCore
[junit4] 2> 7664920 INFO (SUITE-TestSolrCLIRunExample-seed#[CD8A442CEDB674C]-worker) [ ] o.a.s.SolrTestCaseJ4 ------------------------------------------------------- Done waiting for tracked resources to be released
[junit4] 2> Apr 04, 2017 2:44:43 AM com.carrotsearch.randomizedtesting.ThreadLeakControl tryToInterruptAll
[junit4] 2> INFO: All leaked threads terminated.
[junit4] 2> NOTE: test params are: codec=Asserting(Lucene70): {}, docValues:{}, maxPointsInLeafNode=495, maxMBSortInHeap=6.194342993006343, sim=RandomSimilarity(queryNorm=true): {}, locale=id, timezone=Africa/Ceuta
[junit4] 2> NOTE: Windows 10 10.0 x86/Oracle Corporation 1.8.0_121 (32-bit)/cpus=3,threads=1,free=56733944,total=157614080
[junit4] 2> NOTE: All tests run in this JVM: [DistribCursorPagingTest, JsonLoaderTest, HttpSolrCallGetCoreTest, TestSearcherReuse, TestLeaderElectionZkExpiry, TestRangeQuery, TestPHPSerializedResponseWriter, DeleteInactiveReplicaTest, CollectionsAPISolrJTest, HdfsNNFailoverTest, AsyncCallRequestStatusResponseTest, TestFieldCache, TestDistribIDF, TestQuerySenderListener, CollectionsAPIDistributedZkTest, TestFuzzyAnalyzedSuggestions, BJQParserTest, TestUtils, DebugComponentTest, ReturnFieldsTest, TestSolrDeletionPolicy2, SolrInfoMBeanTest, TestSubQueryTransformerCrossCore, ScriptEngineTest, VMParamsZkACLAndCredentialsProvidersTest, TestExactStatsCache, TestDocBasedVersionConstraints, TestLegacyFieldCache, SuggesterWFSTTest, RAMDirectoryFactoryTest, DistributedSuggestComponentTest, RequestHandlersTest, ConvertedLegacyTest, ConfigSetsAPITest, DistributedDebugComponentTest, LeaderFailureAfterFreshStartTest, UpdateParamsTest, TestOmitPositions, TestSha256AuthenticationProvider, TestPushWriter, TestFilteredDocIdSet, TestPathTrie, SuggestComponentContextFilterQueryTest, TestAuthenticationFramework, TestSolrCLIRunExample]
[junit4] 2> NOTE: reproduce with: ant test -Dtestcase=TestSolrCLIRunExample -Dtests.seed=CD8A442CEDB674C -Dtests.slow=true -Dtests.locale=id -Dtests.timezone=Africa/Ceuta -Dtests.asserts=true -Dtests.file.encoding=ISO-8859-1
[junit4] ERROR 0.00s J1 | TestSolrCLIRunExample (suite) <<<
[junit4] > Throwable #1: java.lang.Exception: Suite timeout exceeded (>= 7200000 msec).
[junit4] > at __randomizedtesting.SeedInfo.seed([CD8A442CEDB674C]:0)
[junit4] Completed [572/701 (1!)] on J1 in 7220.27s, 3 tests, 2 errors, 1 skipped <<< FAILURES!
[...truncated 39731 lines...]
Re: [JENKINS] Lucene-Solr-master-Windows (32bit/jdk1.8.0_121) - Build
# 6497 - Unstable!
Posted by Mikhail Khludnev <mk...@apache.org>.
This might be caused by https://issues.apache.org/jira/browse/SOLR-9745
commit. Looking into.
On Tue, Apr 4, 2017 at 6:18 AM, Policeman Jenkins Server <
jenkins@thetaphi.de> wrote:
> Build: https://jenkins.thetaphi.de/job/Lucene-Solr-master-Windows/6497/
> Java: 32bit/jdk1.8.0_121 -server -XX:+UseConcMarkSweepGC
>
> 2 tests failed.
> FAILED: org.apache.solr.util.TestSolrCLIRunExample.testSchemalessExample
>
> Error Message:
> Test abandoned because suite timeout was reached.
>
> Stack Trace:
> java.lang.Exception: Test abandoned because suite timeout was reached.
> at __randomizedtesting.SeedInfo.seed([CD8A442CEDB674C]:0)
>
>
> FAILED: junit.framework.TestSuite.org.apache.solr.util.
> TestSolrCLIRunExample
>
> Error Message:
> Suite timeout exceeded (>= 7200000 msec).
>
> Stack Trace:
> java.lang.Exception: Suite timeout exceeded (>= 7200000 msec).
> at __randomizedtesting.SeedInfo.seed([CD8A442CEDB674C]:0)
>
>
>
>
> Build Log:
> [...truncated 12922 lines...]
> [junit4] Suite: org.apache.solr.util.TestSolrCLIRunExample
> [junit4] 2> Creating dataDir: C:\Users\jenkins\workspace\
> Lucene-Solr-master-Windows\solr\build\solr-core\test\J1\temp\solr.util.
> TestSolrCLIRunExample_CD8A442CEDB674C-001\init-core-data-001
> [junit4] 2> 444682 WARN (SUITE-TestSolrCLIRunExample-seed#[CD8A442CEDB674C]-worker)
> [ ] o.a.s.SolrTestCaseJ4 startTrackingSearchers: numOpens=22 numCloses=22
> [junit4] 2> 444682 INFO (SUITE-TestSolrCLIRunExample-seed#[CD8A442CEDB674C]-worker)
> [ ] o.a.s.SolrTestCaseJ4 Using PointFields
> [junit4] 2> 444697 INFO (SUITE-TestSolrCLIRunExample-seed#[CD8A442CEDB674C]-worker)
> [ ] o.a.s.SolrTestCaseJ4 Randomized ssl (false) and clientAuth (false)
> via: @org.apache.solr.SolrTestCaseJ4$SuppressSSL(bugUrl=
> https://issues.apache.org/jira/browse/SOLR-5776)
> [junit4] 2> 444697 INFO (TEST-TestSolrCLIRunExample.
> testFailExecuteScript-seed#[CD8A442CEDB674C]) [ ] o.a.s.SolrTestCaseJ4
> ###Starting testFailExecuteScript
> [junit4] 2>
> [junit4] 2> ERROR: Failed to start Solr using command:
> C:\Users\jenkins\workspace\Lucene-Solr-master-Windows\
> solr\build\solr-core\test\J1\temp\solr.util.TestSolrCLIRunExample_
> CD8A442CEDB674C-001\tempDir-001\failExecuteScript start -p 61851 -s
> "C:\Users\jenkins\workspace\Lucene-Solr-master-Windows\
> solr\build\solr-core\test\J1\temp\solr.util.TestSolrCLIRunExample_
> CD8A442CEDB674C-001\tempDir-001\techproducts\solr" Exception :
> org.apache.commons.exec.ExecuteException: Execution failed (Exit value:
> -559038737. Caused by java.io.IOException: Cannot run program
> "C:\Users\jenkins\workspace\Lucene-Solr-master-Windows\
> solr\build\solr-core\test\J1\temp\solr.util.TestSolrCLIRunExample_
> CD8A442CEDB674C-001\tempDir-001\failExecuteScript" (in directory "."):
> CreateProcess error=193, %1 is not a valid Win32 application)
> [junit4] 2>
> [junit4] 2> 446243 INFO (TEST-TestSolrCLIRunExample.
> testFailExecuteScript-seed#[CD8A442CEDB674C]) [ ] o.a.s.SolrTestCaseJ4
> ###Ending testFailExecuteScript
> [junit4] 2> 446243 INFO (TEST-TestSolrCLIRunExample.
> testSchemalessExample-seed#[CD8A442CEDB674C]) [ ] o.a.s.SolrTestCaseJ4
> ###Starting testSchemalessExample
> [junit4] 2> 446243 INFO (TEST-TestSolrCLIRunExample.
> testSchemalessExample-seed#[CD8A442CEDB674C]) [ ]
> o.a.s.u.TestSolrCLIRunExample Selected port 61853 to start schemaless
> example Solr instance on ...
> [junit4] 2> 447288 INFO (Thread-758) [ ] o.e.j.s.Server
> jetty-9.3.14.v20161028
> [junit4] 2> 447288 INFO (Thread-758) [ ] o.e.j.s.h.ContextHandler
> Started o.e.j.s.ServletContextHandler@ab25eb{/solr,null,AVAILABLE}
> [junit4] 2> 447288 INFO (Thread-758) [ ]
> o.e.j.s.AbstractConnector Started ServerConnector@14ec429{HTTP/
> 1.1,[http/1.1]}{127.0.0.1:61853}
> [junit4] 2> 447288 INFO (Thread-758) [ ] o.e.j.s.Server Started
> @457411ms
> [junit4] 2> 447288 INFO (Thread-758) [ ]
> o.a.s.c.s.e.JettySolrRunner Jetty properties: {hostContext=/solr,
> hostPort=61853}
> [junit4] 2> 447288 ERROR (Thread-758) [ ]
> o.a.s.s.StartupLoggingUtils Missing Java Option solr.log.dir. Logging may
> be missing or incomplete.
> [junit4] 2> 447288 INFO (Thread-758) [ ]
> o.a.s.s.SolrDispatchFilter ___ _ Welcome to Apache Solr?
> version 7.0.0
> [junit4] 2> 447288 INFO (Thread-758) [ ]
> o.a.s.s.SolrDispatchFilter / __| ___| |_ _ Starting in standalone mode on
> port 61853
> [junit4] 2> 447288 INFO (Thread-758) [ ]
> o.a.s.s.SolrDispatchFilter \__ \/ _ \ | '_| Install dir: null
> [junit4] 2> 447288 INFO (Thread-758) [ ]
> o.a.s.s.SolrDispatchFilter |___/\___/_|_| Start time:
> 2017-04-04T00:44:25.825Z
> [junit4] 2> 447288 INFO (Thread-758) [ ] o.a.s.c.SolrXmlConfig
> Loading container configuration from C:\Users\jenkins\workspace\
> Lucene-Solr-master-Windows\solr\build\solr-core\test\J1\temp\solr.util.
> TestSolrCLIRunExample_CD8A442CEDB674C-001\tempDir-
> 002\schemaless\solr\solr.xml
> [junit4] 2> 447413 INFO (Thread-758) [ ]
> o.a.s.c.CorePropertiesLocator Found 0 core definitions underneath
> C:\Users\jenkins\workspace\Lucene-Solr-master-Windows\
> solr\build\solr-core\test\J1\temp\solr.util.TestSolrCLIRunExample_
> CD8A442CEDB674C-001\tempDir-002\schemaless\solr
> [junit4] 2> Apr 04, 2017 4:44:23 AM com.carrotsearch.
> randomizedtesting.ThreadLeakControl$2 evaluate
> [junit4] 2> WARNING: Suite execution timed out: org.apache.solr.util.
> TestSolrCLIRunExample
> [junit4] 2> ==== jstack at approximately timeout time ====
> [junit4] 2> "Thread-767" ID=3299 WAITING on java.lang.Object@1824857
> [junit4] 2> at java.lang.Object.wait(Native Method)
> [junit4] 2> - waiting on java.lang.Object@1824857
> [junit4] 2> at java.lang.Object.wait(Object.java:502)
> [junit4] 2> at org.apache.solr.core.CloserThread.run(
> CoreContainer.java:1510)
> [junit4] 2>
> [junit4] 2> "Connection evictor" ID=3298 TIMED_WAITING
> [junit4] 2> at java.lang.Thread.sleep(Native Method)
> [junit4] 2> at org.apache.http.impl.client.
> IdleConnectionEvictor$1.run(IdleConnectionEvictor.java:66)
> [junit4] 2> at java.lang.Thread.run(Thread.java:745)
> [junit4] 2>
> [junit4] 2> "Connection evictor" ID=3297 TIMED_WAITING
> [junit4] 2> at java.lang.Thread.sleep(Native Method)
> [junit4] 2> at org.apache.http.impl.client.
> IdleConnectionEvictor$1.run(IdleConnectionEvictor.java:66)
> [junit4] 2> at java.lang.Thread.run(Thread.java:745)
> [junit4] 2>
> [junit4] 2> "org.eclipse.jetty.server.session.HashSessionManager@112c502Timer"
> ID=3296 TIMED_WAITING on java.util.concurrent.locks.
> AbstractQueuedSynchronizer$ConditionObject@30bb94
> [junit4] 2> at sun.misc.Unsafe.park(Native Method)
> [junit4] 2> - timed waiting on java.util.concurrent.locks.
> AbstractQueuedSynchronizer$ConditionObject@30bb94
> [junit4] 2> at java.util.concurrent.locks.
> LockSupport.parkNanos(LockSupport.java:215)
> [junit4] 2> at java.util.concurrent.locks.
> AbstractQueuedSynchronizer$ConditionObject.awaitNanos(
> AbstractQueuedSynchronizer.java:2078)
> [junit4] 2> at java.util.concurrent.
> ScheduledThreadPoolExecutor$DelayedWorkQueue.take(
> ScheduledThreadPoolExecutor.java:1093)
> [junit4] 2> at java.util.concurrent.
> ScheduledThreadPoolExecutor$DelayedWorkQueue.take(
> ScheduledThreadPoolExecutor.java:809)
> [junit4] 2> at java.util.concurrent.
> ThreadPoolExecutor.getTask(ThreadPoolExecutor.java:1067)
> [junit4] 2> at java.util.concurrent.
> ThreadPoolExecutor.runWorker(ThreadPoolExecutor.java:1127)
> [junit4] 2> at java.util.concurrent.
> ThreadPoolExecutor$Worker.run(ThreadPoolExecutor.java:617)
> [junit4] 2> at java.lang.Thread.run(Thread.java:745)
> [junit4] 2>
> [junit4] 2> "qtp15523365-3295" ID=3295 TIMED_WAITING on
> java.util.concurrent.locks.AbstractQueuedSynchronizer$
> ConditionObject@167137d
> [junit4] 2> at sun.misc.Unsafe.park(Native Method)
> [junit4] 2> - timed waiting on java.util.concurrent.locks.
> AbstractQueuedSynchronizer$ConditionObject@167137d
> [junit4] 2> at java.util.concurrent.locks.
> LockSupport.parkNanos(LockSupport.java:215)
> [junit4] 2> at java.util.concurrent.locks.
> AbstractQueuedSynchronizer$ConditionObject.awaitNanos(
> AbstractQueuedSynchronizer.java:2078)
> [junit4] 2> at org.eclipse.jetty.util.BlockingArrayQueue.poll(
> BlockingArrayQueue.java:392)
> [junit4] 2> at org.eclipse.jetty.util.thread.
> QueuedThreadPool.idleJobPoll(QueuedThreadPool.java:563)
> [junit4] 2> at org.eclipse.jetty.util.thread.
> QueuedThreadPool.access$800(QueuedThreadPool.java:48)
> [junit4] 2> at org.eclipse.jetty.util.thread.
> QueuedThreadPool$2.run(QueuedThreadPool.java:626)
> [junit4] 2> at java.lang.Thread.run(Thread.java:745)
> [junit4] 2>
> [junit4] 2> "qtp15523365-3294" ID=3294 TIMED_WAITING on
> java.util.concurrent.locks.AbstractQueuedSynchronizer$
> ConditionObject@167137d
> [junit4] 2> at sun.misc.Unsafe.park(Native Method)
> [junit4] 2> - timed waiting on java.util.concurrent.locks.
> AbstractQueuedSynchronizer$ConditionObject@167137d
> [junit4] 2> at java.util.concurrent.locks.
> LockSupport.parkNanos(LockSupport.java:215)
> [junit4] 2> at java.util.concurrent.locks.
> AbstractQueuedSynchronizer$ConditionObject.awaitNanos(
> AbstractQueuedSynchronizer.java:2078)
> [junit4] 2> at org.eclipse.jetty.util.BlockingArrayQueue.poll(
> BlockingArrayQueue.java:392)
> [junit4] 2> at org.eclipse.jetty.util.thread.
> QueuedThreadPool.idleJobPoll(QueuedThreadPool.java:563)
> [junit4] 2> at org.eclipse.jetty.util.thread.
> QueuedThreadPool.access$800(QueuedThreadPool.java:48)
> [junit4] 2> at org.eclipse.jetty.util.thread.
> QueuedThreadPool$2.run(QueuedThreadPool.java:626)
> [junit4] 2> at java.lang.Thread.run(Thread.java:745)
> [junit4] 2>
> [junit4] 2> "qtp15523365-3293" ID=3293 TIMED_WAITING on
> java.util.concurrent.locks.AbstractQueuedSynchronizer$
> ConditionObject@167137d
> [junit4] 2> at sun.misc.Unsafe.park(Native Method)
> [junit4] 2> - timed waiting on java.util.concurrent.locks.
> AbstractQueuedSynchronizer$ConditionObject@167137d
> [junit4] 2> at java.util.concurrent.locks.
> LockSupport.parkNanos(LockSupport.java:215)
> [junit4] 2> at java.util.concurrent.locks.
> AbstractQueuedSynchronizer$ConditionObject.awaitNanos(
> AbstractQueuedSynchronizer.java:2078)
> [junit4] 2> at org.eclipse.jetty.util.BlockingArrayQueue.poll(
> BlockingArrayQueue.java:392)
> [junit4] 2> at org.eclipse.jetty.util.thread.
> QueuedThreadPool.idleJobPoll(QueuedThreadPool.java:563)
> [junit4] 2> at org.eclipse.jetty.util.thread.
> QueuedThreadPool.access$800(QueuedThreadPool.java:48)
> [junit4] 2> at org.eclipse.jetty.util.thread.
> QueuedThreadPool$2.run(QueuedThreadPool.java:626)
> [junit4] 2> at java.lang.Thread.run(Thread.java:745)
> [junit4] 2>
> [junit4] 2> "qtp15523365-3292" ID=3292 TIMED_WAITING on
> java.util.concurrent.locks.AbstractQueuedSynchronizer$
> ConditionObject@167137d
> [junit4] 2> at sun.misc.Unsafe.park(Native Method)
> [junit4] 2> - timed waiting on java.util.concurrent.locks.
> AbstractQueuedSynchronizer$ConditionObject@167137d
> [junit4] 2> at java.util.concurrent.locks.
> LockSupport.parkNanos(LockSupport.java:215)
> [junit4] 2> at java.util.concurrent.locks.
> AbstractQueuedSynchronizer$ConditionObject.awaitNanos(
> AbstractQueuedSynchronizer.java:2078)
> [junit4] 2> at org.eclipse.jetty.util.BlockingArrayQueue.poll(
> BlockingArrayQueue.java:392)
> [junit4] 2> at org.eclipse.jetty.util.thread.
> QueuedThreadPool.idleJobPoll(QueuedThreadPool.java:563)
> [junit4] 2> at org.eclipse.jetty.util.thread.
> QueuedThreadPool.access$800(QueuedThreadPool.java:48)
> [junit4] 2> at org.eclipse.jetty.util.thread.
> QueuedThreadPool$2.run(QueuedThreadPool.java:626)
> [junit4] 2> at java.lang.Thread.run(Thread.java:745)
> [junit4] 2>
> [junit4] 2> "qtp15523365-3291" ID=3291 TIMED_WAITING on
> java.util.concurrent.locks.AbstractQueuedSynchronizer$
> ConditionObject@167137d
> [junit4] 2> at sun.misc.Unsafe.park(Native Method)
> [junit4] 2> - timed waiting on java.util.concurrent.locks.
> AbstractQueuedSynchronizer$ConditionObject@167137d
> [junit4] 2> at java.util.concurrent.locks.
> LockSupport.parkNanos(LockSupport.java:215)
> [junit4] 2> at java.util.concurrent.locks.
> AbstractQueuedSynchronizer$ConditionObject.awaitNanos(
> AbstractQueuedSynchronizer.java:2078)
> [junit4] 2> at org.eclipse.jetty.util.BlockingArrayQueue.poll(
> BlockingArrayQueue.java:392)
> [junit4] 2> at org.eclipse.jetty.util.thread.
> QueuedThreadPool.idleJobPoll(QueuedThreadPool.java:563)
> [junit4] 2> at org.eclipse.jetty.util.thread.
> QueuedThreadPool.access$800(QueuedThreadPool.java:48)
> [junit4] 2> at org.eclipse.jetty.util.thread.
> QueuedThreadPool$2.run(QueuedThreadPool.java:626)
> [junit4] 2> at java.lang.Thread.run(Thread.java:745)
> [junit4] 2>
> [junit4] 2> "qtp15523365-3290" ID=3290 TIMED_WAITING on
> java.util.concurrent.locks.AbstractQueuedSynchronizer$
> ConditionObject@167137d
> [junit4] 2> at sun.misc.Unsafe.park(Native Method)
> [junit4] 2> - timed waiting on java.util.concurrent.locks.
> AbstractQueuedSynchronizer$ConditionObject@167137d
> [junit4] 2> at java.util.concurrent.locks.
> LockSupport.parkNanos(LockSupport.java:215)
> [junit4] 2> at java.util.concurrent.locks.
> AbstractQueuedSynchronizer$ConditionObject.awaitNanos(
> AbstractQueuedSynchronizer.java:2078)
> [junit4] 2> at org.eclipse.jetty.util.BlockingArrayQueue.poll(
> BlockingArrayQueue.java:392)
> [junit4] 2> at org.eclipse.jetty.util.thread.
> QueuedThreadPool.idleJobPoll(QueuedThreadPool.java:563)
> [junit4] 2> at org.eclipse.jetty.util.thread.
> QueuedThreadPool.access$800(QueuedThreadPool.java:48)
> [junit4] 2> at org.eclipse.jetty.util.thread.
> QueuedThreadPool$2.run(QueuedThreadPool.java:626)
> [junit4] 2> at java.lang.Thread.run(Thread.java:745)
> [junit4] 2>
> [junit4] 2> "qtp15523365-3289" ID=3289 RUNNABLE (in native code)
> [junit4] 2> at sun.nio.ch.WindowsSelectorImpl$SubSelector.poll0(Native
> Method)
> [junit4] 2> at sun.nio.ch.WindowsSelectorImpl$
> SubSelector.poll(WindowsSelectorImpl.java:296)
> [junit4] 2> at sun.nio.ch.WindowsSelectorImpl$
> SubSelector.access$400(WindowsSelectorImpl.java:278)
> [junit4] 2> at sun.nio.ch.WindowsSelectorImpl.doSelect(
> WindowsSelectorImpl.java:159)
> [junit4] 2> at sun.nio.ch.SelectorImpl.
> lockAndDoSelect(SelectorImpl.java:86)
> [junit4] 2> - locked sun.nio.ch.Util$3@110414b
> [junit4] 2> - locked java.util.Collections$
> UnmodifiableSet@27654e
> [junit4] 2> - locked sun.nio.ch.WindowsSelectorImpl@1ba9885
> [junit4] 2> at sun.nio.ch.SelectorImpl.
> select(SelectorImpl.java:97)
> [junit4] 2> at sun.nio.ch.SelectorImpl.
> select(SelectorImpl.java:101)
> [junit4] 2> at org.eclipse.jetty.io.ManagedSelector$
> SelectorProducer.select(ManagedSelector.java:243)
> [junit4] 2> at org.eclipse.jetty.io.ManagedSelector$
> SelectorProducer.produce(ManagedSelector.java:191)
> [junit4] 2> at org.eclipse.jetty.util.thread.strategy.
> ExecuteProduceConsume.executeProduceConsume(ExecuteProduceConsume.java:
> 249)
> [junit4] 2> at org.eclipse.jetty.util.thread.strategy.
> ExecuteProduceConsume.produceConsume(ExecuteProduceConsume.java:148)
> [junit4] 2> at org.eclipse.jetty.util.thread.strategy.
> ExecuteProduceConsume.execute(ExecuteProduceConsume.java:100)
> [junit4] 2> at org.eclipse.jetty.io.ManagedSelector.run(
> ManagedSelector.java:147)
> [junit4] 2> at org.eclipse.jetty.util.thread.
> QueuedThreadPool.runJob(QueuedThreadPool.java:671)
> [junit4] 2> at org.eclipse.jetty.util.thread.
> QueuedThreadPool$2.run(QueuedThreadPool.java:589)
> [junit4] 2> at java.lang.Thread.run(Thread.java:745)
> [junit4] 2>
> [junit4] 2> "qtp15523365-3288-acceptor-0@18e63d6-ServerConnector@
> 14ec429{HTTP/1.1,[http/1.1]}{127.0.0.1:61853}" ID=3288 RUNNABLE (in
> native code)
> [junit4] 2> at sun.nio.ch.ServerSocketChannelImpl.accept0(Native
> Method)
> [junit4] 2> at sun.nio.ch.ServerSocketChannelImpl.accept(
> ServerSocketChannelImpl.java:422)
> [junit4] 2> at sun.nio.ch.ServerSocketChannelImpl.accept(
> ServerSocketChannelImpl.java:250)
> [junit4] 2> - locked java.lang.Object@639b74
> [junit4] 2> at org.eclipse.jetty.server.
> ServerConnector.accept(ServerConnector.java:373)
> [junit4] 2> at org.eclipse.jetty.server.
> AbstractConnector$Acceptor.run(AbstractConnector.java:601)
> [junit4] 2> at org.eclipse.jetty.util.thread.
> QueuedThreadPool.runJob(QueuedThreadPool.java:671)
> [junit4] 2> at org.eclipse.jetty.util.thread.
> QueuedThreadPool$2.run(QueuedThreadPool.java:589)
> [junit4] 2> at java.lang.Thread.run(Thread.java:745)
> [junit4] 2>
> [junit4] 2> "TEST-TestSolrCLIRunExample.testSchemalessExample-seed#[CD8A442CEDB674C]"
> ID=3285 TIMED_WAITING
> [junit4] 2> at java.lang.Thread.sleep(Native Method)
> [junit4] 2> at org.apache.commons.exec.
> DefaultExecuteResultHandler.waitFor(DefaultExecuteResultHandler.java:121)
> [junit4] 2> at org.apache.solr.util.SolrCLI$
> RunExampleTool.startSolr(SolrCLI.java:2937)
> [junit4] 2> at org.apache.solr.util.SolrCLI$
> RunExampleTool.runExample(SolrCLI.java:2649)
> [junit4] 2> at org.apache.solr.util.SolrCLI$
> RunExampleTool.runImpl(SolrCLI.java:2615)
> [junit4] 2> at org.apache.solr.util.SolrCLI$
> ToolBase.runTool(SolrCLI.java:154)
> [junit4] 2> at org.apache.solr.util.TestSolrCLIRunExample.
> testExample(TestSolrCLIRunExample.java:336)
> [junit4] 2> at org.apache.solr.util.TestSolrCLIRunExample.
> testSchemalessExample(TestSolrCLIRunExample.java:300)
> [junit4] 2> at sun.reflect.NativeMethodAccessorImpl.invoke0(Native
> Method)
> [junit4] 2> at sun.reflect.NativeMethodAccessorImpl.invoke(
> NativeMethodAccessorImpl.java:62)
> [junit4] 2> at sun.reflect.DelegatingMethodAccessorImpl.
> invoke(DelegatingMethodAccessorImpl.java:43)
> [junit4] 2> at java.lang.reflect.Method.
> invoke(Method.java:498)
> [junit4] 2> at com.carrotsearch.randomizedtesting.
> RandomizedRunner.invoke(RandomizedRunner.java:1713)
> [junit4] 2> at com.carrotsearch.randomizedtesting.
> RandomizedRunner$8.evaluate(RandomizedRunner.java:907)
> [junit4] 2> at com.carrotsearch.randomizedtesting.
> RandomizedRunner$9.evaluate(RandomizedRunner.java:943)
> [junit4] 2> at com.carrotsearch.randomizedtesting.
> RandomizedRunner$10.evaluate(RandomizedRunner.java:957)
> [junit4] 2> at com.carrotsearch.randomizedtesting.rules.
> SystemPropertiesRestoreRule$1.evaluate(SystemPropertiesRestoreRule.
> java:57)
> [junit4] 2> at org.apache.lucene.util.
> TestRuleSetupTeardownChained$1.evaluate(TestRuleSetupTeardownChained.
> java:49)
> [junit4] 2> at org.apache.lucene.util.
> AbstractBeforeAfterRule$1.evaluate(AbstractBeforeAfterRule.java:45)
> [junit4] 2> at org.apache.lucene.util.
> TestRuleThreadAndTestName$1.evaluate(TestRuleThreadAndTestName.java:48)
> [junit4] 2> at org.apache.lucene.util.
> TestRuleIgnoreAfterMaxFailures$1.evaluate(TestRuleIgnoreAfterMaxFailures
> .java:64)
> [junit4] 2> at org.apache.lucene.util.TestRuleMarkFailure$1.
> evaluate(TestRuleMarkFailure.java:47)
> [junit4] 2> at com.carrotsearch.randomizedtesting.rules.
> StatementAdapter.evaluate(StatementAdapter.java:36)
> [junit4] 2> at com.carrotsearch.randomizedtesting.
> ThreadLeakControl$StatementRunner.run(ThreadLeakControl.java:368)
> [junit4] 2> at com.carrotsearch.randomizedtesting.
> ThreadLeakControl.forkTimeoutingTask(ThreadLeakControl.java:817)
> [junit4] 2> at com.carrotsearch.randomizedtesting.
> ThreadLeakControl$3.evaluate(ThreadLeakControl.java:468)
> [junit4] 2> at com.carrotsearch.randomizedtesting.
> RandomizedRunner.runSingleTest(RandomizedRunner.java:916)
> [junit4] 2> at com.carrotsearch.randomizedtesting.
> RandomizedRunner$5.evaluate(RandomizedRunner.java:802)
> [junit4] 2> at com.carrotsearch.randomizedtesting.
> RandomizedRunner$6.evaluate(RandomizedRunner.java:852)
> [junit4] 2> at com.carrotsearch.randomizedtesting.
> RandomizedRunner$7.evaluate(RandomizedRunner.java:863)
> [junit4] 2> at com.carrotsearch.randomizedtesting.rules.
> StatementAdapter.evaluate(StatementAdapter.java:36)
> [junit4] 2> at com.carrotsearch.randomizedtesting.rules.
> SystemPropertiesRestoreRule$1.evaluate(SystemPropertiesRestoreRule.
> java:57)
> [junit4] 2> at org.apache.lucene.util.
> AbstractBeforeAfterRule$1.evaluate(AbstractBeforeAfterRule.java:45)
> [junit4] 2> at com.carrotsearch.randomizedtesting.rules.
> StatementAdapter.evaluate(StatementAdapter.java:36)
> [junit4] 2> at org.apache.lucene.util.
> TestRuleStoreClassName$1.evaluate(TestRuleStoreClassName.java:41)
> [junit4] 2> at com.carrotsearch.randomizedtesting.rules.
> NoShadowingOrOverridesOnMethodsRule$1.evaluate(
> NoShadowingOrOverridesOnMethodsRule.java:40)
> [junit4] 2> at com.carrotsearch.randomizedtesting.rules.
> NoShadowingOrOverridesOnMethodsRule$1.evaluate(
> NoShadowingOrOverridesOnMethodsRule.java:40)
> [junit4] 2> at com.carrotsearch.randomizedtesting.rules.
> StatementAdapter.evaluate(StatementAdapter.java:36)
> [junit4] 2> at com.carrotsearch.randomizedtesting.rules.
> StatementAdapter.evaluate(StatementAdapter.java:36)
> [junit4] 2> at com.carrotsearch.randomizedtesting.rules.
> StatementAdapter.evaluate(StatementAdapter.java:36)
> [junit4] 2> at org.apache.lucene.util.
> TestRuleAssertionsRequired$1.evaluate(TestRuleAssertionsRequired.java:53)
> [junit4] 2> at org.apache.lucene.util.TestRuleMarkFailure$1.
> evaluate(TestRuleMarkFailure.java:47)
> [junit4] 2> at org.apache.lucene.util.
> TestRuleIgnoreAfterMaxFailures$1.evaluate(TestRuleIgnoreAfterMaxFailures
> .java:64)
> [junit4] 2> at org.apache.lucene.util.
> TestRuleIgnoreTestSuites$1.evaluate(TestRuleIgnoreTestSuites.java:54)
> [junit4] 2> at com.carrotsearch.randomizedtesting.rules.
> StatementAdapter.evaluate(StatementAdapter.java:36)
> [junit4] 2> at com.carrotsearch.randomizedtesting.
> ThreadLeakControl$StatementRunner.run(ThreadLeakControl.java:368)
> [junit4] 2> at java.lang.Thread.run(Thread.java:745)
> [junit4] 2>
> [junit4] 2> "SUITE-TestSolrCLIRunExample-seed#[CD8A442CEDB674C]"
> ID=3284 RUNNABLE
> [junit4] 2> at sun.management.ThreadImpl.dumpThreads0(Native
> Method)
> [junit4] 2> at sun.management.ThreadImpl.
> dumpAllThreads(ThreadImpl.java:454)
> [junit4] 2> at com.carrotsearch.randomizedtesting.
> ThreadLeakControl.formatThreadStacksFull(ThreadLeakControl.java:681)
> [junit4] 2> at com.carrotsearch.randomizedtesting.
> ThreadLeakControl.access$1000(ThreadLeakControl.java:65)
> [junit4] 2> at com.carrotsearch.randomizedtesting.
> ThreadLeakControl$2.evaluate(ThreadLeakControl.java:415)
> [junit4] 2> - locked java.lang.Object@15e98ea
> [junit4] 2> at com.carrotsearch.randomizedtesting.
> RandomizedRunner.runSuite(RandomizedRunner.java:678)
> [junit4] 2> at com.carrotsearch.randomizedtesting.
> RandomizedRunner.access$200(RandomizedRunner.java:140)
> [junit4] 2> at com.carrotsearch.randomizedtesting.
> RandomizedRunner$2.run(RandomizedRunner.java:598)
> [junit4] 2>
> [junit4] 2> "SeedGenerator Thread" ID=14 WAITING on
> sun.security.provider.SeedGenerator$ThreadedSeedGenerator@3a849a
> [junit4] 2> at java.lang.Object.wait(Native Method)
> [junit4] 2> - waiting on sun.security.provider.SeedGenerator$
> ThreadedSeedGenerator@3a849a
> [junit4] 2> at java.lang.Object.wait(Object.java:502)
> [junit4] 2> at sun.security.provider.SeedGenerator$
> ThreadedSeedGenerator.run(SeedGenerator.java:334)
> [junit4] 2> at java.lang.Thread.run(Thread.java:745)
> [junit4] 2>
> [junit4] 2> "JUnit4-serializer-daemon" ID=10 TIMED_WAITING
> [junit4] 2> at java.lang.Thread.sleep(Native Method)
> [junit4] 2> at com.carrotsearch.ant.tasks.
> junit4.events.Serializer$1.run(Serializer.java:50)
> [junit4] 2>
> [junit4] 2> "Attach Listener" ID=6 RUNNABLE
> [junit4] 2>
> [junit4] 2> "Signal Dispatcher" ID=5 RUNNABLE
> [junit4] 2>
> [junit4] 2> "Finalizer" ID=3 WAITING on java.lang.ref.ReferenceQueue$
> Lock@1b343a8
> [junit4] 2> at java.lang.Object.wait(Native Method)
> [junit4] 2> - waiting on java.lang.ref.ReferenceQueue$
> Lock@1b343a8
> [junit4] 2> at java.lang.ref.ReferenceQueue.
> remove(ReferenceQueue.java:143)
> [junit4] 2> at java.lang.ref.ReferenceQueue.
> remove(ReferenceQueue.java:164)
> [junit4] 2> at java.lang.ref.Finalizer$
> FinalizerThread.run(Finalizer.java:209)
> [junit4] 2>
> [junit4] 2> "Reference Handler" ID=2 WAITING on
> java.lang.ref.Reference$Lock@111d711
> [junit4] 2> at java.lang.Object.wait(Native Method)
> [junit4] 2> - waiting on java.lang.ref.Reference$Lock@111d711
> [junit4] 2> at java.lang.Object.wait(Object.java:502)
> [junit4] 2> at java.lang.ref.Reference.
> tryHandlePending(Reference.java:191)
> [junit4] 2> at java.lang.ref.Reference$ReferenceHandler.run(
> Reference.java:153)
> [junit4] 2>
> [junit4] 2> "main" ID=1 WAITING on com.carrotsearch.
> randomizedtesting.RandomizedRunner$2@2b43f
> [junit4] 2> at java.lang.Object.wait(Native Method)
> [junit4] 2> - waiting on com.carrotsearch.randomizedtesting.
> RandomizedRunner$2@2b43f
> [junit4] 2> at java.lang.Thread.join(Thread.java:1249)
> [junit4] 2> at java.lang.Thread.join(Thread.java:1323)
> [junit4] 2> at com.carrotsearch.randomizedtesting.
> RandomizedRunner.runSuite(RandomizedRunner.java:608)
> [junit4] 2> at com.carrotsearch.randomizedtesting.
> RandomizedRunner.run(RandomizedRunner.java:457)
> [junit4] 2> at com.carrotsearch.ant.tasks.
> junit4.slave.SlaveMain.execute(SlaveMain.java:244)
> [junit4] 2> at com.carrotsearch.ant.tasks.
> junit4.slave.SlaveMain.main(SlaveMain.java:355)
> [junit4] 2> at com.carrotsearch.ant.tasks.
> junit4.slave.SlaveMainSafe.main(SlaveMainSafe.java:13)
> [junit4] 2>
> [junit4] 2> ^^==============================================
> [junit4] 2>
> [junit4] 2> NOTE: reproduce with: ant test -Dtestcase=TestSolrCLIRunExample
> -Dtests.method=testSchemalessExample -Dtests.seed=CD8A442CEDB674C
> -Dtests.slow=true -Dtests.locale=id -Dtests.timezone=Africa/Ceuta
> -Dtests.asserts=true -Dtests.file.encoding=ISO-8859-1
> [junit4] ERROR 7199s J1 | TestSolrCLIRunExample.testSchemalessExample
> <<<
> [junit4] > Throwable #1: java.lang.Exception: Test abandoned because
> suite timeout was reached.
> [junit4] > at __randomizedtesting.SeedInfo.
> seed([CD8A442CEDB674C]:0)
> [junit4] 2> Apr 04, 2017 4:44:23 AM com.carrotsearch.
> randomizedtesting.ThreadLeakControl checkThreadLeaks
> [junit4] 2> WARNING: Will linger awaiting termination of 13 leaked
> thread(s).
> [junit4] 2> Apr 04, 2017 4:44:43 AM com.carrotsearch.
> randomizedtesting.ThreadLeakControl checkThreadLeaks
> [junit4] 2> SEVERE: 13 threads leaked from SUITE scope at
> org.apache.solr.util.TestSolrCLIRunExample:
> [junit4] 2> 1) Thread[id=3291, name=qtp15523365-3291,
> state=TIMED_WAITING, group=TGRP-TestSolrCLIRunExample]
> [junit4] 2> at sun.misc.Unsafe.park(Native Method)
> [junit4] 2> at java.util.concurrent.locks.
> LockSupport.parkNanos(LockSupport.java:215)
> [junit4] 2> at java.util.concurrent.locks.
> AbstractQueuedSynchronizer$ConditionObject.awaitNanos(
> AbstractQueuedSynchronizer.java:2078)
> [junit4] 2> at org.eclipse.jetty.util.
> BlockingArrayQueue.poll(BlockingArrayQueue.java:392)
> [junit4] 2> at org.eclipse.jetty.util.thread.
> QueuedThreadPool.idleJobPoll(QueuedThreadPool.java:563)
> [junit4] 2> at org.eclipse.jetty.util.thread.
> QueuedThreadPool.access$800(QueuedThreadPool.java:48)
> [junit4] 2> at org.eclipse.jetty.util.thread.
> QueuedThreadPool$2.run(QueuedThreadPool.java:626)
> [junit4] 2> at java.lang.Thread.run(Thread.java:745)
> [junit4] 2> 2) Thread[id=3293, name=qtp15523365-3293,
> state=TIMED_WAITING, group=TGRP-TestSolrCLIRunExample]
> [junit4] 2> at sun.misc.Unsafe.park(Native Method)
> [junit4] 2> at java.util.concurrent.locks.
> LockSupport.parkNanos(LockSupport.java:215)
> [junit4] 2> at java.util.concurrent.locks.
> AbstractQueuedSynchronizer$ConditionObject.awaitNanos(
> AbstractQueuedSynchronizer.java:2078)
> [junit4] 2> at org.eclipse.jetty.util.
> BlockingArrayQueue.poll(BlockingArrayQueue.java:392)
> [junit4] 2> at org.eclipse.jetty.util.thread.
> QueuedThreadPool.idleJobPoll(QueuedThreadPool.java:563)
> [junit4] 2> at org.eclipse.jetty.util.thread.
> QueuedThreadPool.access$800(QueuedThreadPool.java:48)
> [junit4] 2> at org.eclipse.jetty.util.thread.
> QueuedThreadPool$2.run(QueuedThreadPool.java:626)
> [junit4] 2> at java.lang.Thread.run(Thread.java:745)
> [junit4] 2> 3) Thread[id=3295, name=qtp15523365-3295,
> state=TIMED_WAITING, group=TGRP-TestSolrCLIRunExample]
> [junit4] 2> at sun.misc.Unsafe.park(Native Method)
> [junit4] 2> at java.util.concurrent.locks.
> LockSupport.parkNanos(LockSupport.java:215)
> [junit4] 2> at java.util.concurrent.locks.
> AbstractQueuedSynchronizer$ConditionObject.awaitNanos(
> AbstractQueuedSynchronizer.java:2078)
> [junit4] 2> at org.eclipse.jetty.util.
> BlockingArrayQueue.poll(BlockingArrayQueue.java:392)
> [junit4] 2> at org.eclipse.jetty.util.thread.
> QueuedThreadPool.idleJobPoll(QueuedThreadPool.java:563)
> [junit4] 2> at org.eclipse.jetty.util.thread.
> QueuedThreadPool.access$800(QueuedThreadPool.java:48)
> [junit4] 2> at org.eclipse.jetty.util.thread.
> QueuedThreadPool$2.run(QueuedThreadPool.java:626)
> [junit4] 2> at java.lang.Thread.run(Thread.java:745)
> [junit4] 2> 4) Thread[id=3299, name=Thread-767, state=WAITING,
> group=TGRP-TestSolrCLIRunExample]
> [junit4] 2> at java.lang.Object.wait(Native Method)
> [junit4] 2> at java.lang.Object.wait(Object.java:502)
> [junit4] 2> at org.apache.solr.core.CloserThread.run(
> CoreContainer.java:1510)
> [junit4] 2> 5) Thread[id=3290, name=qtp15523365-3290,
> state=TIMED_WAITING, group=TGRP-TestSolrCLIRunExample]
> [junit4] 2> at sun.misc.Unsafe.park(Native Method)
> [junit4] 2> at java.util.concurrent.locks.
> LockSupport.parkNanos(LockSupport.java:215)
> [junit4] 2> at java.util.concurrent.locks.
> AbstractQueuedSynchronizer$ConditionObject.awaitNanos(
> AbstractQueuedSynchronizer.java:2078)
> [junit4] 2> at org.eclipse.jetty.util.
> BlockingArrayQueue.poll(BlockingArrayQueue.java:392)
> [junit4] 2> at org.eclipse.jetty.util.thread.
> QueuedThreadPool.idleJobPoll(QueuedThreadPool.java:563)
> [junit4] 2> at org.eclipse.jetty.util.thread.
> QueuedThreadPool.access$800(QueuedThreadPool.java:48)
> [junit4] 2> at org.eclipse.jetty.util.thread.
> QueuedThreadPool$2.run(QueuedThreadPool.java:626)
> [junit4] 2> at java.lang.Thread.run(Thread.java:745)
> [junit4] 2> 6) Thread[id=3294, name=qtp15523365-3294,
> state=TIMED_WAITING, group=TGRP-TestSolrCLIRunExample]
> [junit4] 2> at sun.misc.Unsafe.park(Native Method)
> [junit4] 2> at java.util.concurrent.locks.
> LockSupport.parkNanos(LockSupport.java:215)
> [junit4] 2> at java.util.concurrent.locks.
> AbstractQueuedSynchronizer$ConditionObject.awaitNanos(
> AbstractQueuedSynchronizer.java:2078)
> [junit4] 2> at org.eclipse.jetty.util.
> BlockingArrayQueue.poll(BlockingArrayQueue.java:392)
> [junit4] 2> at org.eclipse.jetty.util.thread.
> QueuedThreadPool.idleJobPoll(QueuedThreadPool.java:563)
> [junit4] 2> at org.eclipse.jetty.util.thread.
> QueuedThreadPool.access$800(QueuedThreadPool.java:48)
> [junit4] 2> at org.eclipse.jetty.util.thread.
> QueuedThreadPool$2.run(QueuedThreadPool.java:626)
> [junit4] 2> at java.lang.Thread.run(Thread.java:745)
> [junit4] 2> 7) Thread[id=3297, name=Connection evictor,
> state=TIMED_WAITING, group=TGRP-TestSolrCLIRunExample]
> [junit4] 2> at java.lang.Thread.sleep(Native Method)
> [junit4] 2> at org.apache.http.impl.client.
> IdleConnectionEvictor$1.run(IdleConnectionEvictor.java:66)
> [junit4] 2> at java.lang.Thread.run(Thread.java:745)
> [junit4] 2> 8) Thread[id=3288, name=qtp15523365-3288-
> acceptor-0@18e63d6-ServerConnector@14ec429{HTTP/1.1,[http/1.1]}{127.0.0.1:
> 61853}, state=RUNNABLE, group=TGRP-TestSolrCLIRunExample]
> [junit4] 2> at sun.nio.ch.ServerSocketChannelImpl.accept0(Native
> Method)
> [junit4] 2> at sun.nio.ch.ServerSocketChannelImpl.accept(
> ServerSocketChannelImpl.java:422)
> [junit4] 2> at sun.nio.ch.ServerSocketChannelImpl.accept(
> ServerSocketChannelImpl.java:250)
> [junit4] 2> at org.eclipse.jetty.server.
> ServerConnector.accept(ServerConnector.java:373)
> [junit4] 2> at org.eclipse.jetty.server.
> AbstractConnector$Acceptor.run(AbstractConnector.java:601)
> [junit4] 2> at org.eclipse.jetty.util.thread.
> QueuedThreadPool.runJob(QueuedThreadPool.java:671)
> [junit4] 2> at org.eclipse.jetty.util.thread.
> QueuedThreadPool$2.run(QueuedThreadPool.java:589)
> [junit4] 2> at java.lang.Thread.run(Thread.java:745)
> [junit4] 2> 9) Thread[id=3296, name=org.eclipse.jetty.server.
> session.HashSessionManager@112c502Timer, state=TIMED_WAITING, group=TGRP-
> TestSolrCLIRunExample]
> [junit4] 2> at sun.misc.Unsafe.park(Native Method)
> [junit4] 2> at java.util.concurrent.locks.
> LockSupport.parkNanos(LockSupport.java:215)
> [junit4] 2> at java.util.concurrent.locks.
> AbstractQueuedSynchronizer$ConditionObject.awaitNanos(
> AbstractQueuedSynchronizer.java:2078)
> [junit4] 2> at java.util.concurrent.
> ScheduledThreadPoolExecutor$DelayedWorkQueue.take(
> ScheduledThreadPoolExecutor.java:1093)
> [junit4] 2> at java.util.concurrent.
> ScheduledThreadPoolExecutor$DelayedWorkQueue.take(
> ScheduledThreadPoolExecutor.java:809)
> [junit4] 2> at java.util.concurrent.
> ThreadPoolExecutor.getTask(ThreadPoolExecutor.java:1067)
> [junit4] 2> at java.util.concurrent.
> ThreadPoolExecutor.runWorker(ThreadPoolExecutor.java:1127)
> [junit4] 2> at java.util.concurrent.
> ThreadPoolExecutor$Worker.run(ThreadPoolExecutor.java:617)
> [junit4] 2> at java.lang.Thread.run(Thread.java:745)
> [junit4] 2> 10) Thread[id=3285, name=TEST-TestSolrCLIRunExample.
> testSchemalessExample-seed#[CD8A442CEDB674C], state=TIMED_WAITING,
> group=TGRP-TestSolrCLIRunExample]
> [junit4] 2> at java.lang.Thread.sleep(Native Method)
> [junit4] 2> at org.apache.commons.exec.
> DefaultExecuteResultHandler.waitFor(DefaultExecuteResultHandler.java:121)
> [junit4] 2> at org.apache.solr.util.SolrCLI$
> RunExampleTool.startSolr(SolrCLI.java:2937)
> [junit4] 2> at org.apache.solr.util.SolrCLI$
> RunExampleTool.runExample(SolrCLI.java:2649)
> [junit4] 2> at org.apache.solr.util.SolrCLI$
> RunExampleTool.runImpl(SolrCLI.java:2615)
> [junit4] 2> at org.apache.solr.util.SolrCLI$
> ToolBase.runTool(SolrCLI.java:154)
> [junit4] 2> at org.apache.solr.util.TestSolrCLIRunExample.
> testExample(TestSolrCLIRunExample.java:336)
> [junit4] 2> at org.apache.solr.util.TestSolrCLIRunExample.
> testSchemalessExample(TestSolrCLIRunExample.java:300)
> [junit4] 2> at sun.reflect.NativeMethodAccessorImpl.invoke0(Native
> Method)
> [junit4] 2> at sun.reflect.NativeMethodAccessorImpl.invoke(
> NativeMethodAccessorImpl.java:62)
> [junit4] 2> at sun.reflect.DelegatingMethodAccessorImpl.
> invoke(DelegatingMethodAccessorImpl.java:43)
> [junit4] 2> at java.lang.reflect.Method.
> invoke(Method.java:498)
> [junit4] 2> at com.carrotsearch.randomizedtesting.
> RandomizedRunner.invoke(RandomizedRunner.java:1713)
> [junit4] 2> at com.carrotsearch.randomizedtesting.
> RandomizedRunner$8.evaluate(RandomizedRunner.java:907)
> [junit4] 2> at com.carrotsearch.randomizedtesting.
> RandomizedRunner$9.evaluate(RandomizedRunner.java:943)
> [junit4] 2> at com.carrotsearch.randomizedtesting.
> RandomizedRunner$10.evaluate(RandomizedRunner.java:957)
> [junit4] 2> at com.carrotsearch.randomizedtesting.rules.
> SystemPropertiesRestoreRule$1.evaluate(SystemPropertiesRestoreRule.
> java:57)
> [junit4] 2> at org.apache.lucene.util.
> TestRuleSetupTeardownChained$1.evaluate(TestRuleSetupTeardownChained.
> java:49)
> [junit4] 2> at org.apache.lucene.util.
> AbstractBeforeAfterRule$1.evaluate(AbstractBeforeAfterRule.java:45)
> [junit4] 2> at org.apache.lucene.util.
> TestRuleThreadAndTestName$1.evaluate(TestRuleThreadAndTestName.java:48)
> [junit4] 2> at org.apache.lucene.util.
> TestRuleIgnoreAfterMaxFailures$1.evaluate(TestRuleIgnoreAfterMaxFailures
> .java:64)
> [junit4] 2> at org.apache.lucene.util.TestRuleMarkFailure$1.
> evaluate(TestRuleMarkFailure.java:47)
> [junit4] 2> at com.carrotsearch.randomizedtesting.rules.
> StatementAdapter.evaluate(StatementAdapter.java:36)
> [junit4] 2> at com.carrotsearch.randomizedtesting.
> ThreadLeakControl$StatementRunner.run(ThreadLeakControl.java:368)
> [junit4] 2> at com.carrotsearch.randomizedtesting.
> ThreadLeakControl.forkTimeoutingTask(ThreadLeakControl.java:817)
> [junit4] 2> at com.carrotsearch.randomizedtesting.
> ThreadLeakControl$3.evaluate(ThreadLeakControl.java:468)
> [junit4] 2> at com.carrotsearch.randomizedtesting.
> RandomizedRunner.runSingleTest(RandomizedRunner.java:916)
> [junit4] 2> at com.carrotsearch.randomizedtesting.
> RandomizedRunner$5.evaluate(RandomizedRunner.java:802)
> [junit4] 2> at com.carrotsearch.randomizedtesting.
> RandomizedRunner$6.evaluate(RandomizedRunner.java:852)
> [junit4] 2> at com.carrotsearch.randomizedtesting.
> RandomizedRunner$7.evaluate(RandomizedRunner.java:863)
> [junit4] 2> at com.carrotsearch.randomizedtesting.rules.
> StatementAdapter.evaluate(StatementAdapter.java:36)
> [junit4] 2> at com.carrotsearch.randomizedtesting.rules.
> SystemPropertiesRestoreRule$1.evaluate(SystemPropertiesRestoreRule.
> java:57)
> [junit4] 2> at org.apache.lucene.util.
> AbstractBeforeAfterRule$1.evaluate(AbstractBeforeAfterRule.java:45)
> [junit4] 2> at com.carrotsearch.randomizedtesting.rules.
> StatementAdapter.evaluate(StatementAdapter.java:36)
> [junit4] 2> at org.apache.lucene.util.
> TestRuleStoreClassName$1.evaluate(TestRuleStoreClassName.java:41)
> [junit4] 2> at com.carrotsearch.randomizedtesting.rules.
> NoShadowingOrOverridesOnMethodsRule$1.evaluate(
> NoShadowingOrOverridesOnMethodsRule.java:40)
> [junit4] 2> at com.carrotsearch.randomizedtesting.rules.
> NoShadowingOrOverridesOnMethodsRule$1.evaluate(
> NoShadowingOrOverridesOnMethodsRule.java:40)
> [junit4] 2> at com.carrotsearch.randomizedtesting.rules.
> StatementAdapter.evaluate(StatementAdapter.java:36)
> [junit4] 2> at com.carrotsearch.randomizedtesting.rules.
> StatementAdapter.evaluate(StatementAdapter.java:36)
> [junit4] 2> at com.carrotsearch.randomizedtesting.rules.
> StatementAdapter.evaluate(StatementAdapter.java:36)
> [junit4] 2> at org.apache.lucene.util.
> TestRuleAssertionsRequired$1.evaluate(TestRuleAssertionsRequired.java:53)
> [junit4] 2> at org.apache.lucene.util.TestRuleMarkFailure$1.
> evaluate(TestRuleMarkFailure.java:47)
> [junit4] 2> at org.apache.lucene.util.
> TestRuleIgnoreAfterMaxFailures$1.evaluate(TestRuleIgnoreAfterMaxFailures
> .java:64)
> [junit4] 2> at org.apache.lucene.util.
> TestRuleIgnoreTestSuites$1.evaluate(TestRuleIgnoreTestSuites.java:54)
> [junit4] 2> at com.carrotsearch.randomizedtesting.rules.
> StatementAdapter.evaluate(StatementAdapter.java:36)
> [junit4] 2> at com.carrotsearch.randomizedtesting.
> ThreadLeakControl$StatementRunner.run(ThreadLeakControl.java:368)
> [junit4] 2> at java.lang.Thread.run(Thread.java:745)
> [junit4] 2> 11) Thread[id=3292, name=qtp15523365-3292,
> state=TIMED_WAITING, group=TGRP-TestSolrCLIRunExample]
> [junit4] 2> at sun.misc.Unsafe.park(Native Method)
> [junit4] 2> at java.util.concurrent.locks.
> LockSupport.parkNanos(LockSupport.java:215)
> [junit4] 2> at java.util.concurrent.locks.
> AbstractQueuedSynchronizer$ConditionObject.awaitNanos(
> AbstractQueuedSynchronizer.java:2078)
> [junit4] 2> at org.eclipse.jetty.util.
> BlockingArrayQueue.poll(BlockingArrayQueue.java:392)
> [junit4] 2> at org.eclipse.jetty.util.thread.
> QueuedThreadPool.idleJobPoll(QueuedThreadPool.java:563)
> [junit4] 2> at org.eclipse.jetty.util.thread.
> QueuedThreadPool.access$800(QueuedThreadPool.java:48)
> [junit4] 2> at org.eclipse.jetty.util.thread.
> QueuedThreadPool$2.run(QueuedThreadPool.java:626)
> [junit4] 2> at java.lang.Thread.run(Thread.java:745)
> [junit4] 2> 12) Thread[id=3289, name=qtp15523365-3289,
> state=RUNNABLE, group=TGRP-TestSolrCLIRunExample]
> [junit4] 2> at sun.nio.ch.WindowsSelectorImpl$SubSelector.poll0(Native
> Method)
> [junit4] 2> at sun.nio.ch.WindowsSelectorImpl$
> SubSelector.poll(WindowsSelectorImpl.java:296)
> [junit4] 2> at sun.nio.ch.WindowsSelectorImpl$
> SubSelector.access$400(WindowsSelectorImpl.java:278)
> [junit4] 2> at sun.nio.ch.WindowsSelectorImpl.doSelect(
> WindowsSelectorImpl.java:159)
> [junit4] 2> at sun.nio.ch.SelectorImpl.
> lockAndDoSelect(SelectorImpl.java:86)
> [junit4] 2> at sun.nio.ch.SelectorImpl.
> select(SelectorImpl.java:97)
> [junit4] 2> at sun.nio.ch.SelectorImpl.
> select(SelectorImpl.java:101)
> [junit4] 2> at org.eclipse.jetty.io.ManagedSelector$
> SelectorProducer.select(ManagedSelector.java:243)
> [junit4] 2> at org.eclipse.jetty.io.ManagedSelector$
> SelectorProducer.produce(ManagedSelector.java:191)
> [junit4] 2> at org.eclipse.jetty.util.thread.strategy.
> ExecuteProduceConsume.executeProduceConsume(ExecuteProduceConsume.java:
> 249)
> [junit4] 2> at org.eclipse.jetty.util.thread.strategy.
> ExecuteProduceConsume.produceConsume(ExecuteProduceConsume.java:148)
> [junit4] 2> at org.eclipse.jetty.util.thread.strategy.
> ExecuteProduceConsume.execute(ExecuteProduceConsume.java:100)
> [junit4] 2> at org.eclipse.jetty.io.ManagedSelector.run(
> ManagedSelector.java:147)
> [junit4] 2> at org.eclipse.jetty.util.thread.
> QueuedThreadPool.runJob(QueuedThreadPool.java:671)
> [junit4] 2> at org.eclipse.jetty.util.thread.
> QueuedThreadPool$2.run(QueuedThreadPool.java:589)
> [junit4] 2> at java.lang.Thread.run(Thread.java:745)
> [junit4] 2> 13) Thread[id=3298, name=Connection evictor,
> state=TIMED_WAITING, group=TGRP-TestSolrCLIRunExample]
> [junit4] 2> at java.lang.Thread.sleep(Native Method)
> [junit4] 2> at org.apache.http.impl.client.
> IdleConnectionEvictor$1.run(IdleConnectionEvictor.java:66)
> [junit4] 2> at java.lang.Thread.run(Thread.java:745)
> [junit4] 2> Apr 04, 2017 4:44:43 AM com.carrotsearch.
> randomizedtesting.ThreadLeakControl tryToInterruptAll
> [junit4] 2> INFO: Starting to interrupt leaked threads:
> [junit4] 2> 1) Thread[id=3291, name=qtp15523365-3291,
> state=TIMED_WAITING, group=TGRP-TestSolrCLIRunExample]
> [junit4] 2> 2) Thread[id=3293, name=qtp15523365-3293,
> state=TIMED_WAITING, group=TGRP-TestSolrCLIRunExample]
> [junit4] 2> 3) Thread[id=3295, name=qtp15523365-3295,
> state=TIMED_WAITING, group=TGRP-TestSolrCLIRunExample]
> [junit4] 2> 4) Thread[id=3299, name=Thread-767, state=WAITING,
> group=TGRP-TestSolrCLIRunExample]
> [junit4] 2> 5) Thread[id=3290, name=qtp15523365-3290,
> state=TIMED_WAITING, group=TGRP-TestSolrCLIRunExample]
> [junit4] 2> 6) Thread[id=3294, name=qtp15523365-3294,
> state=TIMED_WAITING, group=TGRP-TestSolrCLIRunExample]
> [junit4] 2> 7) Thread[id=3297, name=Connection evictor,
> state=TIMED_WAITING, group=TGRP-TestSolrCLIRunExample]
> [junit4] 2> 8) Thread[id=3288, name=qtp15523365-3288-
> acceptor-0@18e63d6-ServerConnector@14ec429{HTTP/1.1,[http/1.1]}{127.0.0.1:
> 61853}, state=RUNNABLE, group=TGRP-TestSolrCLIRunExample]
> [junit4] 2> 9) Thread[id=3296, name=org.eclipse.jetty.server.
> session.HashSessionManager@112c502Timer, state=TIMED_WAITING, group=TGRP-
> TestSolrCLIRunExample]
> [junit4] 2> 10) Thread[id=3285, name=TEST-TestSolrCLIRunExample.
> testSchemalessExample-seed#[CD8A442CEDB674C], state=TIMED_WAITING,
> group=TGRP-TestSolrCLIRunExample]
> [junit4] 2> 11) Thread[id=3292, name=qtp15523365-3292,
> state=TIMED_WAITING, group=TGRP-TestSolrCLIRunExample]
> [junit4] 2> 12) Thread[id=3289, name=qtp15523365-3289,
> state=RUNNABLE, group=TGRP-TestSolrCLIRunExample]
> [junit4] 2> 13) Thread[id=3298, name=Connection evictor,
> state=TIMED_WAITING, group=TGRP-TestSolrCLIRunExample]
> [junit4] 2>
> [junit4] 2> ERROR: The process has not exited yet therefore no result
> is available ...
> [junit4] 2>
> [junit4] 2> 7664915 INFO (TEST-TestSolrCLIRunExample.
> testSchemalessExample-seed#[CD8A442CEDB674C]) [ ]
> o.e.j.s.AbstractConnector Stopped ServerConnector@14ec429{HTTP/
> 1.1,[http/1.1]}{127.0.0.1:61853}
> [junit4] 2> 7664917 INFO (TEST-TestSolrCLIRunExample.
> testSchemalessExample-seed#[CD8A442CEDB674C]) [ ]
> o.a.s.c.CoreContainer Shutting down CoreContainer instance=23753027
> [junit4] 2> 7664917 INFO (TEST-TestSolrCLIRunExample.
> testSchemalessExample-seed#[CD8A442CEDB674C]) [ ]
> o.a.s.m.SolrMetricManager Closing metric reporters for registry=solr.node,
> tag=null
> [junit4] 2> 7664917 INFO (TEST-TestSolrCLIRunExample.
> testSchemalessExample-seed#[CD8A442CEDB674C]) [ ] o.a.s.c.TransientSolrCoreCacheDefault
> Allocating transient cache for 2147483647 transient cores
> [junit4] 2> 7664918 INFO (TEST-TestSolrCLIRunExample.
> testSchemalessExample-seed#[CD8A442CEDB674C]) [ ]
> o.e.j.s.h.ContextHandler Stopped o.e.j.s.ServletContextHandler@
> ab25eb{/solr,null,UNAVAILABLE}
> [junit4] 2> 7664919 INFO (TEST-TestSolrCLIRunExample.
> testSchemalessExample-seed#[CD8A442CEDB674C]) [ ]
> o.a.s.u.TestSolrCLIRunExample Stopped standalone Solr instance running on
> port 61853
> [junit4] 2> 7664919 INFO (TEST-TestSolrCLIRunExample.
> testSchemalessExample-seed#[CD8A442CEDB674C]) [ ] o.a.s.SolrTestCaseJ4
> ###Ending testSchemalessExample
> [junit4] 2> 7664919 INFO (SUITE-TestSolrCLIRunExample-seed#[CD8A442CEDB674C]-worker)
> [ ] o.a.s.SolrTestCaseJ4 ###deleteCore
> [junit4] 2> 7664920 INFO (SUITE-TestSolrCLIRunExample-seed#[CD8A442CEDB674C]-worker)
> [ ] o.a.s.SolrTestCaseJ4 -------------------------------------------------------
> Done waiting for tracked resources to be released
> [junit4] 2> Apr 04, 2017 2:44:43 AM com.carrotsearch.
> randomizedtesting.ThreadLeakControl tryToInterruptAll
> [junit4] 2> INFO: All leaked threads terminated.
> [junit4] 2> NOTE: test params are: codec=Asserting(Lucene70): {},
> docValues:{}, maxPointsInLeafNode=495, maxMBSortInHeap=6.194342993006343,
> sim=RandomSimilarity(queryNorm=true): {}, locale=id, timezone=Africa/Ceuta
> [junit4] 2> NOTE: Windows 10 10.0 x86/Oracle Corporation 1.8.0_121
> (32-bit)/cpus=3,threads=1,free=56733944,total=157614080
> [junit4] 2> NOTE: All tests run in this JVM:
> [DistribCursorPagingTest, JsonLoaderTest, HttpSolrCallGetCoreTest,
> TestSearcherReuse, TestLeaderElectionZkExpiry, TestRangeQuery,
> TestPHPSerializedResponseWriter, DeleteInactiveReplicaTest,
> CollectionsAPISolrJTest, HdfsNNFailoverTest, AsyncCallRequestStatusResponseTest,
> TestFieldCache, TestDistribIDF, TestQuerySenderListener,
> CollectionsAPIDistributedZkTest, TestFuzzyAnalyzedSuggestions,
> BJQParserTest, TestUtils, DebugComponentTest, ReturnFieldsTest,
> TestSolrDeletionPolicy2, SolrInfoMBeanTest, TestSubQueryTransformerCrossCore,
> ScriptEngineTest, VMParamsZkACLAndCredentialsProvidersTest,
> TestExactStatsCache, TestDocBasedVersionConstraints,
> TestLegacyFieldCache, SuggesterWFSTTest, RAMDirectoryFactoryTest,
> DistributedSuggestComponentTest, RequestHandlersTest,
> ConvertedLegacyTest, ConfigSetsAPITest, DistributedDebugComponentTest,
> LeaderFailureAfterFreshStartTest, UpdateParamsTest, TestOmitPositions,
> TestSha256AuthenticationProvider, TestPushWriter, TestFilteredDocIdSet,
> TestPathTrie, SuggestComponentContextFilterQueryTest,
> TestAuthenticationFramework, TestSolrCLIRunExample]
> [junit4] 2> NOTE: reproduce with: ant test -Dtestcase=TestSolrCLIRunExample
> -Dtests.seed=CD8A442CEDB674C -Dtests.slow=true -Dtests.locale=id
> -Dtests.timezone=Africa/Ceuta -Dtests.asserts=true
> -Dtests.file.encoding=ISO-8859-1
> [junit4] ERROR 0.00s J1 | TestSolrCLIRunExample (suite) <<<
> [junit4] > Throwable #1: java.lang.Exception: Suite timeout exceeded
> (>= 7200000 msec).
> [junit4] > at __randomizedtesting.SeedInfo.
> seed([CD8A442CEDB674C]:0)
> [junit4] Completed [572/701 (1!)] on J1 in 7220.27s, 3 tests, 2 errors,
> 1 skipped <<< FAILURES!
>
> [...truncated 39731 lines...]
>
>
>
> ---------------------------------------------------------------------
> To unsubscribe, e-mail: dev-unsubscribe@lucene.apache.org
> For additional commands, e-mail: dev-help@lucene.apache.org
>
--
Sincerely yours
Mikhail Khludnev