You are viewing a plain text version of this content. The canonical link for it is here.
Posted to builds@cassandra.apache.org by Apache Jenkins Server <je...@builds.apache.org> on 2022/07/16 03:59:46 UTC
Build complete: Cassandra-4.1 #103 [UNSTABLE] 46d9cbe2f66b02cedf1b7961c4c1194488e1323b
-------------------------------------------------------------------------------
Build Cassandra-4.1 #103 Still Unstable
URL: https://ci-cassandra.apache.org/job/Cassandra-4.1/103/
-------------------------------------------------------------------------------
Changes:
[Ekaterina Dimitrova] min_tracked_partition_size_bytes parameter from 4.1 alpha1 was renamed
-------------------------------------------------------------------------------
Failed Tests:
8 tests failed.
FAILED: dtest-large-novnode.materialized_views_test.TestMaterializedViews.test_throttled_partition_update
FAILED: dtest-novnode.cqlsh_tests.test_cqlsh.TestCqlsh.test_describe
FAILED: org.apache.cassandra.distributed.test.CASTest.testSucccessfulWriteDuringRangeMovementFollowedByRead
FAILED: org.apache.cassandra.distributed.test.TopPartitionsTest.basicRowTombstonesTest[Incremental]
FAILED: junit.framework.TestSuite.org.apache.cassandra.distributed.test.TopPartitionsTest
FAILED: org.apache.cassandra.distributed.test.NetstatsBootstrapWithEntireSSTablesCompressionStreamingTest.testWithStreamingEntireSSTablesWithoutCompressionWithoutThrottling
FAILED: org.apache.cassandra.net.ProxyHandlerConnectionsTest.testExpireSome-compression
FAILED: org.apache.cassandra.tools.TopPartitionsTest.testServiceTopPartitionsSingleTable
-------------------------------------------------------------------------------
For complete test report and logs see https://nightlies.apache.org/cassandra/Cassandra-4.1/103/