You are viewing a plain text version of this content. The canonical link for it is here.
Posted to builds@cassandra.apache.org by Apache Jenkins Server <je...@builds.apache.org> on 2022/11/30 05:02:16 UTC

Build complete: Cassandra-3.0 #313 [UNSTABLE] 13d495aa7d5b7a7c121fcc9e105f79107c5c2a1c

-------------------------------------------------------------------------------
Build Cassandra-3.0 #313 Still Unstable
URL: https://ci-cassandra.apache.org/job/Cassandra-3.0/313/
-------------------------------------------------------------------------------
Changes:
[Jordan West] fix intermittent failures in nodetool toppartitions caused by failure to


-------------------------------------------------------------------------------
Failed Tests:
16 tests failed.
FAILED:  dtest-novnode.repair_tests.repair_test.TestRepair.test_dead_sync_initiator
FAILED:  dtest-novnode.repair_tests.deprecated_repair_test.TestDeprecatedRepairNotifications.test_deprecated_repair_error_notification
FAILED:  dtest-upgrade.upgrade_tests.upgrade_through_versions_test.TestUpgrade_current_2_1_x_To_indev_3_0_x.test_parallel_upgrade_with_internode_ssl
FAILED:  dtest-upgrade.upgrade_tests.upgrade_through_versions_test.TestUpgrade_current_2_1_x_To_indev_3_0_x.test_bootstrap
FAILED:  dtest-upgrade.upgrade_tests.upgrade_through_versions_test.TestUpgrade_current_2_1_x_To_indev_3_0_x.test_bootstrap
FAILED:  dtest-upgrade.upgrade_tests.upgrade_through_versions_test.TestUpgrade_current_2_1_x_To_indev_3_0_x.test_bootstrap
FAILED:  dtest-upgrade.upgrade_tests.cql_tests.TestCQLNodes3RF3_Upgrade_current_2_2_x_To_indev_3_0_x.test_cql3_insert_thrift
FAILED:  dtest-upgrade.upgrade_tests.upgrade_through_versions_test.TestUpgrade_indev_3_0_x_To_indev_4_1_x.test_parallel_upgrade
FAILED:  dtest.snapshot_test.TestArchiveCommitlog.test_archive_commitlog
FAILED:  dtest.repair_tests.deprecated_repair_test.TestDeprecatedRepairNotifications.test_deprecated_repair_error_notification
FAILED:  org.apache.cassandra.dht.tokenallocator.ReplicationAwareTokenAllocatorTest.testNewCluster
FAILED:  dtest.repair_tests.repair_test.TestRepair.test_dead_sync_initiator
FAILED:  dtest.repair_tests.repair_test.TestRepair.test_failure_during_validation
FAILED:  dtest-novnode.repair_tests.repair_test.TestRepair.test_failure_during_validation
FAILED:  dtest-upgrade.upgrade_internal_auth_test.TestAuthUpgrade.test_upgrade_legacy_table
FAILED:  dtest-upgrade.upgrade_internal_auth_test.TestAuthUpgrade.test_upgrade_to_30

-------------------------------------------------------------------------------
For complete test report and logs see https://nightlies.apache.org/cassandra/Cassandra-3.0/313/