You are viewing a plain text version of this content. The canonical link for it is here.
Posted to builds@beam.apache.org by Apache Jenkins Server <je...@builds.apache.org> on 2021/05/19 07:32:52 UTC
Build failed in Jenkins: beam_PostCommit_XVR_Dataflow #742
See <https://ci-beam.apache.org/job/beam_PostCommit_XVR_Dataflow/742/display/redirect>
Changes:
------------------------------------------
[...truncated 2.41 MB...]
"encoding": {
"@type": "kind:windowed_value",
"component_encodings": [
{
"@type": "FastPrimitivesCoder$eNprYE5OLEhMzkiNT0pNzNVLzk9JLSqGUlxuicUlAUWZuZklmWWpxc4gQa5CBs3GQsbaQqYIfgYGhvi0xJycpMTk7HiwlkJ8pgVkJmfnpEJNYQGawlpbyJZUnKQHACYlLgM=",
"component_encodings": [
{
"@type": "FastPrimitivesCoder$eNprYE5OLEhMzkiNT0pNzNVLzk9JLSqGUlxuicUlAUWZuZklmWWpxc4gQa5CBs3GQsbaQqYIfgYGhvi0xJycpMTk7HiwlkJ8pgVkJmfnpEJNYQGawlpbyJZUnKQHACYlLgM=",
"component_encodings": [],
"pipeline_proto_coder_id": "ref_Coder_FastPrimitivesCoder_8"
},
{
"@type": "FastPrimitivesCoder$eNprYE5OLEhMzkiNT0pNzNVLzk9JLSqGUlxuicUlAUWZuZklmWWpxc4gQa5CBs3GQsbaQqYIfgYGhvi0xJycpMTk7HiwlkJ8pgVkJmfnpEJNYQGawlpbyJZUnKQHACYlLgM=",
"component_encodings": [],
"pipeline_proto_coder_id": "ref_Coder_FastPrimitivesCoder_8"
}
],
"is_pair_like": true,
"pipeline_proto_coder_id": "ref_Coder_FastPrimitivesCoder_8"
},
{
"@type": "kind:global_window"
}
],
"is_wrapper": true
},
"output_name": "None",
"user_name": "assert_that/Unkey.out"
}
],
"parallel_input": {
"@type": "OutputReference",
"output_name": "None",
"step_name": "s19"
},
"serialized_fn": "ref_AppliedPTransform_assert_that-Unkey_29",
"user_name": "assert_that/Unkey"
}
},
{
"kind": "ParallelDo",
"name": "s21",
"properties": {
"display_data": [
{
"key": "fn",
"label": "Transform Function",
"namespace": "apache_beam.transforms.core.ParDo",
"shortValue": "CallableWrapperDoFn",
"type": "STRING",
"value": "apache_beam.transforms.core.CallableWrapperDoFn"
},
{
"key": "fn",
"label": "Transform Function",
"namespace": "apache_beam.transforms.core.CallableWrapperDoFn",
"type": "STRING",
"value": "_equal"
}
],
"non_parallel_inputs": {},
"output_info": [
{
"encoding": {
"@type": "kind:windowed_value",
"component_encodings": [
{
"@type": "FastPrimitivesCoder$eNprYE5OLEhMzkiNT0pNzNVLzk9JLSqGUlxuicUlAUWZuZklmWWpxc4gQa5CBs3GQsbaQqYIfgYGhvi0xJycpMTk7HiwlkJ8pgVkJmfnpEJNYQGawlpbyJZUnKQHACYlLgM=",
"component_encodings": [
{
"@type": "FastPrimitivesCoder$eNprYE5OLEhMzkiNT0pNzNVLzk9JLSqGUlxuicUlAUWZuZklmWWpxc4gQa5CBs3GQsbaQqYIfgYGhvi0xJycpMTk7HiwlkJ8pgVkJmfnpEJNYQGawlpbyJZUnKQHACYlLgM=",
"component_encodings": [],
"pipeline_proto_coder_id": "ref_Coder_FastPrimitivesCoder_8"
},
{
"@type": "FastPrimitivesCoder$eNprYE5OLEhMzkiNT0pNzNVLzk9JLSqGUlxuicUlAUWZuZklmWWpxc4gQa5CBs3GQsbaQqYIfgYGhvi0xJycpMTk7HiwlkJ8pgVkJmfnpEJNYQGawlpbyJZUnKQHACYlLgM=",
"component_encodings": [],
"pipeline_proto_coder_id": "ref_Coder_FastPrimitivesCoder_8"
}
],
"is_pair_like": true,
"pipeline_proto_coder_id": "ref_Coder_FastPrimitivesCoder_8"
},
{
"@type": "kind:global_window"
}
],
"is_wrapper": true
},
"output_name": "None",
"user_name": "assert_that/Match.out"
}
],
"parallel_input": {
"@type": "OutputReference",
"output_name": "None",
"step_name": "s20"
},
"serialized_fn": "ref_AppliedPTransform_assert_that-Match_30",
"user_name": "assert_that/Match"
}
}
],
"type": "JOB_TYPE_BATCH"
}
apache_beam.runners.dataflow.internal.apiclient: INFO: Create job: <Job
createTime: '2021-05-19T06:31:03.003208Z'
currentStateTime: '1970-01-01T00:00:00Z'
id: '2021-05-18_23_31_02-4084773158025253804'
location: 'us-central1'
name: 'beamapp-jenkins-0519063053-414008'
projectId: 'apache-beam-testing'
stageStates: []
startTime: '2021-05-19T06:31:03.003208Z'
steps: []
tempFiles: []
type: TypeValueValuesEnum(JOB_TYPE_BATCH, 1)>
apache_beam.runners.dataflow.internal.apiclient: INFO: Created job with id: [2021-05-18_23_31_02-4084773158025253804]
apache_beam.runners.dataflow.internal.apiclient: INFO: Submitted job: 2021-05-18_23_31_02-4084773158025253804
apache_beam.runners.dataflow.internal.apiclient: INFO: To access the Dataflow monitoring console, please navigate to https://console.cloud.google.com/dataflow/jobs/us-central1/2021-05-18_23_31_02-4084773158025253804?project=apache-beam-testing
apache_beam.runners.dataflow.dataflow_runner: INFO: Job 2021-05-18_23_31_02-4084773158025253804 is in state JOB_STATE_RUNNING
apache_beam.runners.dataflow.dataflow_runner: INFO: 2021-05-19T06:31:09.032Z: JOB_MESSAGE_DETAILED: Autoscaling is enabled for job 2021-05-18_23_31_02-4084773158025253804. The number of workers will be between 1 and 1000.
apache_beam.runners.dataflow.dataflow_runner: INFO: 2021-05-19T06:31:09.156Z: JOB_MESSAGE_DETAILED: Autoscaling was automatically enabled for job 2021-05-18_23_31_02-4084773158025253804.
apache_beam.runners.dataflow.dataflow_runner: INFO: 2021-05-19T06:31:39.198Z: JOB_MESSAGE_BASIC: Worker configuration: n1-standard-1 in us-central1-f.
apache_beam.runners.dataflow.dataflow_runner: INFO: 2021-05-19T06:31:39.922Z: JOB_MESSAGE_DETAILED: Expanding SplittableParDo operations into optimizable parts.
apache_beam.runners.dataflow.dataflow_runner: INFO: 2021-05-19T06:31:39.960Z: JOB_MESSAGE_DETAILED: Expanding CollectionToSingleton operations into optimizable parts.
apache_beam.runners.dataflow.dataflow_runner: INFO: 2021-05-19T06:31:40.023Z: JOB_MESSAGE_DETAILED: Expanding CoGroupByKey operations into optimizable parts.
apache_beam.runners.dataflow.dataflow_runner: INFO: 2021-05-19T06:31:40.062Z: JOB_MESSAGE_DEBUG: Combiner lifting skipped for step assert_that/Group/GroupByKey: GroupByKey not followed by a combiner.
apache_beam.runners.dataflow.dataflow_runner: INFO: 2021-05-19T06:31:40.092Z: JOB_MESSAGE_DEBUG: Combiner lifting skipped for step Create/MaybeReshuffle/Reshuffle/ReshufflePerKey/GroupByKey: GroupByKey not followed by a combiner.
apache_beam.runners.dataflow.dataflow_runner: INFO: 2021-05-19T06:31:40.121Z: JOB_MESSAGE_DETAILED: Expanding GroupByKey operations into optimizable parts.
apache_beam.runners.dataflow.dataflow_runner: INFO: 2021-05-19T06:31:40.154Z: JOB_MESSAGE_DEBUG: Annotating graph with Autotuner information.
apache_beam.runners.dataflow.dataflow_runner: INFO: 2021-05-19T06:31:40.200Z: JOB_MESSAGE_DETAILED: Fusing adjacent ParDo, Read, Write, and Flatten operations
apache_beam.runners.dataflow.dataflow_runner: INFO: 2021-05-19T06:31:40.228Z: JOB_MESSAGE_DEBUG: Inserted coder converter after flatten ref_AppliedPTransform_assert_that-Group-Flatten_26
apache_beam.runners.dataflow.dataflow_runner: INFO: 2021-05-19T06:31:40.260Z: JOB_MESSAGE_DETAILED: Unzipping flatten ref_AppliedPTransform_assert_that-Group-Flatten_26 for input ref_AppliedPTransform_assert_that-Group-pair_with_0_24.None
apache_beam.runners.dataflow.dataflow_runner: INFO: 2021-05-19T06:31:40.293Z: JOB_MESSAGE_DETAILED: Fusing unzipped copy of assert_that/Group/Flatten/OutputIdentity, through flatten assert_that/Group/Flatten, into producer assert_that/Group/pair_with_0
apache_beam.runners.dataflow.dataflow_runner: INFO: 2021-05-19T06:31:40.318Z: JOB_MESSAGE_DETAILED: Fusing consumer assert_that/Group/Map(_merge_tagged_vals_under_key) into assert_that/Group/GroupByKey/Read
apache_beam.runners.dataflow.dataflow_runner: INFO: 2021-05-19T06:31:40.355Z: JOB_MESSAGE_DETAILED: Fusing consumer assert_that/Unkey into assert_that/Group/Map(_merge_tagged_vals_under_key)
apache_beam.runners.dataflow.dataflow_runner: INFO: 2021-05-19T06:31:40.453Z: JOB_MESSAGE_DETAILED: Fusing consumer assert_that/Match into assert_that/Unkey
apache_beam.runners.dataflow.dataflow_runner: INFO: 2021-05-19T06:31:40.483Z: JOB_MESSAGE_DETAILED: Unzipping flatten ref_AppliedPTransform_assert_that-Group-Flatten_26-u20 for input ref_AppliedPTransform_assert_that-Group-Flatten_26.None-c18
apache_beam.runners.dataflow.dataflow_runner: INFO: 2021-05-19T06:31:40.520Z: JOB_MESSAGE_DETAILED: Fusing unzipped copy of assert_that/Group/GroupByKey/Write, through flatten assert_that/Group/Flatten/Unzipped-1, into producer assert_that/Group/Flatten/OutputIdentity
apache_beam.runners.dataflow.dataflow_runner: INFO: 2021-05-19T06:31:40.573Z: JOB_MESSAGE_DETAILED: Fusing consumer assert_that/Group/Flatten/OutputIdentity into assert_that/Group/pair_with_1
apache_beam.runners.dataflow.dataflow_runner: INFO: 2021-05-19T06:31:40.613Z: JOB_MESSAGE_DETAILED: Fusing consumer assert_that/Group/GroupByKey/Write into assert_that/Group/Flatten/OutputIdentity
apache_beam.runners.dataflow.dataflow_runner: INFO: 2021-05-19T06:31:40.649Z: JOB_MESSAGE_DETAILED: Fusing consumer Create/FlatMap(<lambda at core.py:2939>) into Create/Impulse
apache_beam.runners.dataflow.dataflow_runner: INFO: 2021-05-19T06:31:40.677Z: JOB_MESSAGE_DETAILED: Fusing consumer Create/MaybeReshuffle/Reshuffle/AddRandomKeys into Create/FlatMap(<lambda at core.py:2939>)
apache_beam.runners.dataflow.dataflow_runner: INFO: 2021-05-19T06:31:40.713Z: JOB_MESSAGE_DETAILED: Fusing consumer Create/MaybeReshuffle/Reshuffle/ReshufflePerKey/Map(reify_timestamps) into Create/MaybeReshuffle/Reshuffle/AddRandomKeys
apache_beam.runners.dataflow.dataflow_runner: INFO: 2021-05-19T06:31:40.742Z: JOB_MESSAGE_DETAILED: Fusing consumer Create/MaybeReshuffle/Reshuffle/ReshufflePerKey/GroupByKey/Reify into Create/MaybeReshuffle/Reshuffle/ReshufflePerKey/Map(reify_timestamps)
apache_beam.runners.dataflow.dataflow_runner: INFO: 2021-05-19T06:31:40.768Z: JOB_MESSAGE_DETAILED: Fusing consumer Create/MaybeReshuffle/Reshuffle/ReshufflePerKey/GroupByKey/Write into Create/MaybeReshuffle/Reshuffle/ReshufflePerKey/GroupByKey/Reify
apache_beam.runners.dataflow.dataflow_runner: INFO: 2021-05-19T06:31:40.797Z: JOB_MESSAGE_DETAILED: Fusing consumer Create/MaybeReshuffle/Reshuffle/ReshufflePerKey/GroupByKey/GroupByWindow into Create/MaybeReshuffle/Reshuffle/ReshufflePerKey/GroupByKey/Read
apache_beam.runners.dataflow.dataflow_runner: INFO: 2021-05-19T06:31:40.823Z: JOB_MESSAGE_DETAILED: Fusing consumer Create/MaybeReshuffle/Reshuffle/ReshufflePerKey/FlatMap(restore_timestamps) into Create/MaybeReshuffle/Reshuffle/ReshufflePerKey/GroupByKey/GroupByWindow
apache_beam.runners.dataflow.dataflow_runner: INFO: 2021-05-19T06:31:40.850Z: JOB_MESSAGE_DETAILED: Fusing consumer Create/MaybeReshuffle/Reshuffle/RemoveRandomKeys into Create/MaybeReshuffle/Reshuffle/ReshufflePerKey/FlatMap(restore_timestamps)
apache_beam.runners.dataflow.dataflow_runner: INFO: 2021-05-19T06:31:40.888Z: JOB_MESSAGE_DETAILED: Fusing consumer Create/Map(decode) into Create/MaybeReshuffle/Reshuffle/RemoveRandomKeys
apache_beam.runners.dataflow.dataflow_runner: INFO: 2021-05-19T06:31:40.927Z: JOB_MESSAGE_DETAILED: Fusing consumer ExternalTransform(beam:transforms:xlang:test:prefix)/Map/ParMultiDo(Anonymous) into Create/Map(decode)
apache_beam.runners.dataflow.dataflow_runner: INFO: 2021-05-19T06:31:40.964Z: JOB_MESSAGE_DETAILED: Fusing consumer assert_that/WindowInto(WindowIntoFn) into ExternalTransform(beam:transforms:xlang:test:prefix)/Map/ParMultiDo(Anonymous)
apache_beam.runners.dataflow.dataflow_runner: INFO: 2021-05-19T06:31:40.999Z: JOB_MESSAGE_DETAILED: Fusing consumer assert_that/Create/FlatMap(<lambda at core.py:2939>) into assert_that/Create/Impulse
apache_beam.runners.dataflow.dataflow_runner: INFO: 2021-05-19T06:31:41.026Z: JOB_MESSAGE_DETAILED: Fusing consumer assert_that/Create/Map(decode) into assert_that/Create/FlatMap(<lambda at core.py:2939>)
apache_beam.runners.dataflow.dataflow_runner: INFO: 2021-05-19T06:31:41.049Z: JOB_MESSAGE_DETAILED: Fusing consumer assert_that/Group/pair_with_0 into assert_that/Create/Map(decode)
apache_beam.runners.dataflow.dataflow_runner: INFO: 2021-05-19T06:31:41.088Z: JOB_MESSAGE_DETAILED: Fusing consumer assert_that/ToVoidKey into assert_that/WindowInto(WindowIntoFn)
apache_beam.runners.dataflow.dataflow_runner: INFO: 2021-05-19T06:31:41.123Z: JOB_MESSAGE_DETAILED: Fusing consumer assert_that/Group/pair_with_1 into assert_that/ToVoidKey
apache_beam.runners.dataflow.dataflow_runner: INFO: 2021-05-19T06:31:41.150Z: JOB_MESSAGE_DEBUG: Workflow config is missing a default resource spec.
apache_beam.runners.dataflow.dataflow_runner: INFO: 2021-05-19T06:31:41.179Z: JOB_MESSAGE_DEBUG: Adding StepResource setup and teardown to workflow graph.
apache_beam.runners.dataflow.dataflow_runner: INFO: 2021-05-19T06:31:41.207Z: JOB_MESSAGE_DEBUG: Adding workflow start and stop steps.
apache_beam.runners.dataflow.dataflow_runner: INFO: 2021-05-19T06:31:41.234Z: JOB_MESSAGE_DEBUG: Assigning stage ids.
apache_beam.runners.dataflow.dataflow_runner: INFO: 2021-05-19T06:31:41.392Z: JOB_MESSAGE_DEBUG: Executing wait step start29
apache_beam.runners.dataflow.dataflow_runner: INFO: 2021-05-19T06:31:41.490Z: JOB_MESSAGE_BASIC: Executing operation Create/MaybeReshuffle/Reshuffle/ReshufflePerKey/GroupByKey/Create
apache_beam.runners.dataflow.dataflow_runner: INFO: 2021-05-19T06:31:41.513Z: JOB_MESSAGE_BASIC: Executing operation assert_that/Group/GroupByKey/Create
apache_beam.runners.dataflow.dataflow_runner: INFO: 2021-05-19T06:31:41.537Z: JOB_MESSAGE_DEBUG: Starting worker pool setup.
apache_beam.runners.dataflow.dataflow_runner: INFO: 2021-05-19T06:31:41.573Z: JOB_MESSAGE_BASIC: Starting 1 workers in us-central1-f...
apache_beam.runners.dataflow.dataflow_runner: INFO: 2021-05-19T06:31:41.621Z: JOB_MESSAGE_BASIC: Finished operation Create/MaybeReshuffle/Reshuffle/ReshufflePerKey/GroupByKey/Create
apache_beam.runners.dataflow.dataflow_runner: INFO: 2021-05-19T06:31:41.635Z: JOB_MESSAGE_BASIC: Finished operation assert_that/Group/GroupByKey/Create
apache_beam.runners.dataflow.dataflow_runner: INFO: 2021-05-19T06:31:41.675Z: JOB_MESSAGE_DEBUG: Value "Create/MaybeReshuffle/Reshuffle/ReshufflePerKey/GroupByKey/Session" materialized.
apache_beam.runners.dataflow.dataflow_runner: INFO: 2021-05-19T06:31:41.708Z: JOB_MESSAGE_DEBUG: Value "assert_that/Group/GroupByKey/Session" materialized.
apache_beam.runners.dataflow.dataflow_runner: INFO: 2021-05-19T06:31:41.741Z: JOB_MESSAGE_BASIC: Executing operation Create/Impulse+Create/FlatMap(<lambda at core.py:2939>)+Create/MaybeReshuffle/Reshuffle/AddRandomKeys+Create/MaybeReshuffle/Reshuffle/ReshufflePerKey/Map(reify_timestamps)+Create/MaybeReshuffle/Reshuffle/ReshufflePerKey/GroupByKey/Reify+Create/MaybeReshuffle/Reshuffle/ReshufflePerKey/GroupByKey/Write
apache_beam.runners.dataflow.dataflow_runner: INFO: 2021-05-19T06:31:41.766Z: JOB_MESSAGE_BASIC: Executing operation assert_that/Create/Impulse+assert_that/Create/FlatMap(<lambda at core.py:2939>)+assert_that/Create/Map(decode)+assert_that/Group/pair_with_0+assert_that/Group/Flatten/OutputIdentity+assert_that/Group/GroupByKey/Write
apache_beam.runners.dataflow.dataflow_runner: INFO: 2021-05-19T06:31:50.164Z: JOB_MESSAGE_BASIC: Your project already contains 100 Dataflow-created metric descriptors, so new user metrics of the form custom.googleapis.com/* will not be created. However, all user metrics are also available in the metric dataflow.googleapis.com/job/user_counter. If you rely on the custom metrics, you can delete old / unused metric descriptors. See https://developers.google.com/apis-explorer/#p/monitoring/v3/monitoring.projects.metricDescriptors.list and https://developers.google.com/apis-explorer/#p/monitoring/v3/monitoring.projects.metricDescriptors.delete
apache_beam.runners.dataflow.dataflow_runner: INFO: 2021-05-19T06:33:21.539Z: JOB_MESSAGE_DETAILED: Autoscaling: Raised the number of workers to 1 based on the rate of progress in the currently running stage(s).
apache_beam.runners.dataflow.dataflow_runner: INFO: 2021-05-19T06:33:53.414Z: JOB_MESSAGE_DETAILED: Workers have started successfully.
apache_beam.runners.dataflow.dataflow_runner: INFO: 2021-05-19T06:33:53.444Z: JOB_MESSAGE_DETAILED: Workers have started successfully.
oauth2client.transport: INFO: Refreshing due to a 401 (attempt 1/2)
apache_beam.runners.dataflow.dataflow_runner: INFO: 2021-05-19T07:31:41.825Z: JOB_MESSAGE_ERROR: Workflow failed. Causes: The Dataflow job appears to be stuck because no worker activity has been seen in the last 1h. Please check the worker logs in Stackdriver Logging. You can also get help with Cloud Dataflow at https://cloud.google.com/dataflow/support.
apache_beam.runners.dataflow.dataflow_runner: INFO: 2021-05-19T07:31:42.079Z: JOB_MESSAGE_BASIC: Cancel request is committed for workflow job: 2021-05-18_23_31_02-4084773158025253804.
apache_beam.runners.dataflow.dataflow_runner: INFO: 2021-05-19T07:31:42.099Z: JOB_MESSAGE_BASIC: Finished operation Create/Impulse+Create/FlatMap(<lambda at core.py:2939>)+Create/MaybeReshuffle/Reshuffle/AddRandomKeys+Create/MaybeReshuffle/Reshuffle/ReshufflePerKey/Map(reify_timestamps)+Create/MaybeReshuffle/Reshuffle/ReshufflePerKey/GroupByKey/Reify+Create/MaybeReshuffle/Reshuffle/ReshufflePerKey/GroupByKey/Write
apache_beam.runners.dataflow.dataflow_runner: INFO: 2021-05-19T07:31:42.099Z: JOB_MESSAGE_BASIC: Finished operation assert_that/Create/Impulse+assert_that/Create/FlatMap(<lambda at core.py:2939>)+assert_that/Create/Map(decode)+assert_that/Group/pair_with_0+assert_that/Group/Flatten/OutputIdentity+assert_that/Group/GroupByKey/Write
apache_beam.runners.dataflow.dataflow_runner: INFO: 2021-05-19T07:31:42.349Z: JOB_MESSAGE_DETAILED: Cleaning up.
apache_beam.runners.dataflow.dataflow_runner: INFO: 2021-05-19T07:31:42.418Z: JOB_MESSAGE_DEBUG: Starting worker pool teardown.
apache_beam.runners.dataflow.dataflow_runner: INFO: 2021-05-19T07:31:42.450Z: JOB_MESSAGE_BASIC: Stopping worker pool...
apache_beam.runners.dataflow.dataflow_runner: INFO: 2021-05-19T07:32:33.521Z: JOB_MESSAGE_DETAILED: Autoscaling: Resized worker pool from 1 to 0.
apache_beam.runners.dataflow.dataflow_runner: INFO: 2021-05-19T07:32:33.630Z: JOB_MESSAGE_BASIC: Worker pool stopped.
apache_beam.runners.dataflow.dataflow_runner: INFO: 2021-05-19T07:32:33.685Z: JOB_MESSAGE_DEBUG: Tearing down pending resources...
apache_beam.runners.dataflow.dataflow_runner: INFO: Job 2021-05-18_23_31_02-4084773158025253804 is in state JOB_STATE_FAILED
--------------------- >> end captured logging << ---------------------
Worker logs: https://console.cloud.google.com/dataflow/jobs/us-central1/2021-05-18_23_31_01-11247048821576541071?project=apache-beam-testing
Worker logs: https://console.cloud.google.com/dataflow/jobs/us-central1/2021-05-18_23_31_01-11726197060240071212?project=apache-beam-testing
Worker logs: https://console.cloud.google.com/dataflow/jobs/us-central1/2021-05-18_23_31_01-10991972106534450426?project=apache-beam-testing
Worker logs: https://console.cloud.google.com/dataflow/jobs/us-central1/2021-05-18_23_31_03-9785154622082369932?project=apache-beam-testing
Worker logs: https://console.cloud.google.com/dataflow/jobs/us-central1/2021-05-18_23_31_02-6536170366906417620?project=apache-beam-testing
Worker logs: https://console.cloud.google.com/dataflow/jobs/us-central1/2021-05-18_23_31_01-13769568920635800797?project=apache-beam-testing
Worker logs: https://console.cloud.google.com/dataflow/jobs/us-central1/2021-05-18_23_31_02-7089707021383286258?project=apache-beam-testing
Worker logs: https://console.cloud.google.com/dataflow/jobs/us-central1/2021-05-18_23_31_02-4084773158025253804?project=apache-beam-testing
----------------------------------------------------------------------
XML: nosetests-xlangValidateRunner.xml
----------------------------------------------------------------------
XML: <https://ci-beam.apache.org/job/beam_PostCommit_XVR_Dataflow/ws/src/sdks/python/nosetests.xml>
----------------------------------------------------------------------
Ran 8 tests in 3722.706s
FAILED (errors=1)
> Task :runners:google-cloud-dataflow-java:validatesCrossLanguageRunnerPythonUsingJava FAILED
> Task :runners:google-cloud-dataflow-java:validatesCrossLanguageRunnerCleanup
Stopping expansion service pid: 8354.
Stopping expansion service pid: 8357.
> Task :runners:google-cloud-dataflow-java:cleanUpDockerImages
Untagged: us.gcr.io/apache-beam-testing/java-postcommit-it/java:20210519062416
Untagged: us.gcr.io/apache-beam-testing/java-postcommit-it/java@sha256:bf6718f9adc71de0f63d8cccff021e970fe1901a26469336a6b63a3b4aa3d310
Digests:
- us.gcr.io/apache-beam-testing/java-postcommit-it/java@sha256:bf6718f9adc71de0f63d8cccff021e970fe1901a26469336a6b63a3b4aa3d310
Associated tags:
- 20210519062416
Tags:
- us.gcr.io/apache-beam-testing/java-postcommit-it/java:20210519062416
Deleted [us.gcr.io/apache-beam-testing/java-postcommit-it/java:20210519062416].
Deleted [us.gcr.io/apache-beam-testing/java-postcommit-it/java@sha256:bf6718f9adc71de0f63d8cccff021e970fe1901a26469336a6b63a3b4aa3d310].
FAILURE: Build failed with an exception.
* What went wrong:
Execution failed for task ':runners:google-cloud-dataflow-java:validatesCrossLanguageRunnerPythonUsingJava'.
> Process 'command 'sh'' finished with non-zero exit value 1
* Try:
Run with --stacktrace option to get the stack trace. Run with --info or --debug option to get more log output. Run with --scan to get full insights.
* Get more help at https://help.gradle.org
Deprecated Gradle features were used in this build, making it incompatible with Gradle 7.0.
Use '--warning-mode all' to show the individual deprecation warnings.
See https://docs.gradle.org/6.8.3/userguide/command_line_interface.html#sec:command_line_warnings
BUILD FAILED in 1h 8m 36s
103 actionable tasks: 29 executed, 74 up-to-date
Publishing build scan...
https://gradle.com/s/j33furjvjc4qk
Build step 'Invoke Gradle script' changed build result to FAILURE
Build step 'Invoke Gradle script' marked build as failure
---------------------------------------------------------------------
To unsubscribe, e-mail: builds-unsubscribe@beam.apache.org
For additional commands, e-mail: builds-help@beam.apache.org
Jenkins build is back to normal : beam_PostCommit_XVR_Dataflow #744
Posted by Apache Jenkins Server <je...@builds.apache.org>.
See <https://ci-beam.apache.org/job/beam_PostCommit_XVR_Dataflow/744/display/redirect?page=changes>
---------------------------------------------------------------------
To unsubscribe, e-mail: builds-unsubscribe@beam.apache.org
For additional commands, e-mail: builds-help@beam.apache.org
Build failed in Jenkins: beam_PostCommit_XVR_Dataflow #743
Posted by Apache Jenkins Server <je...@builds.apache.org>.
See <https://ci-beam.apache.org/job/beam_PostCommit_XVR_Dataflow/743/display/redirect>
Changes:
------------------------------------------
[...truncated 662.24 KB...]
return self.pipeline.apply(ptransform, self)
File "<https://ci-beam.apache.org/job/beam_PostCommit_XVR_Dataflow/ws/src/sdks/python/apache_beam/pipeline.py",> line 694, in apply
pvalueish_result = self.runner.apply(transform, pvalueish, self._options)
File "<https://ci-beam.apache.org/job/beam_PostCommit_XVR_Dataflow/ws/src/sdks/python/apache_beam/runners/dataflow/dataflow_runner.py",> line 141, in apply
return super(DataflowRunner, self).apply(transform, input, options)
File "<https://ci-beam.apache.org/job/beam_PostCommit_XVR_Dataflow/ws/src/sdks/python/apache_beam/runners/runner.py",> line 185, in apply
return m(transform, input, options)
File "<https://ci-beam.apache.org/job/beam_PostCommit_XVR_Dataflow/ws/src/sdks/python/apache_beam/runners/runner.py",> line 215, in apply_PTransform
return transform.expand(input)
File "<https://ci-beam.apache.org/job/beam_PostCommit_XVR_Dataflow/ws/src/sdks/python/apache_beam/transforms/external.py",> line 295, in expand
response = service.Expand(request)
File "<https://ci-beam.apache.org/job/beam_PostCommit_XVR_Dataflow/ws/src/build/gradleenv/1922375555/lib/python3.6/site-packages/grpc/_channel.py",> line 946, in __call__
return _end_unary_response_blocking(state, call, False, None)
File "<https://ci-beam.apache.org/job/beam_PostCommit_XVR_Dataflow/ws/src/build/gradleenv/1922375555/lib/python3.6/site-packages/grpc/_channel.py",> line 849, in _end_unary_response_blocking
raise _InactiveRpcError(state)
grpc._channel._InactiveRpcError: <_InactiveRpcError of RPC that terminated with:
status = StatusCode.UNIMPLEMENTED
details = "Method not found: org.apache.beam.model.expansion.v1.ExpansionService/Expand"
debug_error_string = "{"created":"@1621426384.050456392","description":"Error received from peer ipv4:127.0.0.1:18091","file":"src/core/lib/surface/call.cc","file_line":1067,"grpc_message":"Method not found: org.apache.beam.model.expansion.v1.ExpansionService/Expand","grpc_status":12}"
>
======================================================================
ERROR: test_combine_globally (apache_beam.transforms.validate_runner_xlang_test.ValidateRunnerXlangTest)
----------------------------------------------------------------------
Traceback (most recent call last):
File "<https://ci-beam.apache.org/job/beam_PostCommit_XVR_Dataflow/ws/src/sdks/python/apache_beam/transforms/validate_runner_xlang_test.py",> line 270, in test_combine_globally
test_pipeline or self.create_pipeline())
File "<https://ci-beam.apache.org/job/beam_PostCommit_XVR_Dataflow/ws/src/sdks/python/apache_beam/transforms/validate_runner_xlang_test.py",> line 181, in run_combine_globally
TEST_COMGL_URN, None, self.expansion_service))
File "<https://ci-beam.apache.org/job/beam_PostCommit_XVR_Dataflow/ws/src/sdks/python/apache_beam/pvalue.py",> line 142, in __or__
return self.pipeline.apply(ptransform, self)
File "<https://ci-beam.apache.org/job/beam_PostCommit_XVR_Dataflow/ws/src/sdks/python/apache_beam/pipeline.py",> line 694, in apply
pvalueish_result = self.runner.apply(transform, pvalueish, self._options)
File "<https://ci-beam.apache.org/job/beam_PostCommit_XVR_Dataflow/ws/src/sdks/python/apache_beam/runners/dataflow/dataflow_runner.py",> line 141, in apply
return super(DataflowRunner, self).apply(transform, input, options)
File "<https://ci-beam.apache.org/job/beam_PostCommit_XVR_Dataflow/ws/src/sdks/python/apache_beam/runners/runner.py",> line 185, in apply
return m(transform, input, options)
File "<https://ci-beam.apache.org/job/beam_PostCommit_XVR_Dataflow/ws/src/sdks/python/apache_beam/runners/runner.py",> line 215, in apply_PTransform
return transform.expand(input)
File "<https://ci-beam.apache.org/job/beam_PostCommit_XVR_Dataflow/ws/src/sdks/python/apache_beam/transforms/external.py",> line 295, in expand
response = service.Expand(request)
File "<https://ci-beam.apache.org/job/beam_PostCommit_XVR_Dataflow/ws/src/build/gradleenv/1922375555/lib/python3.6/site-packages/grpc/_channel.py",> line 946, in __call__
return _end_unary_response_blocking(state, call, False, None)
File "<https://ci-beam.apache.org/job/beam_PostCommit_XVR_Dataflow/ws/src/build/gradleenv/1922375555/lib/python3.6/site-packages/grpc/_channel.py",> line 849, in _end_unary_response_blocking
raise _InactiveRpcError(state)
grpc._channel._InactiveRpcError: <_InactiveRpcError of RPC that terminated with:
status = StatusCode.UNIMPLEMENTED
details = "Method not found: org.apache.beam.model.expansion.v1.ExpansionService/Expand"
debug_error_string = "{"created":"@1621426384.050456329","description":"Error received from peer ipv4:127.0.0.1:18091","file":"src/core/lib/surface/call.cc","file_line":1067,"grpc_message":"Method not found: org.apache.beam.model.expansion.v1.ExpansionService/Expand","grpc_status":12}"
>
======================================================================
ERROR: test_partition (apache_beam.transforms.validate_runner_xlang_test.ValidateRunnerXlangTest)
----------------------------------------------------------------------
Traceback (most recent call last):
File "<https://ci-beam.apache.org/job/beam_PostCommit_XVR_Dataflow/ws/src/sdks/python/apache_beam/transforms/validate_runner_xlang_test.py",> line 282, in test_partition
test_pipeline or self.create_pipeline())
File "<https://ci-beam.apache.org/job/beam_PostCommit_XVR_Dataflow/ws/src/sdks/python/apache_beam/transforms/validate_runner_xlang_test.py",> line 235, in run_partition
TEST_PARTITION_URN, None, self.expansion_service))
File "<https://ci-beam.apache.org/job/beam_PostCommit_XVR_Dataflow/ws/src/sdks/python/apache_beam/pvalue.py",> line 142, in __or__
return self.pipeline.apply(ptransform, self)
File "<https://ci-beam.apache.org/job/beam_PostCommit_XVR_Dataflow/ws/src/sdks/python/apache_beam/pipeline.py",> line 694, in apply
pvalueish_result = self.runner.apply(transform, pvalueish, self._options)
File "<https://ci-beam.apache.org/job/beam_PostCommit_XVR_Dataflow/ws/src/sdks/python/apache_beam/runners/dataflow/dataflow_runner.py",> line 141, in apply
return super(DataflowRunner, self).apply(transform, input, options)
File "<https://ci-beam.apache.org/job/beam_PostCommit_XVR_Dataflow/ws/src/sdks/python/apache_beam/runners/runner.py",> line 185, in apply
return m(transform, input, options)
File "<https://ci-beam.apache.org/job/beam_PostCommit_XVR_Dataflow/ws/src/sdks/python/apache_beam/runners/runner.py",> line 215, in apply_PTransform
return transform.expand(input)
File "<https://ci-beam.apache.org/job/beam_PostCommit_XVR_Dataflow/ws/src/sdks/python/apache_beam/transforms/external.py",> line 295, in expand
response = service.Expand(request)
File "<https://ci-beam.apache.org/job/beam_PostCommit_XVR_Dataflow/ws/src/build/gradleenv/1922375555/lib/python3.6/site-packages/grpc/_channel.py",> line 946, in __call__
return _end_unary_response_blocking(state, call, False, None)
File "<https://ci-beam.apache.org/job/beam_PostCommit_XVR_Dataflow/ws/src/build/gradleenv/1922375555/lib/python3.6/site-packages/grpc/_channel.py",> line 849, in _end_unary_response_blocking
raise _InactiveRpcError(state)
grpc._channel._InactiveRpcError: <_InactiveRpcError of RPC that terminated with:
status = StatusCode.UNIMPLEMENTED
details = "Method not found: org.apache.beam.model.expansion.v1.ExpansionService/Expand"
debug_error_string = "{"created":"@1621426384.050709914","description":"Error received from peer ipv4:127.0.0.1:18091","file":"src/core/lib/surface/call.cc","file_line":1067,"grpc_message":"Method not found: org.apache.beam.model.expansion.v1.ExpansionService/Expand","grpc_status":12}"
>
======================================================================
ERROR: test_prefix (apache_beam.transforms.validate_runner_xlang_test.ValidateRunnerXlangTest)
----------------------------------------------------------------------
Traceback (most recent call last):
File "<https://ci-beam.apache.org/job/beam_PostCommit_XVR_Dataflow/ws/src/sdks/python/apache_beam/transforms/validate_runner_xlang_test.py",> line 254, in test_prefix
test_pipeline or self.create_pipeline())
File "<https://ci-beam.apache.org/job/beam_PostCommit_XVR_Dataflow/ws/src/sdks/python/apache_beam/transforms/validate_runner_xlang_test.py",> line 98, in run_prefix
self.expansion_service))
File "<https://ci-beam.apache.org/job/beam_PostCommit_XVR_Dataflow/ws/src/sdks/python/apache_beam/pvalue.py",> line 142, in __or__
return self.pipeline.apply(ptransform, self)
File "<https://ci-beam.apache.org/job/beam_PostCommit_XVR_Dataflow/ws/src/sdks/python/apache_beam/pipeline.py",> line 694, in apply
pvalueish_result = self.runner.apply(transform, pvalueish, self._options)
File "<https://ci-beam.apache.org/job/beam_PostCommit_XVR_Dataflow/ws/src/sdks/python/apache_beam/runners/dataflow/dataflow_runner.py",> line 141, in apply
return super(DataflowRunner, self).apply(transform, input, options)
File "<https://ci-beam.apache.org/job/beam_PostCommit_XVR_Dataflow/ws/src/sdks/python/apache_beam/runners/runner.py",> line 185, in apply
return m(transform, input, options)
File "<https://ci-beam.apache.org/job/beam_PostCommit_XVR_Dataflow/ws/src/sdks/python/apache_beam/runners/runner.py",> line 215, in apply_PTransform
return transform.expand(input)
File "<https://ci-beam.apache.org/job/beam_PostCommit_XVR_Dataflow/ws/src/sdks/python/apache_beam/transforms/external.py",> line 295, in expand
response = service.Expand(request)
File "<https://ci-beam.apache.org/job/beam_PostCommit_XVR_Dataflow/ws/src/build/gradleenv/1922375555/lib/python3.6/site-packages/grpc/_channel.py",> line 946, in __call__
return _end_unary_response_blocking(state, call, False, None)
File "<https://ci-beam.apache.org/job/beam_PostCommit_XVR_Dataflow/ws/src/build/gradleenv/1922375555/lib/python3.6/site-packages/grpc/_channel.py",> line 849, in _end_unary_response_blocking
raise _InactiveRpcError(state)
grpc._channel._InactiveRpcError: <_InactiveRpcError of RPC that terminated with:
status = StatusCode.UNIMPLEMENTED
details = "Method not found: org.apache.beam.model.expansion.v1.ExpansionService/Expand"
debug_error_string = "{"created":"@1621426384.051195316","description":"Error received from peer ipv4:127.0.0.1:18091","file":"src/core/lib/surface/call.cc","file_line":1067,"grpc_message":"Method not found: org.apache.beam.model.expansion.v1.ExpansionService/Expand","grpc_status":12}"
>
======================================================================
ERROR: test_cogroup_by_key (apache_beam.transforms.validate_runner_xlang_test.ValidateRunnerXlangTest)
----------------------------------------------------------------------
Traceback (most recent call last):
File "<https://ci-beam.apache.org/job/beam_PostCommit_XVR_Dataflow/ws/src/sdks/python/apache_beam/transforms/validate_runner_xlang_test.py",> line 266, in test_cogroup_by_key
test_pipeline or self.create_pipeline())
File "<https://ci-beam.apache.org/job/beam_PostCommit_XVR_Dataflow/ws/src/sdks/python/apache_beam/transforms/validate_runner_xlang_test.py",> line 163, in run_cogroup_by_key
| beam.Map(lambda x: "{}:{}".format(x[0], ','.join(sorted(x[1])))))
File "<https://ci-beam.apache.org/job/beam_PostCommit_XVR_Dataflow/ws/src/sdks/python/apache_beam/transforms/ptransform.py",> line 601, in __ror__
result = p.apply(self, pvalueish, label)
File "<https://ci-beam.apache.org/job/beam_PostCommit_XVR_Dataflow/ws/src/sdks/python/apache_beam/pipeline.py",> line 694, in apply
pvalueish_result = self.runner.apply(transform, pvalueish, self._options)
File "<https://ci-beam.apache.org/job/beam_PostCommit_XVR_Dataflow/ws/src/sdks/python/apache_beam/runners/dataflow/dataflow_runner.py",> line 141, in apply
return super(DataflowRunner, self).apply(transform, input, options)
File "<https://ci-beam.apache.org/job/beam_PostCommit_XVR_Dataflow/ws/src/sdks/python/apache_beam/runners/runner.py",> line 185, in apply
return m(transform, input, options)
File "<https://ci-beam.apache.org/job/beam_PostCommit_XVR_Dataflow/ws/src/sdks/python/apache_beam/runners/runner.py",> line 215, in apply_PTransform
return transform.expand(input)
File "<https://ci-beam.apache.org/job/beam_PostCommit_XVR_Dataflow/ws/src/sdks/python/apache_beam/transforms/external.py",> line 295, in expand
response = service.Expand(request)
File "<https://ci-beam.apache.org/job/beam_PostCommit_XVR_Dataflow/ws/src/build/gradleenv/1922375555/lib/python3.6/site-packages/grpc/_channel.py",> line 946, in __call__
return _end_unary_response_blocking(state, call, False, None)
File "<https://ci-beam.apache.org/job/beam_PostCommit_XVR_Dataflow/ws/src/build/gradleenv/1922375555/lib/python3.6/site-packages/grpc/_channel.py",> line 849, in _end_unary_response_blocking
raise _InactiveRpcError(state)
grpc._channel._InactiveRpcError: <_InactiveRpcError of RPC that terminated with:
status = StatusCode.UNIMPLEMENTED
details = "Method not found: org.apache.beam.model.expansion.v1.ExpansionService/Expand"
debug_error_string = "{"created":"@1621426384.050483460","description":"Error received from peer ipv4:127.0.0.1:18091","file":"src/core/lib/surface/call.cc","file_line":1067,"grpc_message":"Method not found: org.apache.beam.model.expansion.v1.ExpansionService/Expand","grpc_status":12}"
>
======================================================================
ERROR: test_multi_input_output_with_sideinput (apache_beam.transforms.validate_runner_xlang_test.ValidateRunnerXlangTest)
----------------------------------------------------------------------
Traceback (most recent call last):
File "<https://ci-beam.apache.org/job/beam_PostCommit_XVR_Dataflow/ws/src/sdks/python/apache_beam/transforms/validate_runner_xlang_test.py",> line 258, in test_multi_input_output_with_sideinput
test_pipeline or self.create_pipeline())
File "<https://ci-beam.apache.org/job/beam_PostCommit_XVR_Dataflow/ws/src/sdks/python/apache_beam/transforms/validate_runner_xlang_test.py",> line 119, in run_multi_input_output_with_sideinput
TEST_MULTI_URN, None, self.expansion_service)
File "<https://ci-beam.apache.org/job/beam_PostCommit_XVR_Dataflow/ws/src/sdks/python/apache_beam/transforms/ptransform.py",> line 601, in __ror__
result = p.apply(self, pvalueish, label)
File "<https://ci-beam.apache.org/job/beam_PostCommit_XVR_Dataflow/ws/src/sdks/python/apache_beam/pipeline.py",> line 694, in apply
pvalueish_result = self.runner.apply(transform, pvalueish, self._options)
File "<https://ci-beam.apache.org/job/beam_PostCommit_XVR_Dataflow/ws/src/sdks/python/apache_beam/runners/dataflow/dataflow_runner.py",> line 141, in apply
return super(DataflowRunner, self).apply(transform, input, options)
File "<https://ci-beam.apache.org/job/beam_PostCommit_XVR_Dataflow/ws/src/sdks/python/apache_beam/runners/runner.py",> line 185, in apply
return m(transform, input, options)
File "<https://ci-beam.apache.org/job/beam_PostCommit_XVR_Dataflow/ws/src/sdks/python/apache_beam/runners/runner.py",> line 215, in apply_PTransform
return transform.expand(input)
File "<https://ci-beam.apache.org/job/beam_PostCommit_XVR_Dataflow/ws/src/sdks/python/apache_beam/transforms/external.py",> line 295, in expand
response = service.Expand(request)
File "<https://ci-beam.apache.org/job/beam_PostCommit_XVR_Dataflow/ws/src/build/gradleenv/1922375555/lib/python3.6/site-packages/grpc/_channel.py",> line 946, in __call__
return _end_unary_response_blocking(state, call, False, None)
File "<https://ci-beam.apache.org/job/beam_PostCommit_XVR_Dataflow/ws/src/build/gradleenv/1922375555/lib/python3.6/site-packages/grpc/_channel.py",> line 849, in _end_unary_response_blocking
raise _InactiveRpcError(state)
grpc._channel._InactiveRpcError: <_InactiveRpcError of RPC that terminated with:
status = StatusCode.UNIMPLEMENTED
details = "Method not found: org.apache.beam.model.expansion.v1.ExpansionService/Expand"
debug_error_string = "{"created":"@1621426384.050461716","description":"Error received from peer ipv4:127.0.0.1:18091","file":"src/core/lib/surface/call.cc","file_line":1067,"grpc_message":"Method not found: org.apache.beam.model.expansion.v1.ExpansionService/Expand","grpc_status":12}"
>
======================================================================
ERROR: test_generate_sequence (apache_beam.io.external.generate_sequence_test.XlangGenerateSequenceTest)
----------------------------------------------------------------------
Traceback (most recent call last):
File "<https://ci-beam.apache.org/job/beam_PostCommit_XVR_Dataflow/ws/src/sdks/python/apache_beam/io/external/generate_sequence_test.py",> line 48, in test_generate_sequence
| GenerateSequence(start=1, stop=10, expansion_service=address))
File "<https://ci-beam.apache.org/job/beam_PostCommit_XVR_Dataflow/ws/src/sdks/python/apache_beam/transforms/ptransform.py",> line 601, in __ror__
result = p.apply(self, pvalueish, label)
File "<https://ci-beam.apache.org/job/beam_PostCommit_XVR_Dataflow/ws/src/sdks/python/apache_beam/pipeline.py",> line 694, in apply
pvalueish_result = self.runner.apply(transform, pvalueish, self._options)
File "<https://ci-beam.apache.org/job/beam_PostCommit_XVR_Dataflow/ws/src/sdks/python/apache_beam/runners/dataflow/dataflow_runner.py",> line 141, in apply
return super(DataflowRunner, self).apply(transform, input, options)
File "<https://ci-beam.apache.org/job/beam_PostCommit_XVR_Dataflow/ws/src/sdks/python/apache_beam/runners/runner.py",> line 185, in apply
return m(transform, input, options)
File "<https://ci-beam.apache.org/job/beam_PostCommit_XVR_Dataflow/ws/src/sdks/python/apache_beam/runners/runner.py",> line 215, in apply_PTransform
return transform.expand(input)
File "<https://ci-beam.apache.org/job/beam_PostCommit_XVR_Dataflow/ws/src/sdks/python/apache_beam/transforms/external.py",> line 295, in expand
response = service.Expand(request)
File "<https://ci-beam.apache.org/job/beam_PostCommit_XVR_Dataflow/ws/src/build/gradleenv/1922375555/lib/python3.6/site-packages/grpc/_channel.py",> line 946, in __call__
return _end_unary_response_blocking(state, call, False, None)
File "<https://ci-beam.apache.org/job/beam_PostCommit_XVR_Dataflow/ws/src/build/gradleenv/1922375555/lib/python3.6/site-packages/grpc/_channel.py",> line 849, in _end_unary_response_blocking
raise _InactiveRpcError(state)
grpc._channel._InactiveRpcError: <_InactiveRpcError of RPC that terminated with:
status = StatusCode.UNIMPLEMENTED
details = "Method not found: org.apache.beam.model.expansion.v1.ExpansionService/Expand"
debug_error_string = "{"created":"@1621426384.052049885","description":"Error received from peer ipv4:127.0.0.1:18091","file":"src/core/lib/surface/call.cc","file_line":1067,"grpc_message":"Method not found: org.apache.beam.model.expansion.v1.ExpansionService/Expand","grpc_status":12}"
>
----------------------------------------------------------------------
XML: nosetests-xlangValidateRunner.xml
----------------------------------------------------------------------
XML: <https://ci-beam.apache.org/job/beam_PostCommit_XVR_Dataflow/ws/src/sdks/python/nosetests.xml>
----------------------------------------------------------------------
Ran 8 tests in 5.782s
FAILED (errors=8)
> Task :runners:google-cloud-dataflow-java:validatesCrossLanguageRunnerPythonUsingJava FAILED
> Task :runners:google-cloud-dataflow-java:validatesCrossLanguageRunnerCleanup
Skipping invalid pid: 12827.
Stopping expansion service pid: 12830.
> Task :runners:google-cloud-dataflow-java:cleanUpDockerImages
Untagged: us.gcr.io/apache-beam-testing/java-postcommit-it/java:20210519120047
Untagged: us.gcr.io/apache-beam-testing/java-postcommit-it/java@sha256:c172555b9509f6b90270d94d25507bc2f00c74e74a7a68b80aa1d4a1a03e622a
Digests:
- us.gcr.io/apache-beam-testing/java-postcommit-it/java@sha256:c172555b9509f6b90270d94d25507bc2f00c74e74a7a68b80aa1d4a1a03e622a
Associated tags:
- 20210519120047
Tags:
- us.gcr.io/apache-beam-testing/java-postcommit-it/java:20210519120047
Deleted [us.gcr.io/apache-beam-testing/java-postcommit-it/java:20210519120047].
Deleted [us.gcr.io/apache-beam-testing/java-postcommit-it/java@sha256:c172555b9509f6b90270d94d25507bc2f00c74e74a7a68b80aa1d4a1a03e622a].
FAILURE: Build failed with an exception.
* What went wrong:
Execution failed for task ':runners:google-cloud-dataflow-java:validatesCrossLanguageRunnerPythonUsingJava'.
> Process 'command 'sh'' finished with non-zero exit value 1
* Try:
Run with --stacktrace option to get the stack trace. Run with --info or --debug option to get more log output. Run with --scan to get full insights.
* Get more help at https://help.gradle.org
Deprecated Gradle features were used in this build, making it incompatible with Gradle 7.0.
Use '--warning-mode all' to show the individual deprecation warnings.
See https://docs.gradle.org/6.8.3/userguide/command_line_interface.html#sec:command_line_warnings
BUILD FAILED in 12m 44s
113 actionable tasks: 84 executed, 25 from cache, 4 up-to-date
Publishing build scan...
https://gradle.com/s/dardud73zewn4
Build step 'Invoke Gradle script' changed build result to FAILURE
Build step 'Invoke Gradle script' marked build as failure
---------------------------------------------------------------------
To unsubscribe, e-mail: builds-unsubscribe@beam.apache.org
For additional commands, e-mail: builds-help@beam.apache.org