You are viewing a plain text version of this content. The canonical link for it is here.
Posted to builds@cassandra.apache.org by Apache Jenkins Server <je...@builds.apache.org> on 2022/11/05 23:27:02 UTC

Build complete: Cassandra-4.1 #202 [UNSTABLE] 2695bf7d381deffc1e056970553a22e65531820f

-------------------------------------------------------------------------------
Build Cassandra-4.1 #202 Still unstable
URL: https://ci-cassandra.apache.org/job/Cassandra-4.1/202/
-------------------------------------------------------------------------------
Changes:
[Michael Semb Wever] ninja-fix antcall maybe-build-test needs inheritRefs (CASSANDRA-18000)


-------------------------------------------------------------------------------
Failed Tests:
9 tests failed.
FAILED:  dtest-novnode.cdc_test.TestCDC.test_insertion_and_commitlog_behavior_after_reaching_cdc_total_space
FAILED:  dtest-upgrade.upgrade_tests.upgrade_through_versions_test.TestUpgrade_indev_4_0_x_To_indev_4_1_x.test_bootstrap_multidc
FAILED:  dtest-upgrade.upgrade_tests.upgrade_through_versions_test.TestProtoV3Upgrade_AllVersions_RandomPartitioner_EndsAt_3_11_X_HEAD.test_parallel_upgrade
FAILED:  dtest-upgrade.upgrade_tests.upgrade_through_versions_test.TestProtoV4Upgrade_AllVersions_EndsAt_Trunk_HEAD.test_parallel_upgrade_with_internode_ssl
FAILED:  dtest-upgrade.upgrade_tests.upgrade_through_versions_test.TestUpgrade_current_3_0_x_To_indev_4_1_x.test_bootstrap_multidc
FAILED:  org.apache.cassandra.distributed.upgrade.MixedModeMessageForwardTest.checkWritesForwardedToOtherDcTest
FAILED:  org.apache.cassandra.distributed.test.CASTest.fastReadsAndFailedWrites
FAILED:  org.apache.cassandra.distributed.test.NetstatsRepairStreamingTest.testWithCompressionEnabled
FAILED:  org.apache.cassandra.net.ProxyHandlerConnectionsTest.testExpireSome-compression

-------------------------------------------------------------------------------
For complete test report and logs see https://nightlies.apache.org/cassandra/Cassandra-4.1/202/