You are viewing a plain text version of this content. The canonical link for it is here.
Posted to notifications@maven.apache.org by Apache Jenkins Server <je...@builds.apache.org> on 2014/07/12 21:33:49 UTC
Build failed in Jenkins: maven-plugins #1993
See <https://builds.apache.org/job/maven-plugins/1993/changes>
Changes:
[hboutemy] [MSITE-724] site:jar fails when setting custom archive manifest entry
------------------------------------------
Started by an SCM change
Building remotely on ubuntu-1 (Ubuntu ubuntu) in workspace <https://builds.apache.org/job/maven-plugins/ws/>
Updating http://svn.apache.org/repos/asf/maven/plugins/trunk at revision '2014-07-12T19:28:34.621 +0000'
U maven-site-plugin/src/it/site-jar/pom.xml
U maven-site-plugin/pom.xml
At revision 1610025
Parsing POMs
Modules changed, recalculating dependency graph
maven31-agent.jar already up to date
maven31-interceptor.jar already up to date
maven3-interceptor-commons.jar already up to date
[maven-plugins] $ /home/hudson/tools/java/latest1.6/bin/java -cp /home/jenkins/jenkins-slave/maven31-agent.jar:/home/jenkins/jenkins-slave/tools/hudson.tasks.Maven_MavenInstallation/maven-3.1.1/boot/plexus-classworlds-2.5.1.jar:/home/jenkins/jenkins-slave/tools/hudson.tasks.Maven_MavenInstallation/maven-3.1.1/conf/logging jenkins.maven3.agent.Maven31Main /home/jenkins/jenkins-slave/tools/hudson.tasks.Maven_MavenInstallation/maven-3.1.1 /home/jenkins/jenkins-slave/slave.jar /home/jenkins/jenkins-slave/maven31-interceptor.jar /home/jenkins/jenkins-slave/maven3-interceptor-commons.jar 40529
ERROR: Failed to parse POMs
java.io.IOException: Cannot run program "/home/hudson/tools/java/latest1.6/bin/java" (in directory "<https://builds.apache.org/job/maven-plugins/ws/")>: error=2, No such file or directory
at java.lang.ProcessBuilder.start(ProcessBuilder.java:1041)
at hudson.Proc$LocalProc.<init>(Proc.java:244)
at hudson.Proc$LocalProc.<init>(Proc.java:216)
at hudson.Launcher$LocalLauncher.launch(Launcher.java:773)
at hudson.Launcher$ProcStarter.start(Launcher.java:353)
at hudson.Launcher$RemoteLaunchCallable.call(Launcher.java:998)
at hudson.Launcher$RemoteLaunchCallable.call(Launcher.java:965)
at hudson.remoting.UserRequest.perform(UserRequest.java:118)
at hudson.remoting.UserRequest.perform(UserRequest.java:48)
at hudson.remoting.Request$2.run(Request.java:328)
at hudson.remoting.InterceptingExecutorService$1.call(InterceptingExecutorService.java:72)
at java.util.concurrent.FutureTask.run(FutureTask.java:262)
at java.util.concurrent.ThreadPoolExecutor.runWorker(ThreadPoolExecutor.java:1145)
at java.util.concurrent.ThreadPoolExecutor$Worker.run(ThreadPoolExecutor.java:615)
at java.lang.Thread.run(Thread.java:745)
Caused by: java.io.IOException: error=2, No such file or directory
at java.lang.UNIXProcess.forkAndExec(Native Method)
at java.lang.UNIXProcess.<init>(UNIXProcess.java:186)
at java.lang.ProcessImpl.start(ProcessImpl.java:130)
at java.lang.ProcessBuilder.start(ProcessBuilder.java:1022)
... 14 more
[WARNINGS] Skipping publisher since build result is FAILURE
Jenkins build is back to normal : maven-plugins #1994
Posted by Apache Jenkins Server <je...@builds.apache.org>.
See <https://builds.apache.org/job/maven-plugins/1994/>